[
  {
    "id": 250467,
    "nombre": "Pokemon Bois",
    "imagen": "https://images.igdb.com/igdb/image/upload/t_720p/co6j4i.jpg",
    "plataformas": [{ "abbrev": "PC", "name": "PC", "color": "brown" }],
    "generos": [
      { "name": "Role-playing (RPG)", "color": "default" },
      { "name": "Adventure", "color": "default" }
    ],
    "desarrollador": [{ "name": "S / I", "color": "default" }],
    "publicador": [{ "name": "S / I", "color": "default" }],
    "fecha": "02/03/2023"
  },
  {
    "id": 264130,
    "nombre": "Pokemon Daycare",
    "imagen": "https://images.igdb.com/igdb/image/upload/t_720p/co7k69.jpg",
    "plataformas": [{ "abbrev": "PC", "name": "PC", "color": "brown" }],
    "generos": [{ "name": "Role-playing (RPG)", "color": "default" }],
    "desarrollador": [{ "name": "Vendily", "color": "default" }],
    "publicador": [],
    "fecha": "11/09/2019"
  },
  {
    "id": 250199,
    "nombre": "Pokemon Flux",
    "imagen": "https://images.igdb.com/igdb/image/upload/t_720p/co7k62.jpg",
    "plataformas": [{ "abbrev": "PC", "name": "PC", "color": "brown" }],
    "generos": [
      { "name": "Role-playing (RPG)", "color": "default" },
      { "name": "Turn-based strategy (TBS)", "color": "default" },
      { "name": "Adventure", "color": "default" }
    ],
    "desarrollador": [{ "name": "S / I", "color": "default" }],
    "publicador": [{ "name": "S / I", "color": "default" }],
    "fecha": "S/I"
  },
  {
    "id": 266156,
    "nombre": "Pokemon Myth",
    "imagen": "https://images.igdb.com/igdb/image/upload/t_720p/co7k61.jpg",
    "plataformas": [{ "abbrev": "PC", "name": "PC", "color": "brown" }],
    "generos": [
      { "name": "Role-playing (RPG)", "color": "default" },
      { "name": "Turn-based strategy (TBS)", "color": "default" },
      { "name": "Adventure", "color": "default" }
    ],
    "desarrollador": [{ "name": "S / I", "color": "default" }],
    "publicador": [{ "name": "S / I", "color": "default" }],
    "fecha": "29/08/2023"
  },
  {
    "id": 272886,
    "nombre": "Pokemon Saiph 2",
    "imagen": "https://images.igdb.com/igdb/image/upload/t_720p/co7d73.jpg",
    "plataformas": [
      { "abbrev": "GBA", "name": "Game Boy Advance", "color": "red" }
    ],
    "generos": [
      { "name": "Role-playing (RPG)", "color": "default" },
      { "name": "Strategy", "color": "default" },
      { "name": "Adventure", "color": "default" }
    ],
    "desarrollador": [{ "name": "S / I", "color": "default" }],
    "publicador": [{ "name": "S / I", "color": "default" }],
    "fecha": "21/09/2023"
  },
  {
    "id": 2290,
    "nombre": "Pokémon Stadium 2",
    "imagen": "https://images.igdb.com/igdb/image/upload/t_720p/co4w07.jpg",
    "plataformas": [
      { "abbrev": "N64", "name": "Nintendo 64", "color": "red" },
      { "abbrev": "Switch", "name": "Nintendo Switch", "color": "red" }
    ],
    "generos": [
      { "name": "Simulator", "color": "default" },
      { "name": "Strategy", "color": "default" },
      { "name": "Turn-based strategy (TBS)", "color": "default" }
    ],
    "desarrollador": [
      { "name": "Nintendo EAD", "color": "default" },
      { "name": "HAL Laboratory", "color": "default" }
    ],
    "publicador": [
      { "name": "Gradiente", "color": "default" },
      { "name": "Nintendo", "color": "default" },
      { "name": "Nintendo", "color": "default" }
    ],
    "fecha": "13/12/2000"
  },
  {
    "id": 8353,
    "nombre": "Pokémon White Version 2",
    "imagen": "https://images.igdb.com/igdb/image/upload/t_720p/co1z8e.jpg",
    "plataformas": [{ "abbrev": "NDS", "name": "Nintendo DS", "color": "red" }],
    "generos": [
      { "name": "Role-playing (RPG)", "color": "default" },
      { "name": "Turn-based strategy (TBS)", "color": "default" },
      { "name": "Adventure", "color": "default" }
    ],
    "desarrollador": [{ "name": "Game Freak", "color": "default" }],
    "publicador": [
      { "name": "Nintendo", "color": "default" },
      { "name": "The Pokémon Company", "color": "default" }
    ],
    "fecha": "22/06/2012"
  },
  {
    "id": 275103,
    "nombre": "Shin Pokemon: Blue Version",
    "imagen": "https://images.igdb.com/igdb/image/upload/t_720p/co7k6p.jpg",
    "plataformas": [
      { "abbrev": "Game Boy", "name": "Otra plataforma", "color": "default" }
    ],
    "generos": [{ "name": "Role-playing (RPG)", "color": "default" }],
    "desarrollador": [{ "name": "JoJoBear13", "color": "default" }],
    "publicador": [],
    "fecha": "01/11/2023"
  },
  {
    "id": 275105,
    "nombre": "Shin Pokemon: Green Version",
    "imagen": "https://images.igdb.com/igdb/image/upload/t_720p/co7k6u.jpg",
    "plataformas": [
      { "abbrev": "Game Boy", "name": "Otra plataforma", "color": "default" }
    ],
    "generos": [{ "name": "Role-playing (RPG)", "color": "default" }],
    "desarrollador": [{ "name": "JoJoBear13", "color": "default" }],
    "publicador": [],
    "fecha": "01/11/2023"
  },
  {
    "id": 275104,
    "nombre": "Shin Pokemon: Red Version",
    "imagen": "https://images.igdb.com/igdb/image/upload/t_720p/co7k6q.jpg",
    "plataformas": [
      { "abbrev": "Game Boy", "name": "Otra plataforma", "color": "default" }
    ],
    "generos": [{ "name": "Role-playing (RPG)", "color": "default" }],
    "desarrollador": [{ "name": "JoJoBear13", "color": "default" }],
    "publicador": [],
    "fecha": "01/11/2023"
  }
]
