-------------------------------------------------------------------------------
Test set: com.example.demo.OsworksApiApplicationTests
-------------------------------------------------------------------------------
Tests run: 1, Failures: 0, Errors: 0, Skipped: 0, Time elapsed: 12.331 s - in com.example.demo.OsworksApiApplicationTests
