{
  "bomFormat": "CycloneDX",
  "specVersion": "1.4",
  "serialNumber": "urn:uuid:4bdecc9e-7cfc-483b-8f97-94970199b46b",
  "version": 1,
  "metadata": {
    "timestamp": "2022-05-04T18:53:35Z",
    "tools": [
      {
        "vendor": "GitLab",
        "name": "Gemnasium",
        "version": "not-configured"
      }
    ],
    "authors": [
      {
        "name": "GitLab",
        "email": "support@gitlab.com"
      }
    ],
    "properties": [
      {
        "name": "gitlab:dependency_scanning:input_file",
        "value": "setup.py"
      },
      {
        "name": "gitlab:dependency_scanning:package_manager",
        "value": "setuptools"
      }
    ]
  },
  "components": [
    {
      "name": "SecretStorage",
      "version": "3.3.2",
      "purl": "pkg:pypi/SecretStorage@3.3.2",
      "type": "library",
      "bom-ref": "pkg:pypi/SecretStorage@3.3.2"
    },
    {
      "name": "cffi",
      "version": "1.15.0",
      "purl": "pkg:pypi/cffi@1.15.0",
      "type": "library",
      "bom-ref": "pkg:pypi/cffi@1.15.0"
    },
    {
      "name": "cryptography",
      "version": "37.0.3",
      "purl": "pkg:pypi/cryptography@37.0.3",
      "type": "library",
      "bom-ref": "pkg:pypi/cryptography@37.0.3"
    },
    {
      "name": "importlib-metadata",
      "version": "4.12.0",
      "purl": "pkg:pypi/importlib-metadata@4.12.0",
      "type": "library",
      "bom-ref": "pkg:pypi/importlib-metadata@4.12.0"
    },
    {
      "name": "jeepney",
      "version": "0.8.0",
      "purl": "pkg:pypi/jeepney@0.8.0",
      "type": "library",
      "bom-ref": "pkg:pypi/jeepney@0.8.0"
    },
    {
      "name": "keyring",
      "version": "23.3.0",
      "purl": "pkg:pypi/keyring@23.3.0",
      "type": "library",
      "bom-ref": "pkg:pypi/keyring@23.3.0"
    },
    {
      "name": "pycparser",
      "version": "2.21",
      "purl": "pkg:pypi/pycparser@2.21",
      "type": "library",
      "bom-ref": "pkg:pypi/pycparser@2.21"
    },
    {
      "name": "test-project",
      "version": "0.0.1",
      "purl": "pkg:pypi/test-project@0.0.1",
      "type": "library",
      "bom-ref": "pkg:pypi/test-project@0.0.1"
    }
  ]
}
