[
  {
    "name": "crayons",
    "version": "0.1.2"
  },
  {
    "name": "delegator.py",
    "version": "0.0.7"
  },
  {
    "name": "packaging",
    "version": "16.8"
  },
  {
    "name": "pexpect",
    "version": "4.2.1"
  },
  {
    "name": "pytest",
    "version": "3.0.6"
  },
  {
    "name": "requirements",
    "version": "parser"
  },
  {
    "name": "setuptools",
    "version": "34.0.2"
  }
]