[
  {
    "name": "actionmailer",
    "version": "4.2.6"
  },
  {
    "name": "actionpack",
    "version": "4.2.6"
  },
  {
    "name": "actionview",
    "version": "4.2.6"
  },
  {
    "name": "activejob",
    "version": "4.2.6"
  },
  {
    "name": "activemodel",
    "version": "4.2.6"
  },
  {
    "name": "activerecord",
    "version": "4.2.6"
  },
  {
    "name": "activesupport",
    "version": "4.2.6"
  },
  {
    "name": "addressable",
    "version": "2.4.0"
  },
  {
    "name": "annotate",
    "version": "2.6.5"
  },
  {
    "name": "arel",
    "version": "6.0.3"
  },
  {
    "name": "autoprefixer-rails",
    "version": "6.3.4"
  },
  {
    "name": "awesome_print",
    "version": "1.6.1"
  },
  {
    "name": "babel-source",
    "version": "5.8.35"
  },
  {
    "name": "babel-transpiler",
    "version": "0.7.0"
  },
  {
    "name": "bcrypt",
    "version": "3.1.11"
  },
  {
    "name": "binding_of_caller",
    "version": "0.7.2"
  },
  {
    "name": "bonsai-elasticsearch-rails",
    "version": "0.0.4"
  },
  {
    "name": "bootstrap-sass",
    "version": "3.3.6"
  },
  {
    "name": "builder",
    "version": "3.2.2"
  },
  {
    "name": "bullet",
    "version": "5.0.0"
  },
  {
    "name": "bundler-audit",
    "version": "0.5.0"
  },
  {
    "name": "byebug",
    "version": "8.2.2"
  },
  {
    "name": "capybara",
    "version": "2.5.0"
  },
  {
    "name": "carrierwave",
    "version": "0.10.0"
  },
  {
    "name": "childprocess",
    "version": "0.5.9"
  },
  {
    "name": "cliver",
    "version": "0.3.2"
  },
  {
    "name": "code_analyzer",
    "version": "0.4.5"
  },
  {
    "name": "coderay",
    "version": "1.1.1"
  },
  {
    "name": "coffee-rails",
    "version": "4.1.1"
  },
  {
    "name": "coffee-script",
    "version": "2.4.1"
  },
  {
    "name": "coffee-script-source",
    "version": "1.10.0"
  },
  {
    "name": "concurrent-ruby",
    "version": "1.0.1"
  },
  {
    "name": "connection_pool",
    "version": "2.2.0"
  },
  {
    "name": "dalli",
    "version": "2.7.6"
  },
  {
    "name": "database_cleaner",
    "version": "1.5.1"
  },
  {
    "name": "debug_inspector",
    "version": "0.0.2"
  },
  {
    "name": "devise",
    "version": "3.5.6"
  },
  {
    "name": "diff-lcs",
    "version": "1.2.5"
  },
  {
    "name": "elasticsearch",
    "version": "1.0.15"
  },
  {
    "name": "elasticsearch-api",
    "version": "1.0.15"
  },
  {
    "name": "elasticsearch-model",
    "version": "0.1.8"
  },
  {
    "name": "elasticsearch-rails",
    "version": "0.1.8"
  },
  {
    "name": "elasticsearch-transport",
    "version": "1.0.15"
  },
  {
    "name": "erubis",
    "version": "2.7.0"
  },
  {
    "name": "excon",
    "version": "0.48.0"
  },
  {
    "name": "execjs",
    "version": "2.6.0"
  },
  {
    "name": "factory_girl",
    "version": "4.5.0"
  },
  {
    "name": "factory_girl_rails",
    "version": "4.5.0"
  },
  {
    "name": "faker",
    "version": "1.6.3"
  },
  {
    "name": "faraday",
    "version": "0.9.2"
  },
  {
    "name": "ffi",
    "version": "1.9.10"
  },
  {
    "name": "fog",
    "version": "1.23.0"
  },
  {
    "name": "fog-brightbox",
    "version": "0.10.1"
  },
  {
    "name": "fog-core",
    "version": "1.36.0"
  },
  {
    "name": "fog-json",
    "version": "1.0.2"
  },
  {
    "name": "fog-softlayer",
    "version": "1.1.0"
  },
  {
    "name": "font-awesome-sass",
    "version": "4.5.0"
  },
  {
    "name": "formatador",
    "version": "0.2.5"
  },
  {
    "name": "friendly_id",
    "version": "5.1.0"
  },
  {
    "name": "globalid",
    "version": "0.3.6"
  },
  {
    "name": "guard",
    "version": "2.13.0"
  },
  {
    "name": "guard-compat",
    "version": "1.2.1"
  },
  {
    "name": "guard-rspec",
    "version": "4.6.4"
  },
  {
    "name": "hashie",
    "version": "3.4.3"
  },
  {
    "name": "i18n",
    "version": "0.7.0"
  },
  {
    "name": "inflecto",
    "version": "0.0.2"
  },
  {
    "name": "ipaddress",
    "version": "0.8.3"
  },
  {
    "name": "jbuilder",
    "version": "2.4.1"
  },
  {
    "name": "jquery-rails",
    "version": "4.1.1"
  },
  {
    "name": "jquery-ui-rails",
    "version": "5.0.5"
  },
  {
    "name": "json",
    "version": "1.8.3"
  },
  {
    "name": "jwt",
    "version": "1.5.1"
  },
  {
    "name": "launchy",
    "version": "2.4.3"
  },
  {
    "name": "listen",
    "version": "3.0.6"
  },
  {
    "name": "loofah",
    "version": "2.0.3"
  },
  {
    "name": "lumberjack",
    "version": "1.0.10"
  },
  {
    "name": "mail",
    "version": "2.6.4"
  },
  {
    "name": "method_source",
    "version": "0.8.2"
  },
  {
    "name": "mime-types",
    "version": "3.0"
  },
  {
    "name": "mime-types-data",
    "version": "3.2016.0221"
  },
  {
    "name": "mini_magick",
    "version": "3.8.0"
  },
  {
    "name": "mini_portile2",
    "version": "2.0.0"
  },
  {
    "name": "minitest",
    "version": "5.8.4"
  },
  {
    "name": "multi_json",
    "version": "1.11.2"
  },
  {
    "name": "multi_xml",
    "version": "0.5.5"
  },
  {
    "name": "multipart-post",
    "version": "2.0.0"
  },
  {
    "name": "nenv",
    "version": "0.3.0"
  },
  {
    "name": "net-ssh",
    "version": "3.1.1"
  },
  {
    "name": "nokogiri",
    "version": "1.6.7.2"
  },
  {
    "name": "notiffany",
    "version": "0.0.8"
  },
  {
    "name": "oauth",
    "version": "0.5.1"
  },
  {
    "name": "oauth2",
    "version": "1.1.0"
  },
  {
    "name": "omniauth",
    "version": "1.3.1"
  },
  {
    "name": "omniauth-facebook",
    "version": "3.0.0"
  },
  {
    "name": "omniauth-google-oauth2",
    "version": "0.3.1"
  },
  {
    "name": "omniauth-oauth",
    "version": "1.1.0"
  },
  {
    "name": "omniauth-oauth2",
    "version": "1.4.0"
  },
  {
    "name": "omniauth-twitter",
    "version": "1.2.1"
  },
  {
    "name": "orm_adapter",
    "version": "0.5.0"
  },
  {
    "name": "pg",
    "version": "0.18.4"
  },
  {
    "name": "poltergeist",
    "version": "1.9.0"
  },
  {
    "name": "pry",
    "version": "0.10.3"
  },
  {
    "name": "pry-rails",
    "version": "0.3.4"
  },
  {
    "name": "puma",
    "version": "2.16.0"
  },
  {
    "name": "quiet_assets",
    "version": "1.1.0"
  },
  {
    "name": "rack",
    "version": "1.6.4"
  },
  {
    "name": "rack-mini-profiler",
    "version": "0.9.8"
  },
  {
    "name": "rack-protection",
    "version": "1.5.3"
  },
  {
    "name": "rack-test",
    "version": "0.6.3"
  },
  {
    "name": "rails",
    "version": "4.2.6"
  },
  {
    "name": "rails-deprecated_sanitizer",
    "version": "1.0.3"
  },
  {
    "name": "rails-dom-testing",
    "version": "1.0.7"
  },
  {
    "name": "rails-html-sanitizer",
    "version": "1.0.3"
  },
  {
    "name": "rails_12factor",
    "version": "0.0.2"
  },
  {
    "name": "rails_best_practices",
    "version": "1.16.0"
  },
  {
    "name": "rails_serve_static_assets",
    "version": "0.0.5"
  },
  {
    "name": "rails_stdout_logging",
    "version": "0.0.5"
  },
  {
    "name": "railties",
    "version": "4.2.6"
  },
  {
    "name": "rake",
    "version": "11.1.2"
  },
  {
    "name": "rb-fsevent",
    "version": "0.9.7"
  },
  {
    "name": "rb-inotify",
    "version": "0.9.7"
  },
  {
    "name": "rdoc",
    "version": "4.2.2"
  },
  {
    "name": "react-rails",
    "version": "1.10.0"
  },
  {
    "name": "redis",
    "version": "3.2.2"
  },
  {
    "name": "require_all",
    "version": "1.3.3"
  },
  {
    "name": "responders",
    "version": "2.1.2"
  },
  {
    "name": "rspec",
    "version": "3.4.0"
  },
  {
    "name": "rspec-core",
    "version": "3.4.4"
  },
  {
    "name": "rspec-expectations",
    "version": "3.4.0"
  },
  {
    "name": "rspec-mocks",
    "version": "3.4.1"
  },
  {
    "name": "rspec-rails",
    "version": "3.4.2"
  },
  {
    "name": "rspec-support",
    "version": "3.4.1"
  },
  {
    "name": "ruby-progressbar",
    "version": "1.7.5"
  },
  {
    "name": "rubyzip",
    "version": "1.2.0"
  },
  {
    "name": "sass",
    "version": "3.4.21"
  },
  {
    "name": "sass-rails",
    "version": "5.0.4"
  },
  {
    "name": "sdoc",
    "version": "0.4.1"
  },
  {
    "name": "selenium-webdriver",
    "version": "2.48.1"
  },
  {
    "name": "sexp_processor",
    "version": "4.7.0"
  },
  {
    "name": "shellany",
    "version": "0.0.1"
  },
  {
    "name": "sidekiq",
    "version": "4.1.1"
  },
  {
    "name": "sinatra",
    "version": "1.4.7"
  },
  {
    "name": "slim",
    "version": "3.0.6"
  },
  {
    "name": "slop",
    "version": "3.6.0"
  },
  {
    "name": "spring",
    "version": "1.6.4"
  },
  {
    "name": "spring-commands-rspec",
    "version": "1.0.4"
  },
  {
    "name": "sprockets",
    "version": "3.6.0"
  },
  {
    "name": "sprockets-rails",
    "version": "3.0.4"
  },
  {
    "name": "subexec",
    "version": "0.2.3"
  },
  {
    "name": "temple",
    "version": "0.7.6"
  },
  {
    "name": "thor",
    "version": "0.19.1"
  },
  {
    "name": "thread_safe",
    "version": "0.3.5"
  },
  {
    "name": "tilt",
    "version": "2.0.2"
  },
  {
    "name": "turbolinks",
    "version": "2.5.3"
  },
  {
    "name": "tzinfo",
    "version": "1.2.2"
  },
  {
    "name": "uglifier",
    "version": "3.0.0"
  },
  {
    "name": "uniform_notifier",
    "version": "1.9.0"
  },
  {
    "name": "warden",
    "version": "1.2.6"
  },
  {
    "name": "web-console",
    "version": "2.3.0"
  },
  {
    "name": "websocket",
    "version": "1.2.2"
  },
  {
    "name": "websocket-driver",
    "version": "0.6.3"
  },
  {
    "name": "websocket-extensions",
    "version": "0.1.2"
  },
  {
    "name": "will_paginate",
    "version": "3.1.0"
  },
  {
    "name": "xpath",
    "version": "2.0.0"
  }
]