^C:\USERS\CHRIS\ONEDRIVE\DESKTOP\ACTIVEPROJECTS\DIRECT3D_PROJECT1_DRAWING\COMMON\D3DAPP.CPP|C:\USERS\CHRIS\ONEDRIVE\DESKTOP\ACTIVEPROJECTS\DIRECT3D_PROJECT1_DRAWING\COMMON\D3DUTIL.CPP|C:\USERS\CHRIS\ONEDRIVE\DESKTOP\ACTIVEPROJECTS\DIRECT3D_PROJECT1_DRAWING\COMMON\GAMETIMER.CPP|C:\USERS\CHRIS\ONEDRIVE\DESKTOP\ACTIVEPROJECTS\DIRECT3D_PROJECT1_DRAWING\COMMON\MATHHELPER.CPP
C:\USERS\CHRIS\ONEDRIVE\DESKTOP\ACTIVEPROJECTS\DIRECT3D_PROJECT1_DRAWING\DIRECT3D_PROJECT1_DRAWING\DIRECT3D_PROJECT1_DRAWING\X64\DEBUG\VC143.PDB
C:\USERS\CHRIS\ONEDRIVE\DESKTOP\ACTIVEPROJECTS\DIRECT3D_PROJECT1_DRAWING\DIRECT3D_PROJECT1_DRAWING\DIRECT3D_PROJECT1_DRAWING\X64\DEBUG\VC143.IDB
C:\USERS\CHRIS\ONEDRIVE\DESKTOP\ACTIVEPROJECTS\DIRECT3D_PROJECT1_DRAWING\DIRECT3D_PROJECT1_DRAWING\DIRECT3D_PROJECT1_DRAWING\X64\DEBUG\MATHHELPER.OBJ
C:\USERS\CHRIS\ONEDRIVE\DESKTOP\ACTIVEPROJECTS\DIRECT3D_PROJECT1_DRAWING\DIRECT3D_PROJECT1_DRAWING\DIRECT3D_PROJECT1_DRAWING\X64\DEBUG\GAMETIMER.OBJ
C:\USERS\CHRIS\ONEDRIVE\DESKTOP\ACTIVEPROJECTS\DIRECT3D_PROJECT1_DRAWING\DIRECT3D_PROJECT1_DRAWING\DIRECT3D_PROJECT1_DRAWING\X64\DEBUG\D3DUTIL.OBJ
C:\USERS\CHRIS\ONEDRIVE\DESKTOP\ACTIVEPROJECTS\DIRECT3D_PROJECT1_DRAWING\DIRECT3D_PROJECT1_DRAWING\DIRECT3D_PROJECT1_DRAWING\X64\DEBUG\D3DAPP.OBJ
^C:\USERS\CHRIS\ONEDRIVE\DESKTOP\ACTIVEPROJECTS\DIRECT3D_PROJECT1_DRAWING\COMMON\D3DAPP.CPP
C:\USERS\CHRIS\ONEDRIVE\DESKTOP\ACTIVEPROJECTS\DIRECT3D_PROJECT1_DRAWING\DIRECT3D_PROJECT1_DRAWING\DIRECT3D_PROJECT1_DRAWING\X64\DEBUG\D3DAPP.OBJ
^C:\USERS\CHRIS\ONEDRIVE\DESKTOP\ACTIVEPROJECTS\DIRECT3D_PROJECT1_DRAWING\COMMON\D3DUTIL.CPP
C:\USERS\CHRIS\ONEDRIVE\DESKTOP\ACTIVEPROJECTS\DIRECT3D_PROJECT1_DRAWING\DIRECT3D_PROJECT1_DRAWING\DIRECT3D_PROJECT1_DRAWING\X64\DEBUG\D3DUTIL.OBJ
^C:\USERS\CHRIS\ONEDRIVE\DESKTOP\ACTIVEPROJECTS\DIRECT3D_PROJECT1_DRAWING\COMMON\GAMETIMER.CPP
C:\USERS\CHRIS\ONEDRIVE\DESKTOP\ACTIVEPROJECTS\DIRECT3D_PROJECT1_DRAWING\DIRECT3D_PROJECT1_DRAWING\DIRECT3D_PROJECT1_DRAWING\X64\DEBUG\GAMETIMER.OBJ
^C:\USERS\CHRIS\ONEDRIVE\DESKTOP\ACTIVEPROJECTS\DIRECT3D_PROJECT1_DRAWING\COMMON\MATHHELPER.CPP
C:\USERS\CHRIS\ONEDRIVE\DESKTOP\ACTIVEPROJECTS\DIRECT3D_PROJECT1_DRAWING\DIRECT3D_PROJECT1_DRAWING\DIRECT3D_PROJECT1_DRAWING\X64\DEBUG\MATHHELPER.OBJ
^C:\USERS\CHRIS\ONEDRIVE\DESKTOP\ACTIVEPROJECTS\DIRECT3D_PROJECT1_DRAWING\SOURCE\MAIN.CPP|C:\USERS\CHRIS\ONEDRIVE\DESKTOP\ACTIVEPROJECTS\DIRECT3D_PROJECT1_DRAWING\SOURCE\MYDIRECT3DAPP.CPP
C:\USERS\CHRIS\ONEDRIVE\DESKTOP\ACTIVEPROJECTS\DIRECT3D_PROJECT1_DRAWING\DIRECT3D_PROJECT1_DRAWING\DIRECT3D_PROJECT1_DRAWING\X64\DEBUG\VC143.PDB
C:\USERS\CHRIS\ONEDRIVE\DESKTOP\ACTIVEPROJECTS\DIRECT3D_PROJECT1_DRAWING\DIRECT3D_PROJECT1_DRAWING\DIRECT3D_PROJECT1_DRAWING\X64\DEBUG\VC143.IDB
C:\USERS\CHRIS\ONEDRIVE\DESKTOP\ACTIVEPROJECTS\DIRECT3D_PROJECT1_DRAWING\DIRECT3D_PROJECT1_DRAWING\DIRECT3D_PROJECT1_DRAWING\X64\DEBUG\MYDIRECT3DAPP.OBJ
C:\USERS\CHRIS\ONEDRIVE\DESKTOP\ACTIVEPROJECTS\DIRECT3D_PROJECT1_DRAWING\DIRECT3D_PROJECT1_DRAWING\DIRECT3D_PROJECT1_DRAWING\X64\DEBUG\MAIN.OBJ
^C:\USERS\CHRIS\ONEDRIVE\DESKTOP\ACTIVEPROJECTS\DIRECT3D_PROJECT1_DRAWING\SOURCE\MAIN.CPP
C:\USERS\CHRIS\ONEDRIVE\DESKTOP\ACTIVEPROJECTS\DIRECT3D_PROJECT1_DRAWING\DIRECT3D_PROJECT1_DRAWING\DIRECT3D_PROJECT1_DRAWING\X64\DEBUG\VC143.PDB
^C:\USERS\CHRIS\ONEDRIVE\DESKTOP\ACTIVEPROJECTS\DIRECT3D_PROJECT1_DRAWING\SOURCE\MYDIRECT3DAPP.CPP
C:\USERS\CHRIS\ONEDRIVE\DESKTOP\ACTIVEPROJECTS\DIRECT3D_PROJECT1_DRAWING\DIRECT3D_PROJECT1_DRAWING\DIRECT3D_PROJECT1_DRAWING\X64\DEBUG\VC143.PDB
C:\USERS\CHRIS\ONEDRIVE\DESKTOP\ACTIVEPROJECTS\DIRECT3D_PROJECT1_DRAWING\DIRECT3D_PROJECT1_DRAWING\DIRECT3D_PROJECT1_DRAWING\X64\DEBUG\VC143.IDB
C:\USERS\CHRIS\ONEDRIVE\DESKTOP\ACTIVEPROJECTS\DIRECT3D_PROJECT1_DRAWING\DIRECT3D_PROJECT1_DRAWING\DIRECT3D_PROJECT1_DRAWING\X64\DEBUG\MYDIRECT3DAPP.OBJ
