^C:\USERS\CHRIS\ONEDRIVE\DESKTOP\ACTIVEPROJECTS\DIRECT3D_PROJECT1_DRAWING\DIRECT3D_PROJECT1_DRAWING\DIRECT3D_PROJECT1_DRAWING\X64\DEBUG\D3DAPP.OBJ|C:\USERS\CHRIS\ONEDRIVE\DESKTOP\ACTIVEPROJECTS\DIRECT3D_PROJECT1_DRAWING\DIRECT3D_PROJECT1_DRAWING\DIRECT3D_PROJECT1_DRAWING\X64\DEBUG\D3DUTIL.OBJ|C:\USERS\CHRIS\ONEDRIVE\DESKTOP\ACTIVEPROJECTS\DIRECT3D_PROJECT1_DRAWING\DIRECT3D_PROJECT1_DRAWING\DIRECT3D_PROJECT1_DRAWING\X64\DEBUG\GAMETIMER.OBJ|C:\USERS\CHRIS\ONEDRIVE\DESKTOP\ACTIVEPROJECTS\DIRECT3D_PROJECT1_DRAWING\DIRECT3D_PROJECT1_DRAWING\DIRECT3D_PROJECT1_DRAWING\X64\DEBUG\MAIN.OBJ|C:\USERS\CHRIS\ONEDRIVE\DESKTOP\ACTIVEPROJECTS\DIRECT3D_PROJECT1_DRAWING\DIRECT3D_PROJECT1_DRAWING\DIRECT3D_PROJECT1_DRAWING\X64\DEBUG\MATHHELPER.OBJ|C:\USERS\CHRIS\ONEDRIVE\DESKTOP\ACTIVEPROJECTS\DIRECT3D_PROJECT1_DRAWING\DIRECT3D_PROJECT1_DRAWING\DIRECT3D_PROJECT1_DRAWING\X64\DEBUG\MYDIRECT3DAPP.OBJ
C:\USERS\CHRIS\ONEDRIVE\DESKTOP\ACTIVEPROJECTS\DIRECT3D_PROJECT1_DRAWING\DIRECT3D_PROJECT1_DRAWING\X64\DEBUG\DIRECT3D_PROJECT1_DRAWING.EXE
C:\USERS\CHRIS\ONEDRIVE\DESKTOP\ACTIVEPROJECTS\DIRECT3D_PROJECT1_DRAWING\DIRECT3D_PROJECT1_DRAWING\DIRECT3D_PROJECT1_DRAWING\X64\DEBUG\DIRECT3D_PROJECT1_DRAWING.ILK
C:\USERS\CHRIS\ONEDRIVE\DESKTOP\ACTIVEPROJECTS\DIRECT3D_PROJECT1_DRAWING\DIRECT3D_PROJECT1_DRAWING\X64\DEBUG\DIRECT3D_PROJECT1_DRAWING.PDB
