^C:\USERS\CHRIS\ONEDRIVE\DESKTOP\ACTIVEPROJECTS\DIRECT3D_PROJECT1_DRAWING\DIRECT3D_PROJECT1_DRAWING\DIRECT3D_PROJECT1_DRAWING\X64\DEBUG\D3DAPP.OBJ|C:\USERS\CHRIS\ONEDRIVE\DESKTOP\ACTIVEPROJECTS\DIRECT3D_PROJECT1_DRAWING\DIRECT3D_PROJECT1_DRAWING\DIRECT3D_PROJECT1_DRAWING\X64\DEBUG\D3DUTIL.OBJ|C:\USERS\CHRIS\ONEDRIVE\DESKTOP\ACTIVEPROJECTS\DIRECT3D_PROJECT1_DRAWING\DIRECT3D_PROJECT1_DRAWING\DIRECT3D_PROJECT1_DRAWING\X64\DEBUG\GAMETIMER.OBJ|C:\USERS\CHRIS\ONEDRIVE\DESKTOP\ACTIVEPROJECTS\DIRECT3D_PROJECT1_DRAWING\DIRECT3D_PROJECT1_DRAWING\DIRECT3D_PROJECT1_DRAWING\X64\DEBUG\MAIN.OBJ|C:\USERS\CHRIS\ONEDRIVE\DESKTOP\ACTIVEPROJECTS\DIRECT3D_PROJECT1_DRAWING\DIRECT3D_PROJECT1_DRAWING\DIRECT3D_PROJECT1_DRAWING\X64\DEBUG\MATHHELPER.OBJ|C:\USERS\CHRIS\ONEDRIVE\DESKTOP\ACTIVEPROJECTS\DIRECT3D_PROJECT1_DRAWING\DIRECT3D_PROJECT1_DRAWING\DIRECT3D_PROJECT1_DRAWING\X64\DEBUG\MYDIRECT3DAPP.OBJ
/OUT:"C:\USERS\CHRIS\ONEDRIVE\DESKTOP\ACTIVEPROJECTS\DIRECT3D_PROJECT1_DRAWING\DIRECT3D_PROJECT1_DRAWING\X64\DEBUG\DIRECT3D_PROJECT1_DRAWING.EXE" /INCREMENTAL /ILK:"X64\DEBUG\DIRECT3D_PROJECT1_DRAWING.ILK" /NOLOGO KERNEL32.LIB USER32.LIB GDI32.LIB WINSPOOL.LIB COMDLG32.LIB ADVAPI32.LIB SHELL32.LIB OLE32.LIB OLEAUT32.LIB UUID.LIB ODBC32.LIB ODBCCP32.LIB /MANIFEST /MANIFESTUAC:"level='asInvoker' uiAccess='false'" /manifest:embed /DEBUG /PDB:"C:\USERS\CHRIS\ONEDRIVE\DESKTOP\ACTIVEPROJECTS\DIRECT3D_PROJECT1_DRAWING\DIRECT3D_PROJECT1_DRAWING\X64\DEBUG\DIRECT3D_PROJECT1_DRAWING.PDB" /SUBSYSTEM:WINDOWS /TLBID:1 /DYNAMICBASE /NXCOMPAT /IMPLIB:"C:\USERS\CHRIS\ONEDRIVE\DESKTOP\ACTIVEPROJECTS\DIRECT3D_PROJECT1_DRAWING\DIRECT3D_PROJECT1_DRAWING\X64\DEBUG\DIRECT3D_PROJECT1_DRAWING.LIB" /MACHINE:X64 X64\DEBUG\D3DAPP.OBJ
X64\DEBUG\D3DUTIL.OBJ
X64\DEBUG\GAMETIMER.OBJ
X64\DEBUG\MATHHELPER.OBJ
X64\DEBUG\MAIN.OBJ
X64\DEBUG\MYDIRECT3DAPP.OBJ
