{
  "name": "Rocket Launcher",
  "attackDamage": 15,
  "attackRate": 1.5,
  "attackRange": 200,
  "iconLink": "tower/rocketlauncher.png",
  "cost": 100,
  "multiplier": 1.25,
  "projectileImageLink": "tower/rocket.png"
}