101 081000032 1234567892110201127A094101Some Bank              Your Company Inc       #A000001
5200Your Company IncOpt Discretionary   0123456789WEBTrans DescNov 1 211101   1081000030000000
6220810002105654221          0000017500RAj##32b1kn1bb3Luke Skywalker          0123456780000000
622169371751401142567        00000097225r0utca46dv40n1Fred a Kuhn           iz0123456780000001
622526971590141228084        00000075761xphzty05r81esuGracie c Stamm        hc0123456780000002
622487896772290833278        000000918587ith540jt8fcrbCollin a Metz         ac0123456780000003
622656767645088765529        0000003585tnnd0ke27rnpmfpSharon b Leuschke     yu0123456780000004
622746060757414766671        0000004327o9ppsef8znhmg4lEdd b Altenwerth      hi0123456780000005
622768936089941689085        0000004771s1qvumb27u8pfqhCooper c Leuschke     jg0123456780000006
622472101809984954638        000000484372udal1cimrdonyMargret a Okuneva     tu0123456780000007
622461691689600522593        0000000403cy5gp117527pfqhAidan c Denesik       qk0123456780000008
622135485600098155378        00000052325lapmam4vcd88h7Asia b Williamson     oc0123456780000009
622563266789648293240        0000006618p03ce79kxe8jltfMercedes b Borer      sz0123456780000010
820000001105069550650000000000000000000737620123456789                         081000030000000
9000001000002000000110506955065000000000000000000073762                                       
9999999999999999999999999999999999999999999999999999999999999999999999999999999999999999999999
9999999999999999999999999999999999999999999999999999999999999999999999999999999999999999999999
9999999999999999999999999999999999999999999999999999999999999999999999999999999999999999999999
9999999999999999999999999999999999999999999999999999999999999999999999999999999999999999999999
9999999999999999999999999999999999999999999999999999999999999999999999999999999999999999999999