%!PS-Adobe-3.0 EPSF-3.0
%%Creator: cairo 1.14.2 (http://cairographics.org)
%%CreationDate: Tue Jun 21 12:24:10 2016
%%Pages: 1
%%DocumentData: Clean7Bit
%%LanguageLevel: 2
%%BoundingBox: 0 -1 238 238
%%EndComments
%%BeginProlog
save
50 dict begin
/q { gsave } bind def
/Q { grestore } bind def
/cm { 6 array astore concat } bind def
/w { setlinewidth } bind def
/J { setlinecap } bind def
/j { setlinejoin } bind def
/M { setmiterlimit } bind def
/d { setdash } bind def
/m { moveto } bind def
/l { lineto } bind def
/c { curveto } bind def
/h { closepath } bind def
/re { exch dup neg 3 1 roll 5 3 roll moveto 0 rlineto
      0 exch rlineto 0 rlineto closepath } bind def
/S { stroke } bind def
/f { fill } bind def
/f* { eofill } bind def
/n { newpath } bind def
/W { clip } bind def
/W* { eoclip } bind def
/BT { } bind def
/ET { } bind def
/pdfmark where { pop globaldict /?pdfmark /exec load put }
    { globaldict begin /?pdfmark /pop load def /pdfmark
    /cleartomark load def end } ifelse
/BDC { mark 3 1 roll /BDC pdfmark } bind def
/EMC { mark /EMC pdfmark } bind def
/cairo_store_point { /cairo_point_y exch def /cairo_point_x exch def } def
/Tj { show currentpoint cairo_store_point } bind def
/TJ {
  {
    dup
    type /stringtype eq
    { show } { -0.001 mul 0 cairo_font_matrix dtransform rmoveto } ifelse
  } forall
  currentpoint cairo_store_point
} bind def
/cairo_selectfont { cairo_font_matrix aload pop pop pop 0 0 6 array astore
    cairo_font exch selectfont cairo_point_x cairo_point_y moveto } bind def
/Tf { pop /cairo_font exch def /cairo_font_matrix where
      { pop cairo_selectfont } if } bind def
/Td { matrix translate cairo_font_matrix matrix concatmatrix dup
      /cairo_font_matrix exch def dup 4 get exch 5 get cairo_store_point
      /cairo_font where { pop cairo_selectfont } if } bind def
/Tm { 2 copy 8 2 roll 6 array astore /cairo_font_matrix exch def
      cairo_store_point /cairo_font where { pop cairo_selectfont } if } bind def
/g { setgray } bind def
/rg { setrgbcolor } bind def
/d1 { setcachedevice } bind def
%%EndProlog
%%BeginSetup
%%EndSetup
%%Page: 1 1
%%BeginPageSetup
%%PageBoundingBox: 0 -1 238 238
%%EndPageSetup
q 0 -1 238 239 rectclip q
0.054902 0.65098 0.796078 rg
237.602 118.799 m 237.602 53.19 184.41 -0.002 118.801 -0.002 c 53.188 -0.002
 0 53.19 0 118.799 c 0 184.413 53.188 237.6 118.801 237.6 c 184.41 237.6
 237.602 184.413 237.602 118.799 c h
237.602 118.799 m f
0.227451 0.435294 0.505882 rg
237.512 123.155 m 184.801 175.866 l 74.988 36.42 l 111.16 0.252 l 113.688
 0.092 116.23 -0.002 118.801 -0.002 c 184.41 -0.002 237.602 53.19 237.602
 118.799 c 237.602 120.26 237.566 121.709 237.512 123.155 c h
237.512 123.155 m f
0.92549 0.941176 0.945098 rg
84.734 32.401 m 153.844 32.401 l 160.801 32.401 166.676 37.557 167.578 
44.452 c 184.801 175.866 l 52.801 175.866 l 71.012 44.354 l 71.961 37.502
 77.816 32.401 84.734 32.401 c h
84.734 32.401 m f
0.823529 0.843137 0.847059 rg
119.734 175.866 m 119.734 32.401 l 153.844 32.401 l 160.801 32.401 166.676
 37.557 167.578 44.452 c 184.801 175.866 l h
119.734 175.866 m f
0.796078 0.890196 0.890196 rg
69.262 120.799 m 78.543 53.772 l 79.34 48.002 84.273 43.702 90.102 43.702
 c 148.324 43.702 l 154.18 43.702 159.133 48.045 159.895 53.858 c 168.664
 120.799 l h
69.262 120.799 m f
0.705882 0.8 0.796078 rg
119.734 120.799 m 119.734 43.702 l 148.324 43.702 l 154.18 43.702 159.133
 48.045 159.895 53.858 c 168.664 120.799 l h
119.734 120.799 m f
0.6 0.670588 0.835294 rg
147.16 107.784 m 131.723 104.127 l 128.891 103.455 126.055 105.209 125.383
 108.038 c 121.727 123.479 l 121.055 126.307 122.809 129.147 125.637 129.819
 c 141.078 133.475 l 143.906 134.143 146.746 132.393 147.414 129.561 c 151.074
 114.123 l 151.742 111.291 149.992 108.455 147.16 107.784 c h
147.16 107.784 m f
93.246 100.291 m 81.715 111.194 l 79.602 113.19 79.508 116.526 81.508 118.639
 c 92.406 130.166 l 94.406 132.28 97.738 132.373 99.852 130.377 c 111.383
 119.475 l 113.496 117.475 113.59 114.143 111.59 112.03 c 100.691 100.498
 l 98.691 98.385 95.359 98.291 93.246 100.291 c h
93.246 100.291 m f
Q Q
showpage
%%Trailer
end restore
%%EOF
