%!PS-Adobe-3.0 EPSF-3.0
%%Creator: cairo 1.14.2 (http://cairographics.org)
%%CreationDate: Tue Jun 21 12:27:33 2016
%%Pages: 1
%%DocumentData: Clean7Bit
%%LanguageLevel: 2
%%BoundingBox: 0 -1 238 238
%%EndComments
%%BeginProlog
save
50 dict begin
/q { gsave } bind def
/Q { grestore } bind def
/cm { 6 array astore concat } bind def
/w { setlinewidth } bind def
/J { setlinecap } bind def
/j { setlinejoin } bind def
/M { setmiterlimit } bind def
/d { setdash } bind def
/m { moveto } bind def
/l { lineto } bind def
/c { curveto } bind def
/h { closepath } bind def
/re { exch dup neg 3 1 roll 5 3 roll moveto 0 rlineto
      0 exch rlineto 0 rlineto closepath } bind def
/S { stroke } bind def
/f { fill } bind def
/f* { eofill } bind def
/n { newpath } bind def
/W { clip } bind def
/W* { eoclip } bind def
/BT { } bind def
/ET { } bind def
/pdfmark where { pop globaldict /?pdfmark /exec load put }
    { globaldict begin /?pdfmark /pop load def /pdfmark
    /cleartomark load def end } ifelse
/BDC { mark 3 1 roll /BDC pdfmark } bind def
/EMC { mark /EMC pdfmark } bind def
/cairo_store_point { /cairo_point_y exch def /cairo_point_x exch def } def
/Tj { show currentpoint cairo_store_point } bind def
/TJ {
  {
    dup
    type /stringtype eq
    { show } { -0.001 mul 0 cairo_font_matrix dtransform rmoveto } ifelse
  } forall
  currentpoint cairo_store_point
} bind def
/cairo_selectfont { cairo_font_matrix aload pop pop pop 0 0 6 array astore
    cairo_font exch selectfont cairo_point_x cairo_point_y moveto } bind def
/Tf { pop /cairo_font exch def /cairo_font_matrix where
      { pop cairo_selectfont } if } bind def
/Td { matrix translate cairo_font_matrix matrix concatmatrix dup
      /cairo_font_matrix exch def dup 4 get exch 5 get cairo_store_point
      /cairo_font where { pop cairo_selectfont } if } bind def
/Tm { 2 copy 8 2 roll 6 array astore /cairo_font_matrix exch def
      cairo_store_point /cairo_font where { pop cairo_selectfont } if } bind def
/g { setgray } bind def
/rg { setrgbcolor } bind def
/d1 { setcachedevice } bind def
%%EndProlog
%%BeginSetup
%%EndSetup
%%Page: 1 1
%%BeginPageSetup
%%PageBoundingBox: 0 -1 238 238
%%EndPageSetup
q 0 -1 238 239 rectclip q
0.368627 0.270588 0.203922 rg
237.602 118.799 m 237.602 53.19 184.41 -0.002 118.801 -0.002 c 53.188 -0.002
 0 53.19 0 118.799 c 0 184.413 53.188 237.6 118.801 237.6 c 184.41 237.6
 237.602 184.413 237.602 118.799 c h
237.602 118.799 m f
0.313726 0.231373 0.172549 rg
176.656 177.858 m 145.793 152.67 l 147.91 145.397 150.309 138.174 155.602
 132.401 c 139.934 111.51 115.215 98.975 89.891 99.975 c 59.18 71.03 l 129.707
 0.502 l 189.57 5.955 236.594 55.807 237.574 116.854 c h
176.656 177.858 m f
0.839216 0.545098 0.345098 rg
72.582 98.737 m 72.582 98.737 59.457 108.077 44.836 106.909 c 30.219 105.745
 42.492 80.85 66.164 70.534 c 89.832 60.221 72.582 98.737 72.582 98.737 
c h
72.582 98.737 m f
0.74902 0.462745 0.270588 rg
158.906 149.346 m 158.906 149.346 157.168 165.362 165.324 177.545 c 173.48
 189.733 189.211 166.866 186.652 141.17 c 184.094 115.479 158.906 149.346
 158.906 149.346 c h
158.906 149.346 m f
0.847059 0.470588 0.188235 rg
163.062 166.534 m 155.945 168.666 148.789 165.092 146.578 158.065 c 141.859
 143.077 131.715 129.666 116.992 121.034 c 102.996 112.827 87.242 110.338
 72.5 112.866 c 64.703 114.202 57.816 109.018 56.926 100.967 c 55.031 83.776
 l 54.301 77.178 57.824 70.416 63.738 67.28 c 88.984 53.881 120.613 53.58
 147.348 69.256 c 175.824 85.948 191.191 116.327 189.844 146.827 c 189.539
 153.795 184.68 160.057 178.168 162.006 c h
163.062 166.534 m f
0.768627 0.4 0.152941 rg
189.848 146.827 m 189.539 153.795 184.68 160.057 178.168 162.006 c 163.062
 166.534 l 155.945 168.666 148.789 165.092 146.578 158.065 c 142.113 143.885
 132.789 131.127 119.332 122.483 c 119.332 58.795 l 128.938 60.573 138.418
 64.018 147.348 69.256 c 175.824 85.948 191.195 116.327 189.848 146.827 
c h
189.848 146.827 m f
0.717647 0.4 0.160784 rg
114.602 124.913 m 109.707 122.041 104.68 119.659 99.582 117.733 c 95.48
 116.186 93.086 111.967 94.168 108.12 c 109.141 54.83 l 110.203 51.034 114.266
 48.975 118.43 50.065 c 129.379 52.924 140.234 57.362 150.633 63.455 c 160.941
 69.498 170.043 76.733 177.844 84.803 c 180.812 87.877 181.031 92.393 178.297
 95.194 c 139.629 134.741 l 136.789 137.647 131.848 137.592 128.445 134.709
 c 124.211 131.123 119.59 127.838 114.602 124.913 c h
114.602 124.913 m f
0.627451 0.345098 0.152941 rg
178.297 95.19 m 139.629 134.741 l 136.789 137.647 131.848 137.592 128.445
 134.709 c 125.586 132.291 122.539 130.018 119.336 127.889 c 119.336 50.319
 l 129.98 53.186 140.523 57.53 150.633 63.455 c 160.941 69.498 170.047 76.733
 177.848 84.803 c 180.812 87.877 181.031 92.393 178.297 95.19 c h
178.297 95.19 m f
Q Q
showpage
%%Trailer
end restore
%%EOF
