%!PS-Adobe-3.0 EPSF-3.0
%%Creator: cairo 1.14.2 (http://cairographics.org)
%%CreationDate: Tue Jun 21 12:28:51 2016
%%Pages: 1
%%DocumentData: Clean7Bit
%%LanguageLevel: 2
%%BoundingBox: 0 -1 238 238
%%EndComments
%%BeginProlog
save
50 dict begin
/q { gsave } bind def
/Q { grestore } bind def
/cm { 6 array astore concat } bind def
/w { setlinewidth } bind def
/J { setlinecap } bind def
/j { setlinejoin } bind def
/M { setmiterlimit } bind def
/d { setdash } bind def
/m { moveto } bind def
/l { lineto } bind def
/c { curveto } bind def
/h { closepath } bind def
/re { exch dup neg 3 1 roll 5 3 roll moveto 0 rlineto
      0 exch rlineto 0 rlineto closepath } bind def
/S { stroke } bind def
/f { fill } bind def
/f* { eofill } bind def
/n { newpath } bind def
/W { clip } bind def
/W* { eoclip } bind def
/BT { } bind def
/ET { } bind def
/pdfmark where { pop globaldict /?pdfmark /exec load put }
    { globaldict begin /?pdfmark /pop load def /pdfmark
    /cleartomark load def end } ifelse
/BDC { mark 3 1 roll /BDC pdfmark } bind def
/EMC { mark /EMC pdfmark } bind def
/cairo_store_point { /cairo_point_y exch def /cairo_point_x exch def } def
/Tj { show currentpoint cairo_store_point } bind def
/TJ {
  {
    dup
    type /stringtype eq
    { show } { -0.001 mul 0 cairo_font_matrix dtransform rmoveto } ifelse
  } forall
  currentpoint cairo_store_point
} bind def
/cairo_selectfont { cairo_font_matrix aload pop pop pop 0 0 6 array astore
    cairo_font exch selectfont cairo_point_x cairo_point_y moveto } bind def
/Tf { pop /cairo_font exch def /cairo_font_matrix where
      { pop cairo_selectfont } if } bind def
/Td { matrix translate cairo_font_matrix matrix concatmatrix dup
      /cairo_font_matrix exch def dup 4 get exch 5 get cairo_store_point
      /cairo_font where { pop cairo_selectfont } if } bind def
/Tm { 2 copy 8 2 roll 6 array astore /cairo_font_matrix exch def
      cairo_store_point /cairo_font where { pop cairo_selectfont } if } bind def
/g { setgray } bind def
/rg { setrgbcolor } bind def
/d1 { setcachedevice } bind def
%%EndProlog
%%BeginSetup
%%EndSetup
%%Page: 1 1
%%BeginPageSetup
%%PageBoundingBox: 0 -1 238 238
%%EndPageSetup
q 0 -1 238 239 rectclip q
0.223529 0.298039 0.505882 rg
237.602 118.799 m 237.602 53.19 184.41 -0.002 118.801 -0.002 c 53.188 -0.002
 0 53.19 0 118.799 c 0 184.413 53.188 237.6 118.801 237.6 c 184.41 237.6
 237.602 184.413 237.602 118.799 c h
237.602 118.799 m f
0.172549 0.243137 0.313726 rg
145.199 210.202 m 79.199 39.6 l 118.801 -0.002 l 184.082 -0.002 237.055
 52.659 237.586 117.811 c h
145.199 210.202 m f
0.6 0.670588 0.835294 rg
92.398 210.202 52.801 -13.203 re f
0.541176 0.611765 0.756863 rg
118.535 210.202 26.664 -13.203 re f
0.721569 0.788235 0.945098 rg
79.199 39.6 m 158.398 39.6 l 158.398 184.799 l 145.199 187.6 l 92.398 187.6
 l 79.199 184.799 l h
79.199 39.6 m f
0.6 0.670588 0.835294 rg
158.398 184.799 m 145.199 187.6 l 118.535 187.6 l 118.535 39.6 l 158.398
 39.6 l h
158.398 184.799 m f
0.203922 0.596078 0.858824 rg
104.535 65.998 m 133.066 65.998 l 139.77 65.998 145.199 71.432 145.199 
78.135 c 145.199 106.666 l 145.199 113.37 139.77 118.799 133.066 118.799
 c 104.535 118.799 l 97.832 118.799 92.398 113.37 92.398 106.666 c 92.398
 78.135 l 92.398 71.432 97.832 65.998 104.535 65.998 c h
104.535 65.998 m f
0.160784 0.501961 0.72549 rg
133.066 118.799 m 118.535 118.799 l 118.535 65.998 l 133.066 65.998 l 139.77
 65.998 145.199 71.432 145.199 78.135 c 145.199 106.666 l 145.199 113.37
 139.77 118.799 133.066 118.799 c h
133.066 118.799 m f
0.92549 0.941176 0.945098 rg
79.199 184.799 m 158.398 184.799 l 145.199 197.998 l 92.398 197.998 l h
79.199 184.799 m f
0.815686 0.839216 0.847059 rg
145.199 197.998 m 118.535 197.998 l 118.535 184.799 l 158.398 184.799 l
 h
145.199 197.998 m f
Q Q
showpage
%%Trailer
end restore
%%EOF
