%!PS-Adobe-3.0 EPSF-3.0
%%Creator: cairo 1.14.2 (http://cairographics.org)
%%CreationDate: Tue Jun 21 12:31:17 2016
%%Pages: 1
%%DocumentData: Clean7Bit
%%LanguageLevel: 2
%%BoundingBox: 0 -1 238 238
%%EndComments
%%BeginProlog
save
50 dict begin
/q { gsave } bind def
/Q { grestore } bind def
/cm { 6 array astore concat } bind def
/w { setlinewidth } bind def
/J { setlinecap } bind def
/j { setlinejoin } bind def
/M { setmiterlimit } bind def
/d { setdash } bind def
/m { moveto } bind def
/l { lineto } bind def
/c { curveto } bind def
/h { closepath } bind def
/re { exch dup neg 3 1 roll 5 3 roll moveto 0 rlineto
      0 exch rlineto 0 rlineto closepath } bind def
/S { stroke } bind def
/f { fill } bind def
/f* { eofill } bind def
/n { newpath } bind def
/W { clip } bind def
/W* { eoclip } bind def
/BT { } bind def
/ET { } bind def
/pdfmark where { pop globaldict /?pdfmark /exec load put }
    { globaldict begin /?pdfmark /pop load def /pdfmark
    /cleartomark load def end } ifelse
/BDC { mark 3 1 roll /BDC pdfmark } bind def
/EMC { mark /EMC pdfmark } bind def
/cairo_store_point { /cairo_point_y exch def /cairo_point_x exch def } def
/Tj { show currentpoint cairo_store_point } bind def
/TJ {
  {
    dup
    type /stringtype eq
    { show } { -0.001 mul 0 cairo_font_matrix dtransform rmoveto } ifelse
  } forall
  currentpoint cairo_store_point
} bind def
/cairo_selectfont { cairo_font_matrix aload pop pop pop 0 0 6 array astore
    cairo_font exch selectfont cairo_point_x cairo_point_y moveto } bind def
/Tf { pop /cairo_font exch def /cairo_font_matrix where
      { pop cairo_selectfont } if } bind def
/Td { matrix translate cairo_font_matrix matrix concatmatrix dup
      /cairo_font_matrix exch def dup 4 get exch 5 get cairo_store_point
      /cairo_font where { pop cairo_selectfont } if } bind def
/Tm { 2 copy 8 2 roll 6 array astore /cairo_font_matrix exch def
      cairo_store_point /cairo_font where { pop cairo_selectfont } if } bind def
/g { setgray } bind def
/rg { setrgbcolor } bind def
/d1 { setcachedevice } bind def
%%EndProlog
%%BeginSetup
%%EndSetup
%%Page: 1 1
%%BeginPageSetup
%%PageBoundingBox: 0 -1 238 238
%%EndPageSetup
q 0 -1 238 239 rectclip q
0.85098 0.329412 0.34902 rg
237.602 118.799 m 237.602 53.19 184.41 -0.002 118.801 -0.002 c 53.188 -0.002
 0 53.19 0 118.799 c 0 184.413 53.188 237.6 118.801 237.6 c 184.41 237.6
 237.602 184.413 237.602 118.799 c h
237.602 118.799 m f
0.698039 0.247059 0.278431 rg
170.207 185.026 m 116.438 76.178 l 118.836 72.424 120.285 67.975 120.496
 63.264 c 120.57 61.663 120.445 60.088 120.156 58.561 c 120.512 57.018 120.73
 55.424 120.805 53.799 c 121.383 40.858 109.375 29.838 96.844 29.838 c 95.754
 29.838 94.691 29.916 93.652 30.057 c 92.148 27.006 l 119.176 0.006 l 184.227
 0.205 236.965 52.69 237.586 117.643 c h
170.207 185.026 m f
0.92549 0.941176 0.945098 rg
177.602 149.389 m 177.602 159.756 174.914 172.491 170.207 185.026 c 67.395
 185.026 l 62.688 172.491 60 159.752 60 149.389 c 60 118.827 83.316 93.717
 113.133 90.866 c 113.133 36.713 l 96.125 36.713 l 92.996 36.713 90.457 
34.174 90.457 31.045 c 90.457 27.913 92.996 25.373 96.125 25.373 c 141.473
 25.373 l 144.605 25.373 147.141 27.913 147.141 31.045 c 147.141 34.174 
144.605 36.713 141.473 36.713 c 124.469 36.713 l 124.469 90.866 l 154.281
 93.717 177.602 118.827 177.602 149.389 c h
177.602 149.389 m f
0.870588 0.882353 0.886275 rg
177.602 149.389 m 177.602 159.756 174.914 172.491 170.207 185.026 c 118.535
 185.026 l 118.535 25.377 l 141.473 25.377 l 144.605 25.377 147.141 27.913
 147.141 31.045 c 147.141 34.174 144.605 36.713 141.473 36.713 c 124.469
 36.713 l 124.469 90.866 l 154.281 93.717 177.602 118.827 177.602 149.389
 c h
177.602 149.389 m f
0.47451 0.188235 0.164706 rg
69.73 147.471 m 69.73 120.37 91.699 98.401 118.801 98.401 c 145.902 98.401
 167.871 120.37 167.871 147.471 c h
69.73 147.471 m f
0.4 0.145098 0.133333 rg
118.535 147.471 m 118.535 98.409 l 118.625 98.405 118.711 98.401 118.801
 98.401 c 145.902 98.401 167.871 120.37 167.871 147.471 c h
118.535 147.471 m f
Q Q
showpage
%%Trailer
end restore
%%EOF
