%!PS-Adobe-3.0 EPSF-3.0
%%Creator: cairo 1.14.2 (http://cairographics.org)
%%CreationDate: Tue Jun 21 12:30:06 2016
%%Pages: 1
%%DocumentData: Clean7Bit
%%LanguageLevel: 2
%%BoundingBox: 0 -1 238 238
%%EndComments
%%BeginProlog
save
50 dict begin
/q { gsave } bind def
/Q { grestore } bind def
/cm { 6 array astore concat } bind def
/w { setlinewidth } bind def
/J { setlinecap } bind def
/j { setlinejoin } bind def
/M { setmiterlimit } bind def
/d { setdash } bind def
/m { moveto } bind def
/l { lineto } bind def
/c { curveto } bind def
/h { closepath } bind def
/re { exch dup neg 3 1 roll 5 3 roll moveto 0 rlineto
      0 exch rlineto 0 rlineto closepath } bind def
/S { stroke } bind def
/f { fill } bind def
/f* { eofill } bind def
/n { newpath } bind def
/W { clip } bind def
/W* { eoclip } bind def
/BT { } bind def
/ET { } bind def
/pdfmark where { pop globaldict /?pdfmark /exec load put }
    { globaldict begin /?pdfmark /pop load def /pdfmark
    /cleartomark load def end } ifelse
/BDC { mark 3 1 roll /BDC pdfmark } bind def
/EMC { mark /EMC pdfmark } bind def
/cairo_store_point { /cairo_point_y exch def /cairo_point_x exch def } def
/Tj { show currentpoint cairo_store_point } bind def
/TJ {
  {
    dup
    type /stringtype eq
    { show } { -0.001 mul 0 cairo_font_matrix dtransform rmoveto } ifelse
  } forall
  currentpoint cairo_store_point
} bind def
/cairo_selectfont { cairo_font_matrix aload pop pop pop 0 0 6 array astore
    cairo_font exch selectfont cairo_point_x cairo_point_y moveto } bind def
/Tf { pop /cairo_font exch def /cairo_font_matrix where
      { pop cairo_selectfont } if } bind def
/Td { matrix translate cairo_font_matrix matrix concatmatrix dup
      /cairo_font_matrix exch def dup 4 get exch 5 get cairo_store_point
      /cairo_font where { pop cairo_selectfont } if } bind def
/Tm { 2 copy 8 2 roll 6 array astore /cairo_font_matrix exch def
      cairo_store_point /cairo_font where { pop cairo_selectfont } if } bind def
/g { setgray } bind def
/rg { setrgbcolor } bind def
/d1 { setcachedevice } bind def
%%EndProlog
%%BeginSetup
%%EndSetup
%%Page: 1 1
%%BeginPageSetup
%%PageBoundingBox: 0 -1 238 238
%%EndPageSetup
q 0 -1 238 239 rectclip q
0.368627 0.270588 0.203922 rg
237.602 118.799 m 237.602 53.19 184.41 -0.002 118.801 -0.002 c 53.188 -0.002
 0 53.19 0 118.799 c 0 184.413 53.188 237.6 118.801 237.6 c 184.41 237.6
 237.602 184.413 237.602 118.799 c h
237.602 118.799 m f
0.313726 0.231373 0.172549 rg
188.281 130.12 m 35.602 87.28 l 122.809 0.073 l 175.105 1.807 218.84 37.338
 232.871 85.53 c h
188.281 130.12 m f
0.976471 0.713726 0.372549 rg
147.641 146.799 m 116.371 146.799 80.469 127.354 70.891 113.202 c 67.203
 121.385 57.488 136.135 46.078 136.135 c 31.5 136.135 46.078 126.58 46.078
 114.799 c 46.078 103.018 31.5 93.467 46.078 93.467 c 57.488 93.467 61.805
 93.916 65.496 102.104 c 75.07 87.948 116.371 82.799 147.641 82.799 c 173.391
 82.799 189.109 98.772 196.121 108.147 c 199.074 112.1 199.074 117.498 196.121
 121.452 c 189.109 130.83 173.391 146.799 147.641 146.799 c h
147.641 146.799 m f
0.878431 0.603922 0.27451 rg
196.121 121.452 m 189.109 130.83 173.391 146.799 147.641 146.799 c 138.074
 146.799 128.078 144.975 118.535 142.045 c 118.535 84.233 l 128.395 83.245
 138.449 82.799 147.641 82.799 c 173.391 82.799 189.109 98.772 196.121 108.147
 c 199.074 112.1 199.074 117.498 196.121 121.452 c h
196.121 121.452 m f
0.901961 0.494118 0.133333 rg
157.746 145.936 m 154.562 146.487 151.203 146.799 147.641 146.799 c 121.918
 146.799 93.07 133.643 78.312 121.096 c 84.676 117.834 93.652 115.827 105.602
 118.799 c 133.465 125.733 131.602 116.135 145.199 118.799 c 153.539 120.436
 156.613 134.948 157.746 145.936 c h
157.746 145.936 m f
0.756863 0.360784 0.0627451 rg
147.641 146.799 m 138.074 146.799 128.078 144.979 118.535 142.045 c 118.535
 121.155 l 133.309 122.538 134.176 116.639 145.199 118.799 c 153.539 120.436
 156.613 134.948 157.746 145.936 c 154.562 146.487 151.203 146.799 147.641
 146.799 c h
147.641 146.799 m f
1 g
52.801 80.799 m 184.801 80.799 l 199.379 80.799 211.199 92.62 211.199 107.202
 c 26.398 107.202 l 26.398 92.62 38.219 80.799 52.801 80.799 c h
52.801 80.799 m f
0.890196 0.898039 0.894118 rg
118.535 107.202 m 118.535 80.799 l 184.801 80.799 l 199.379 80.799 211.199
 92.62 211.199 107.202 c h
118.535 107.202 m f
0.756863 0.360784 0.0627451 rg
168 121.998 m 168 120.01 166.387 118.401 164.398 118.401 c 162.41 118.401
 160.801 120.01 160.801 121.998 c 160.801 123.987 162.41 125.6 164.398 125.6
 c 166.387 125.6 168 123.987 168 121.998 c h
168 121.998 m f
0.752941 0.223529 0.168627 rg
55.906 105.702 m 55.906 114.229 64.074 118.799 74.152 118.799 c 84.23 118.799
 92.398 114.229 92.398 105.702 c 92.398 97.174 84.23 90.26 74.152 90.26 
c 64.074 90.26 55.906 97.174 55.906 105.702 c h
55.906 105.702 m f
143.297 109.846 m 143.297 114.545 147.801 117.065 153.355 117.065 c 158.906
 117.065 163.41 114.545 163.41 109.846 c 163.41 105.147 158.906 101.334 
153.355 101.334 c 147.801 101.334 143.297 105.147 143.297 109.846 c h
143.297 109.846 m f
0.34902 0.568627 0.235294 rg
118.801 109.811 m 118.801 107.487 116.914 105.6 114.59 105.6 c 112.266 
105.6 110.379 107.487 110.379 109.811 c 110.379 112.135 112.266 114.022 
114.59 114.022 c 116.914 114.022 118.801 112.135 118.801 109.811 c h
118.801 109.811 m f
139.012 109.811 m 139.012 107.487 137.125 105.6 134.801 105.6 c 132.477
 105.6 130.59 107.487 130.59 109.811 c 130.59 112.135 132.477 114.022 134.801
 114.022 c 137.125 114.022 139.012 112.135 139.012 109.811 c h
139.012 109.811 m f
0.180392 0.8 0.443137 rg
132 109.811 m 132 107.487 130.113 105.6 127.789 105.6 c 125.465 105.6 123.578
 107.487 123.578 109.811 c 123.578 112.135 125.465 114.022 127.789 114.022
 c 130.113 114.022 132 112.135 132 109.811 c h
132 109.811 m f
Q Q
showpage
%%Trailer
end restore
%%EOF
