%!PS-Adobe-3.0 EPSF-3.0
%%Creator: cairo 1.14.2 (http://cairographics.org)
%%CreationDate: Tue Jun 21 12:28:42 2016
%%Pages: 1
%%DocumentData: Clean7Bit
%%LanguageLevel: 2
%%BoundingBox: 0 -1 238 238
%%EndComments
%%BeginProlog
save
50 dict begin
/q { gsave } bind def
/Q { grestore } bind def
/cm { 6 array astore concat } bind def
/w { setlinewidth } bind def
/J { setlinecap } bind def
/j { setlinejoin } bind def
/M { setmiterlimit } bind def
/d { setdash } bind def
/m { moveto } bind def
/l { lineto } bind def
/c { curveto } bind def
/h { closepath } bind def
/re { exch dup neg 3 1 roll 5 3 roll moveto 0 rlineto
      0 exch rlineto 0 rlineto closepath } bind def
/S { stroke } bind def
/f { fill } bind def
/f* { eofill } bind def
/n { newpath } bind def
/W { clip } bind def
/W* { eoclip } bind def
/BT { } bind def
/ET { } bind def
/pdfmark where { pop globaldict /?pdfmark /exec load put }
    { globaldict begin /?pdfmark /pop load def /pdfmark
    /cleartomark load def end } ifelse
/BDC { mark 3 1 roll /BDC pdfmark } bind def
/EMC { mark /EMC pdfmark } bind def
/cairo_store_point { /cairo_point_y exch def /cairo_point_x exch def } def
/Tj { show currentpoint cairo_store_point } bind def
/TJ {
  {
    dup
    type /stringtype eq
    { show } { -0.001 mul 0 cairo_font_matrix dtransform rmoveto } ifelse
  } forall
  currentpoint cairo_store_point
} bind def
/cairo_selectfont { cairo_font_matrix aload pop pop pop 0 0 6 array astore
    cairo_font exch selectfont cairo_point_x cairo_point_y moveto } bind def
/Tf { pop /cairo_font exch def /cairo_font_matrix where
      { pop cairo_selectfont } if } bind def
/Td { matrix translate cairo_font_matrix matrix concatmatrix dup
      /cairo_font_matrix exch def dup 4 get exch 5 get cairo_store_point
      /cairo_font where { pop cairo_selectfont } if } bind def
/Tm { 2 copy 8 2 roll 6 array astore /cairo_font_matrix exch def
      cairo_store_point /cairo_font where { pop cairo_selectfont } if } bind def
/g { setgray } bind def
/rg { setrgbcolor } bind def
/d1 { setcachedevice } bind def
%%EndProlog
%%BeginSetup
%%EndSetup
%%Page: 1 1
%%BeginPageSetup
%%PageBoundingBox: 0 -1 238 238
%%EndPageSetup
q 0 -1 238 239 rectclip q
0.647059 0.776471 0.231373 rg
237.602 118.799 m 237.602 53.19 184.41 -0.002 118.801 -0.002 c 53.188 -0.002
 0 53.19 0 118.799 c 0 184.413 53.188 237.6 118.801 237.6 c 184.41 237.6
 237.602 184.413 237.602 118.799 c h
237.602 118.799 m f
0.533333 0.6 0.12549 rg
176.363 158.627 m 68.73 59.26 l 127.664 0.33 l 182.523 4.373 227.02 45.678
 235.953 99.034 c h
176.363 158.627 m f
0.184314 0.498039 0.25098 rg
102.719 56.663 m 86.883 53.194 l 74.816 50.549 63.309 60.561 61.18 75.553
 c 53.141 132.209 l 51.012 147.198 59.07 161.495 71.137 164.139 c 86.973
 167.608 l 99.039 170.252 110.543 160.241 112.672 145.248 c 120.711 88.592
 l 122.84 73.6 114.781 59.307 102.719 56.663 c h
102.719 56.663 m f
134.883 56.663 m 150.719 53.194 l 162.785 50.549 174.293 60.561 176.418
 75.553 c 184.461 132.209 l 186.59 147.198 178.531 161.495 166.465 164.139
 c 150.629 167.608 l 138.562 170.252 127.055 160.241 124.93 145.248 c 116.887
 88.592 l 114.758 73.6 122.816 59.307 134.883 56.663 c h
134.883 56.663 m f
0.137255 0.266667 0.172549 rg
118.801 153.6 m 118.27 153.6 117.727 153.686 117.199 153.873 c 114.699 
154.76 113.391 157.502 114.273 160.002 c 122.641 183.627 104.211 193.319
 103.426 193.721 c 101.062 194.924 100.121 197.811 101.324 200.174 c 102.523
 202.538 105.41 203.479 107.777 202.276 c 117.055 197.561 132.242 181.979
 123.324 156.795 c 122.629 154.83 120.777 153.6 118.801 153.6 c h
118.801 153.6 m f
0.203922 0.372549 0.254902 rg
124.598 52.799 m 113.004 52.799 l 98.602 52.799 86.926 64.475 86.926 78.877
 c 86.926 145.522 l 86.926 159.924 98.602 171.6 113.004 171.6 c 124.598 
171.6 l 138.996 171.6 150.672 159.924 150.672 145.522 c 150.672 78.877 l
 150.672 64.475 139 52.799 124.598 52.799 c h
124.598 52.799 m f
0.176471 0.313726 0.211765 rg
124.598 171.6 m 119.734 171.6 l 119.734 52.799 l 124.598 52.799 l 138.996
 52.799 150.672 64.475 150.672 78.877 c 150.672 145.522 l 150.672 159.924
 139 171.6 124.598 171.6 c h
124.598 171.6 m f
Q Q
showpage
%%Trailer
end restore
%%EOF
