%!PS-Adobe-3.0 EPSF-3.0
%%Creator: cairo 1.14.2 (http://cairographics.org)
%%CreationDate: Tue Jun 21 12:30:32 2016
%%Pages: 1
%%DocumentData: Clean7Bit
%%LanguageLevel: 2
%%BoundingBox: 0 -1 238 238
%%EndComments
%%BeginProlog
save
50 dict begin
/q { gsave } bind def
/Q { grestore } bind def
/cm { 6 array astore concat } bind def
/w { setlinewidth } bind def
/J { setlinecap } bind def
/j { setlinejoin } bind def
/M { setmiterlimit } bind def
/d { setdash } bind def
/m { moveto } bind def
/l { lineto } bind def
/c { curveto } bind def
/h { closepath } bind def
/re { exch dup neg 3 1 roll 5 3 roll moveto 0 rlineto
      0 exch rlineto 0 rlineto closepath } bind def
/S { stroke } bind def
/f { fill } bind def
/f* { eofill } bind def
/n { newpath } bind def
/W { clip } bind def
/W* { eoclip } bind def
/BT { } bind def
/ET { } bind def
/pdfmark where { pop globaldict /?pdfmark /exec load put }
    { globaldict begin /?pdfmark /pop load def /pdfmark
    /cleartomark load def end } ifelse
/BDC { mark 3 1 roll /BDC pdfmark } bind def
/EMC { mark /EMC pdfmark } bind def
/cairo_store_point { /cairo_point_y exch def /cairo_point_x exch def } def
/Tj { show currentpoint cairo_store_point } bind def
/TJ {
  {
    dup
    type /stringtype eq
    { show } { -0.001 mul 0 cairo_font_matrix dtransform rmoveto } ifelse
  } forall
  currentpoint cairo_store_point
} bind def
/cairo_selectfont { cairo_font_matrix aload pop pop pop 0 0 6 array astore
    cairo_font exch selectfont cairo_point_x cairo_point_y moveto } bind def
/Tf { pop /cairo_font exch def /cairo_font_matrix where
      { pop cairo_selectfont } if } bind def
/Td { matrix translate cairo_font_matrix matrix concatmatrix dup
      /cairo_font_matrix exch def dup 4 get exch 5 get cairo_store_point
      /cairo_font where { pop cairo_selectfont } if } bind def
/Tm { 2 copy 8 2 roll 6 array astore /cairo_font_matrix exch def
      cairo_store_point /cairo_font where { pop cairo_selectfont } if } bind def
/g { setgray } bind def
/rg { setrgbcolor } bind def
/d1 { setcachedevice } bind def
%%EndProlog
%%BeginSetup
%%EndSetup
%%Page: 1 1
%%BeginPageSetup
%%PageBoundingBox: 0 -1 238 238
%%EndPageSetup
q 0 -1 238 239 rectclip q
0.752941 0.223529 0.168627 rg
237.602 118.799 m 237.602 53.19 184.41 -0.002 118.801 -0.002 c 53.188 -0.002
 0 53.19 0 118.799 c 0 184.413 53.188 237.6 118.801 237.6 c 184.41 237.6
 237.602 184.413 237.602 118.799 c h
237.602 118.799 m f
0.627451 0.145098 0.121569 rg
237.137 129.272 m 184.457 182.002 l 116.543 28.62 l 142.34 2.338 l 196.676
 13.26 237.602 61.248 237.602 118.799 c 237.602 122.33 237.438 125.819 237.137
 129.272 c h
237.137 129.272 m f
0.835294 0.760784 0.584314 rg
50.801 163.987 m 64.277 187.592 89.672 203.514 118.801 203.514 c 147.93
 203.514 173.32 187.592 186.801 163.987 c 123.73 31.26 l 121.754 27.104 
115.844 27.104 113.871 31.26 c h
50.801 163.987 m f
0.768627 0.67451 0.486275 rg
118.801 203.514 m 118.711 203.514 118.621 203.51 118.535 203.51 c 118.535
 28.159 l 120.594 28.061 122.699 29.088 123.73 31.256 c 186.801 163.987 
l 173.32 187.592 147.93 203.514 118.801 203.514 c h
118.801 203.514 m f
0.47451 0.188235 0.164706 rg
105.602 145.202 m 105.602 137.909 99.691 131.998 92.398 131.998 c 85.109
 131.998 79.199 137.909 79.199 145.202 c 79.199 152.491 85.109 158.401 92.398
 158.401 c 99.691 158.401 105.602 152.491 105.602 145.202 c h
105.602 145.202 m f
0.419608 0.141176 0.12549 rg
145.199 105.6 m 145.199 98.311 139.289 92.401 132 92.401 c 124.711 92.401
 118.801 98.311 118.801 105.6 c 118.801 112.889 124.711 118.799 132 118.799
 c 139.289 118.799 145.199 112.889 145.199 105.6 c h
145.199 105.6 m f
158.398 171.6 m 158.398 164.311 152.488 158.401 145.199 158.401 c 137.91
 158.401 132 164.311 132 171.6 c 132 178.889 137.91 184.799 145.199 184.799
 c 152.488 184.799 158.398 178.889 158.398 171.6 c h
158.398 171.6 m f
0.941176 0.870588 0.705882 rg
110.406 124.444 m 105.965 128.424 99.137 128.049 95.156 123.608 c 92.488
 120.631 95.016 120.194 98.309 119.03 c 93.562 113.737 l 92.684 112.756 
92.766 111.248 93.746 110.37 c 98.238 106.346 l 99.219 105.467 100.727 105.549
 101.605 106.53 c 106.352 111.823 l 107.863 108.678 108.574 106.217 111.242
 109.194 c 115.223 113.635 114.848 120.463 110.406 124.444 c h
110.406 124.444 m f
144.438 148.135 m 139.172 145.33 137.176 138.791 139.977 133.526 c 141.855
 129.998 143.137 132.217 145.359 134.909 c 148.699 128.635 l 149.316 127.471
 150.762 127.03 151.926 127.651 c 157.246 130.479 l 158.41 131.1 158.852
 132.545 158.23 133.709 c 154.891 139.983 l 158.367 140.323 160.922 140.143
 159.043 143.674 c 156.242 148.94 149.703 150.936 144.438 148.135 c h
144.438 148.135 m f
101.223 180.944 m 98.375 183.092 94.324 182.53 92.176 179.682 c 90.734 
177.772 92.262 177.639 94.281 177.112 c 91.723 173.721 l 91.246 173.092 
91.371 172.194 92 171.721 c 94.875 169.549 l 95.504 169.073 96.398 169.198
 96.875 169.827 c 99.438 173.221 l 100.496 171.424 101.043 169.991 102.484
 171.897 c 104.633 174.745 104.066 178.795 101.223 180.944 c h
101.223 180.944 m f
128.59 64.483 m 125.742 66.631 121.691 66.069 119.543 63.221 c 118.102 
61.311 119.629 61.178 121.648 60.651 c 119.09 57.26 l 118.613 56.631 118.738
 55.733 119.367 55.26 c 122.242 53.088 l 122.871 52.612 123.766 52.737 124.242
 53.366 c 126.805 56.76 l 127.863 54.963 128.41 53.53 129.852 55.436 c 132
 58.284 131.434 62.334 128.59 64.483 c h
128.59 64.483 m f
0.556863 0.690196 0.129412 rg
114.422 160.998 m 109.977 160.998 l 108.996 160.998 108.199 161.795 108.199
 162.776 c 108.199 167.221 l 108.199 168.205 108.996 168.998 109.977 168.998
 c 114.422 168.998 l 115.402 168.998 116.199 168.205 116.199 167.221 c 116.199
 162.776 l 116.199 161.795 115.402 160.998 114.422 160.998 c h
114.422 160.998 m f
130.223 123.998 m 125.777 123.998 l 124.797 123.998 124 124.795 124 125.776
 c 124 130.221 l 124 131.205 124.797 131.998 125.777 131.998 c 130.223 131.998
 l 131.203 131.998 132 131.205 132 130.221 c 132 125.776 l 132 124.795 131.203
 123.998 130.223 123.998 c h
130.223 123.998 m f
169.824 150.401 m 165.379 150.401 l 164.395 150.401 163.602 151.198 163.602
 152.178 c 163.602 156.623 l 163.602 157.604 164.395 158.401 165.379 158.401
 c 169.824 158.401 l 170.805 158.401 171.602 157.604 171.602 156.623 c 171.602
 152.178 l 171.602 151.198 170.805 150.401 169.824 150.401 c h
169.824 150.401 m f
85.422 118.799 m 80.977 118.799 l 79.996 118.799 79.199 119.596 79.199 
120.577 c 79.199 125.022 l 79.199 126.002 79.996 126.799 80.977 126.799 
c 85.422 126.799 l 86.402 126.799 87.199 126.002 87.199 125.022 c 87.199
 120.577 l 87.199 119.596 86.402 118.799 85.422 118.799 c h
85.422 118.799 m f
119.066 73.545 m 115.648 70.705 l 114.895 70.077 113.773 70.178 113.145
 70.932 c 110.305 74.35 l 109.676 75.104 109.777 76.225 110.535 76.854 c
 113.949 79.698 l 114.703 80.323 115.828 80.221 116.453 79.467 c 119.297
 76.049 l 119.926 75.295 119.82 74.174 119.066 73.545 c h
119.066 73.545 m f
0.556863 0.447059 0.368627 rg
195.887 159.166 m 193.434 157.311 189.938 157.92 188.234 160.483 c 173.301
 182.932 147.785 197.741 118.801 197.741 c 89.812 197.741 64.301 182.932
 49.367 160.483 c 47.664 157.92 44.164 157.311 41.715 159.166 c 39.492 160.846
 38.941 163.959 40.449 166.303 c 57.02 192.045 85.906 209.108 118.801 209.108
 c 151.691 209.108 180.582 192.045 197.152 166.303 c 198.66 163.959 198.109
 160.846 195.887 159.166 c h
195.887 159.166 m f
0.498039 0.372549 0.286275 rg
197.152 166.303 m 180.582 192.045 151.691 209.108 118.801 209.108 c 118.711
 209.108 118.621 209.104 118.535 209.104 c 118.535 197.733 l 118.621 197.733
 118.711 197.737 118.801 197.737 c 147.785 197.737 173.301 182.932 188.234
 160.479 c 189.938 157.92 193.434 157.311 195.887 159.166 c 198.109 160.846
 198.66 163.959 197.152 166.303 c h
197.152 166.303 m f
Q Q
showpage
%%Trailer
end restore
%%EOF
