%!PS-Adobe-3.0 EPSF-3.0
%%Creator: cairo 1.14.2 (http://cairographics.org)
%%CreationDate: Tue Jun 21 12:27:16 2016
%%Pages: 1
%%DocumentData: Clean7Bit
%%LanguageLevel: 2
%%BoundingBox: 0 -1 238 238
%%EndComments
%%BeginProlog
save
50 dict begin
/q { gsave } bind def
/Q { grestore } bind def
/cm { 6 array astore concat } bind def
/w { setlinewidth } bind def
/J { setlinecap } bind def
/j { setlinejoin } bind def
/M { setmiterlimit } bind def
/d { setdash } bind def
/m { moveto } bind def
/l { lineto } bind def
/c { curveto } bind def
/h { closepath } bind def
/re { exch dup neg 3 1 roll 5 3 roll moveto 0 rlineto
      0 exch rlineto 0 rlineto closepath } bind def
/S { stroke } bind def
/f { fill } bind def
/f* { eofill } bind def
/n { newpath } bind def
/W { clip } bind def
/W* { eoclip } bind def
/BT { } bind def
/ET { } bind def
/pdfmark where { pop globaldict /?pdfmark /exec load put }
    { globaldict begin /?pdfmark /pop load def /pdfmark
    /cleartomark load def end } ifelse
/BDC { mark 3 1 roll /BDC pdfmark } bind def
/EMC { mark /EMC pdfmark } bind def
/cairo_store_point { /cairo_point_y exch def /cairo_point_x exch def } def
/Tj { show currentpoint cairo_store_point } bind def
/TJ {
  {
    dup
    type /stringtype eq
    { show } { -0.001 mul 0 cairo_font_matrix dtransform rmoveto } ifelse
  } forall
  currentpoint cairo_store_point
} bind def
/cairo_selectfont { cairo_font_matrix aload pop pop pop 0 0 6 array astore
    cairo_font exch selectfont cairo_point_x cairo_point_y moveto } bind def
/Tf { pop /cairo_font exch def /cairo_font_matrix where
      { pop cairo_selectfont } if } bind def
/Td { matrix translate cairo_font_matrix matrix concatmatrix dup
      /cairo_font_matrix exch def dup 4 get exch 5 get cairo_store_point
      /cairo_font where { pop cairo_selectfont } if } bind def
/Tm { 2 copy 8 2 roll 6 array astore /cairo_font_matrix exch def
      cairo_store_point /cairo_font where { pop cairo_selectfont } if } bind def
/g { setgray } bind def
/rg { setrgbcolor } bind def
/d1 { setcachedevice } bind def
%%EndProlog
%%BeginSetup
%%EndSetup
%%Page: 1 1
%%BeginPageSetup
%%PageBoundingBox: 0 -1 238 238
%%EndPageSetup
q 0 -1 238 239 rectclip q
0.682353 0.588235 0.462745 rg
237.602 118.8 m 237.602 53.191 184.41 -0.001 118.801 -0.001 c 53.188 -0.001
 0 53.191 0 118.8 c 0 184.413 53.188 237.601 118.801 237.601 c 184.41 237.601
 237.602 184.413 237.602 118.8 c h
237.602 118.8 m f
0.537255 0.447059 0.337255 rg
237.293 127.331 m 168.902 195.722 l 67.902 42.593 l 110.184 0.312 l 113.027
 0.109 115.902 -0.001 118.801 -0.001 c 184.41 -0.001 237.602 53.191 237.602
 118.8 c 237.598 121.671 237.492 124.511 237.293 127.331 c h
237.293 127.331 m f
0.388235 0.290196 0.223529 rg
74.266 39.601 m 163.332 39.601 l 167.898 39.601 171.602 43.3 171.602 47.866
 c 171.602 189.734 l 171.602 194.3 167.898 197.999 163.332 197.999 c 74.266
 197.999 l 69.703 197.999 66 194.3 66 189.734 c 66 47.866 l 66 43.3 69.699
 39.601 74.266 39.601 c h
74.266 39.601 m f
0.329412 0.247059 0.192157 rg
163.332 197.999 m 118.535 197.999 l 118.535 39.601 l 163.332 39.601 l 167.898
 39.601 171.602 43.3 171.602 47.866 c 171.602 189.734 l 171.602 194.3 167.898
 197.999 163.332 197.999 c h
163.332 197.999 m f
0.298039 0.184314 0.0823529 rg
90 197.999 4.801 -52.797 re f
116.398 197.999 4.801 -66 re f
142.801 197.999 4.801 -66 re f
66 173.999 105.602 -4.797 re f
66 147.601 105.602 -4.801 re f
0.47451 0.188235 0.164706 rg
66 154.304 m 66 47.866 l 66 43.3 69.699 39.601 74.266 39.601 c 163.332 
39.601 l 167.898 39.601 171.598 43.3 171.598 47.866 c 171.598 130.937 l 
h
66 154.304 m f
0.427451 0.160784 0.145098 rg
118.535 142.679 m 118.535 39.601 l 163.332 39.601 l 167.898 39.601 171.602
 43.3 171.602 47.866 c 171.602 130.937 l h
118.535 142.679 m f
0.721569 0.337255 0.152941 rg
92.398 92.402 52.801 -26.402 re f
0.666667 0.286275 0.133333 rg
118.535 92.402 26.664 -26.402 re f
Q Q
showpage
%%Trailer
end restore
%%EOF
