%!PS-Adobe-3.0 EPSF-3.0
%%Creator: cairo 1.14.2 (http://cairographics.org)
%%CreationDate: Tue Jun 21 12:30:59 2016
%%Pages: 1
%%DocumentData: Clean7Bit
%%LanguageLevel: 2
%%BoundingBox: 0 -1 238 238
%%EndComments
%%BeginProlog
save
50 dict begin
/q { gsave } bind def
/Q { grestore } bind def
/cm { 6 array astore concat } bind def
/w { setlinewidth } bind def
/J { setlinecap } bind def
/j { setlinejoin } bind def
/M { setmiterlimit } bind def
/d { setdash } bind def
/m { moveto } bind def
/l { lineto } bind def
/c { curveto } bind def
/h { closepath } bind def
/re { exch dup neg 3 1 roll 5 3 roll moveto 0 rlineto
      0 exch rlineto 0 rlineto closepath } bind def
/S { stroke } bind def
/f { fill } bind def
/f* { eofill } bind def
/n { newpath } bind def
/W { clip } bind def
/W* { eoclip } bind def
/BT { } bind def
/ET { } bind def
/pdfmark where { pop globaldict /?pdfmark /exec load put }
    { globaldict begin /?pdfmark /pop load def /pdfmark
    /cleartomark load def end } ifelse
/BDC { mark 3 1 roll /BDC pdfmark } bind def
/EMC { mark /EMC pdfmark } bind def
/cairo_store_point { /cairo_point_y exch def /cairo_point_x exch def } def
/Tj { show currentpoint cairo_store_point } bind def
/TJ {
  {
    dup
    type /stringtype eq
    { show } { -0.001 mul 0 cairo_font_matrix dtransform rmoveto } ifelse
  } forall
  currentpoint cairo_store_point
} bind def
/cairo_selectfont { cairo_font_matrix aload pop pop pop 0 0 6 array astore
    cairo_font exch selectfont cairo_point_x cairo_point_y moveto } bind def
/Tf { pop /cairo_font exch def /cairo_font_matrix where
      { pop cairo_selectfont } if } bind def
/Td { matrix translate cairo_font_matrix matrix concatmatrix dup
      /cairo_font_matrix exch def dup 4 get exch 5 get cairo_store_point
      /cairo_font where { pop cairo_selectfont } if } bind def
/Tm { 2 copy 8 2 roll 6 array astore /cairo_font_matrix exch def
      cairo_store_point /cairo_font where { pop cairo_selectfont } if } bind def
/g { setgray } bind def
/rg { setrgbcolor } bind def
/d1 { setcachedevice } bind def
%%EndProlog
%%BeginSetup
%%EndSetup
%%Page: 1 1
%%BeginPageSetup
%%PageBoundingBox: 0 -1 238 238
%%EndPageSetup
q 0 -1 238 239 rectclip q
0.47451 0.188235 0.164706 rg
237.602 118.799 m 237.602 53.19 184.41 -0.002 118.801 -0.002 c 53.188 -0.002
 0 53.19 0 118.799 c 0 184.413 53.188 237.6 118.801 237.6 c 184.41 237.6
 237.602 184.413 237.602 118.799 c h
237.602 118.799 m f
0.34902 0.105882 0.0941176 rg
193.785 154.202 m 48.258 97.491 l 143.23 2.522 l 194.547 13.248 233.695
 57.088 237.316 110.67 c h
193.785 154.202 m f
1 0.658824 0 rg
193.785 154.202 m 192.008 155.979 188.523 155.483 185.336 153.233 c 166.555
 167.151 135.68 161.69 113.621 139.627 c 91.559 117.565 86.098 86.694 100.016
 67.909 c 97.762 64.725 97.266 61.237 99.043 59.459 c 100.82 57.682 104.309
 58.178 107.496 60.432 c 126.277 46.51 157.148 51.975 179.211 74.038 c 201.273
 96.1 206.734 126.971 192.816 145.752 c 195.066 148.94 195.562 152.428 193.785
 154.202 c h
193.785 154.202 m f
1 0.803922 0.00784314 rg
126.18 177.842 m 141.426 153.268 133.863 120.983 109.289 105.737 c 84.711
 90.491 52.43 98.053 37.18 122.631 c h
126.18 177.842 m f
82.551 150.776 m 82.52 150.756 l 82.566 150.745 l h
82.551 150.776 m f
0.827451 0.556863 0.0196078 rg
81.777 96.26 m 77.816 96.26 73.832 96.698 69.875 97.588 c 69.461 97.678
 69.098 97.936 68.871 98.299 c 68.645 98.659 68.57 99.096 68.668 99.514 
c 80.73 150.979 l 80.824 151.393 81.082 151.748 81.445 151.971 c 81.676 
152.116 l 82.027 152.334 82.445 152.409 82.848 152.323 c 82.895 152.311 
l 83.336 152.221 83.715 151.948 83.941 151.565 c 110.691 106.573 l 111.133
 105.827 110.902 104.87 110.176 104.405 c 101.508 99.026 91.723 96.26 81.777
 96.26 c h
72.16 100.381 m 84.215 98.069 96.516 100.151 107.125 106.307 c 83.039 146.819
 l h
72.16 100.381 m f
0.898039 0.576471 0.0117647 rg
192.816 145.752 m 195.066 148.94 195.562 152.428 193.785 154.202 c 192.008
 155.979 188.523 155.483 185.336 153.233 c 167.91 166.147 140.082 162.366
 118.535 144.135 c 118.535 54.846 l 136.969 48.991 161.066 55.893 179.211
 74.038 c 201.273 96.096 206.734 126.971 192.816 145.752 c h
192.816 145.752 m f
1 0.803922 0.00784314 rg
126.18 177.842 m 82.551 150.776 l 82.566 150.745 l 82.52 150.756 l 82.289
 150.612 l 37.184 122.631 l 44.902 110.19 56.988 102.116 70.227 99.147 c
 83.141 96.252 97.152 98.209 109.289 105.737 c 109.297 105.741 109.305 105.748
 109.316 105.752 c 122.281 113.807 130.5 126.604 133.133 140.506 c 135.484
 152.936 133.375 166.248 126.18 177.842 c h
126.18 177.842 m f
0.909804 0.737255 0.0117647 rg
126.18 177.842 m 118.535 173.1 l 118.535 113.034 l 126.207 120.623 131.191
 130.264 133.133 140.506 c 135.484 152.936 133.375 166.248 126.18 177.842
 c h
126.18 177.842 m f
0.827451 0.556863 0.0196078 rg
28.922 119.389 m 28.172 118.924 27.938 117.936 28.406 117.186 c 37.234 
102.955 51.074 93.014 67.379 89.194 c 72.168 88.073 77 87.518 81.801 87.518
 c 93.34 87.518 104.68 90.725 114.73 96.959 c 144.109 115.186 153.18 153.913
 134.957 183.288 c 134.734 183.647 134.375 183.905 133.961 184.002 c 133.551
 184.1 133.113 184.03 132.754 183.803 c h
121.922 173.319 m 127.191 164.155 129.145 153.659 127.547 143.272 c 86.789
 151.522 l h
126.961 140.123 m 126.926 139.967 126.898 139.811 126.863 139.655 c 124.168
 128.155 117.352 118.319 107.605 111.76 c 85.785 148.463 l h
83.039 146.819 m 104.887 110.069 l 94.957 104.327 83.707 102.67 73.16 104.647
 c h
70.039 105.354 m 59.371 108.12 49.672 114.647 43.129 124.436 c 79.848 147.217
 l h
70.039 105.354 m f
0.729412 0.470588 0.00784314 rg
134.957 183.288 m 134.734 183.647 134.375 183.905 133.961 184.002 c 133.551
 184.1 133.113 184.03 132.754 183.803 c 118.535 174.983 l 118.535 171.217
 l 121.922 173.319 l 127.191 164.155 129.145 153.659 127.547 143.272 c 118.535
 145.096 l 118.535 141.83 l 126.961 140.123 l 126.926 139.967 126.898 139.811
 126.863 139.655 c 125.336 133.139 122.488 127.163 118.535 122.01 c 118.535
 99.538 l 144.852 118.639 152.367 155.225 134.957 183.288 c h
134.957 183.288 m f
Q Q
showpage
%%Trailer
end restore
%%EOF
