%!PS-Adobe-3.0 EPSF-3.0
%%Creator: cairo 1.14.2 (http://cairographics.org)
%%CreationDate: Tue Jun 21 12:26:23 2016
%%Pages: 1
%%DocumentData: Clean7Bit
%%LanguageLevel: 2
%%BoundingBox: 0 -1 238 238
%%EndComments
%%BeginProlog
save
50 dict begin
/q { gsave } bind def
/Q { grestore } bind def
/cm { 6 array astore concat } bind def
/w { setlinewidth } bind def
/J { setlinecap } bind def
/j { setlinejoin } bind def
/M { setmiterlimit } bind def
/d { setdash } bind def
/m { moveto } bind def
/l { lineto } bind def
/c { curveto } bind def
/h { closepath } bind def
/re { exch dup neg 3 1 roll 5 3 roll moveto 0 rlineto
      0 exch rlineto 0 rlineto closepath } bind def
/S { stroke } bind def
/f { fill } bind def
/f* { eofill } bind def
/n { newpath } bind def
/W { clip } bind def
/W* { eoclip } bind def
/BT { } bind def
/ET { } bind def
/pdfmark where { pop globaldict /?pdfmark /exec load put }
    { globaldict begin /?pdfmark /pop load def /pdfmark
    /cleartomark load def end } ifelse
/BDC { mark 3 1 roll /BDC pdfmark } bind def
/EMC { mark /EMC pdfmark } bind def
/cairo_store_point { /cairo_point_y exch def /cairo_point_x exch def } def
/Tj { show currentpoint cairo_store_point } bind def
/TJ {
  {
    dup
    type /stringtype eq
    { show } { -0.001 mul 0 cairo_font_matrix dtransform rmoveto } ifelse
  } forall
  currentpoint cairo_store_point
} bind def
/cairo_selectfont { cairo_font_matrix aload pop pop pop 0 0 6 array astore
    cairo_font exch selectfont cairo_point_x cairo_point_y moveto } bind def
/Tf { pop /cairo_font exch def /cairo_font_matrix where
      { pop cairo_selectfont } if } bind def
/Td { matrix translate cairo_font_matrix matrix concatmatrix dup
      /cairo_font_matrix exch def dup 4 get exch 5 get cairo_store_point
      /cairo_font where { pop cairo_selectfont } if } bind def
/Tm { 2 copy 8 2 roll 6 array astore /cairo_font_matrix exch def
      cairo_store_point /cairo_font where { pop cairo_selectfont } if } bind def
/g { setgray } bind def
/rg { setrgbcolor } bind def
/d1 { setcachedevice } bind def
%%EndProlog
%%BeginSetup
%%EndSetup
%%Page: 1 1
%%BeginPageSetup
%%PageBoundingBox: 0 -1 238 238
%%EndPageSetup
q 0 -1 238 239 rectclip q
0.235294 0.341176 0.407843 rg
237.602 118.8 m 237.602 53.191 184.41 -0.001 118.801 -0.001 c 53.188 -0.001
 0 53.191 0 118.8 c 0 184.413 53.188 237.601 118.801 237.601 c 184.41 237.601
 237.602 184.413 237.602 118.8 c h
237.602 118.8 m f
0.172549 0.243137 0.313726 rg
163.578 192.167 m 70.934 44.593 l 115.477 0.05 l 116.582 0.019 117.688 
-0.001 118.801 -0.001 c 184.195 -0.001 237.242 52.839 237.594 118.155 c 
h
163.578 192.167 m f
0.815686 0.835294 0.85098 rg
82.934 39.601 m 154.664 39.601 l 164.02 39.601 171.598 47.183 171.598 56.534
 c 171.598 154.667 l 171.598 164.019 164.02 171.601 154.664 171.601 c 82.934
 171.601 l 73.582 171.601 66 164.019 66 154.667 c 66 56.534 l 66 47.183 
73.582 39.601 82.934 39.601 c h
82.934 39.601 m f
0.701961 0.721569 0.737255 rg
154.664 171.601 m 119.066 171.601 l 119.066 39.601 l 154.664 39.601 l 164.02
 39.601 171.598 47.183 171.598 56.534 c 171.598 154.667 l 171.602 164.019
 164.02 171.601 154.664 171.601 c h
154.664 171.601 m f
0.623529 0.690196 0.737255 rg
137.199 109.999 m 113.465 104.464 89.734 105.191 66 110.624 c 66 56.534
 l 66 47.183 73.582 39.601 82.934 39.601 c 154.668 39.601 l 164.02 39.601
 171.602 47.183 171.602 56.534 c 171.602 120.878 l 159.914 119.359 149.18
 112.82 137.199 109.999 c h
137.199 109.999 m f
0.458824 0.603922 0.67451 rg
77.203 170.402 m 160.395 170.402 l 163.051 170.402 165.199 172.554 165.199
 175.206 c 165.199 188.796 l 165.199 191.448 163.047 193.601 160.395 193.601
 c 77.203 193.601 l 74.551 193.601 72.398 191.448 72.398 188.796 c 72.398
 175.206 l 72.398 172.554 74.551 170.402 77.203 170.402 c h
77.203 170.402 m f
0.494118 0.560784 0.6 rg
137.199 109.999 m 131.156 108.589 125.109 107.593 119.066 106.968 c 119.066
 39.601 l 154.668 39.601 l 164.02 39.601 171.602 47.183 171.602 56.534 c
 171.602 120.878 l 159.914 119.359 149.18 112.82 137.199 109.999 c h
137.199 109.999 m f
0.384314 0.529412 0.588235 rg
160.395 193.601 m 119.066 193.601 l 119.066 170.402 l 160.395 170.402 l
 163.047 170.402 165.199 172.554 165.199 175.206 c 165.199 188.796 l 165.199
 191.448 163.047 193.601 160.395 193.601 c h
160.395 193.601 m f
0.352941 0.517647 0.388235 rg
117.402 51.323 m 110.574 73.171 115.43 97.097 130.23 114.562 c 134.41 119.499
 140.871 120.058 143.562 116.585 c 146.285 113.105 145.41 107.839 142.41
 104.249 c 131.137 90.945 127.438 72.718 132.637 56.073 c 134 51.601 132.754
 46.405 128.891 44.265 c 125.055 42.116 119.324 45.148 117.402 51.323 c 
h
117.402 51.323 m f
0.27451 0.447059 0.317647 rg
93.98 115.054 m 109.801 98.507 116.082 74.913 110.574 52.695 c 109.027 
46.409 103.488 43.042 99.531 44.956 c 95.547 46.866 93.988 51.972 95.082
 56.523 c 99.277 73.448 94.492 91.425 82.441 104.03 c 79.23 107.433 78.043
 112.64 80.551 116.277 c 83.035 119.902 89.512 119.734 93.98 115.054 c h
93.98 115.054 m f
0.352941 0.517647 0.388235 rg
113.445 123.433 m 129.27 106.886 135.547 83.292 130.043 61.073 c 128.492
 54.792 122.953 51.421 118.996 53.335 c 115.012 55.245 113.453 60.355 114.547
 64.902 c 118.742 81.827 113.961 99.804 101.906 112.409 c 98.695 115.812
 97.508 121.019 100.016 124.655 c 102.5 128.28 108.98 128.113 113.445 123.433
 c h
113.445 123.433 m f
0.203922 0.372549 0.254902 rg
167.637 122.386 m 174.914 96.007 168.152 67.616 149.77 47.343 c 144.578
 41.613 136.84 41.202 133.762 45.46 c 130.648 49.726 131.902 55.988 135.633
 60.152 c 149.637 75.597 154.789 97.226 149.242 117.323 c 147.793 122.722
 149.492 128.878 154.191 131.284 c 158.859 133.695 165.586 129.843 167.637
 122.386 c h
167.637 122.386 m f
0.27451 0.447059 0.317647 rg
137.527 52.921 m 121.496 75.097 117.91 104.062 128.055 129.476 c 130.914
 136.659 138.023 139.745 142.395 136.835 c 146.801 133.925 147.812 127.62
 145.773 122.413 c 138.047 103.054 140.777 80.984 152.992 64.093 c 156.238
 59.538 156.797 53.179 153.23 49.28 c 149.699 45.394 142.055 46.652 137.527
 52.921 c h
137.527 52.921 m f
0.203922 0.372549 0.254902 rg
90.574 132.636 m 103.832 108.695 103.914 79.507 90.793 55.495 c 87.09 48.706
 79.664 46.495 75.672 49.909 c 71.648 53.327 71.402 59.706 74.047 64.632
 c 84.043 82.929 83.98 105.163 73.879 123.402 c 71.203 128.312 71.414 134.695
 75.422 138.132 c 79.391 141.57 86.832 139.405 90.574 132.636 c h
90.574 132.636 m f
0.27451 0.447059 0.317647 rg
110.363 55.644 m 96.949 74.195 93.949 98.425 102.438 119.683 c 104.832 
125.695 110.777 128.273 114.438 125.839 c 118.121 123.405 118.969 118.132
 117.262 113.773 c 110.797 97.577 113.082 79.12 123.301 64.988 c 126.016
 61.175 126.48 55.855 123.5 52.597 c 120.547 49.343 114.148 50.398 110.363
 55.644 c h
110.363 55.644 m f
Q Q
showpage
%%Trailer
end restore
%%EOF
