%!PS-Adobe-3.0 EPSF-3.0
%%Creator: cairo 1.14.2 (http://cairographics.org)
%%CreationDate: Tue Jun 21 12:27:41 2016
%%Pages: 1
%%DocumentData: Clean7Bit
%%LanguageLevel: 2
%%BoundingBox: 0 -1 238 238
%%EndComments
%%BeginProlog
save
50 dict begin
/q { gsave } bind def
/Q { grestore } bind def
/cm { 6 array astore concat } bind def
/w { setlinewidth } bind def
/J { setlinecap } bind def
/j { setlinejoin } bind def
/M { setmiterlimit } bind def
/d { setdash } bind def
/m { moveto } bind def
/l { lineto } bind def
/c { curveto } bind def
/h { closepath } bind def
/re { exch dup neg 3 1 roll 5 3 roll moveto 0 rlineto
      0 exch rlineto 0 rlineto closepath } bind def
/S { stroke } bind def
/f { fill } bind def
/f* { eofill } bind def
/n { newpath } bind def
/W { clip } bind def
/W* { eoclip } bind def
/BT { } bind def
/ET { } bind def
/pdfmark where { pop globaldict /?pdfmark /exec load put }
    { globaldict begin /?pdfmark /pop load def /pdfmark
    /cleartomark load def end } ifelse
/BDC { mark 3 1 roll /BDC pdfmark } bind def
/EMC { mark /EMC pdfmark } bind def
/cairo_store_point { /cairo_point_y exch def /cairo_point_x exch def } def
/Tj { show currentpoint cairo_store_point } bind def
/TJ {
  {
    dup
    type /stringtype eq
    { show } { -0.001 mul 0 cairo_font_matrix dtransform rmoveto } ifelse
  } forall
  currentpoint cairo_store_point
} bind def
/cairo_selectfont { cairo_font_matrix aload pop pop pop 0 0 6 array astore
    cairo_font exch selectfont cairo_point_x cairo_point_y moveto } bind def
/Tf { pop /cairo_font exch def /cairo_font_matrix where
      { pop cairo_selectfont } if } bind def
/Td { matrix translate cairo_font_matrix matrix concatmatrix dup
      /cairo_font_matrix exch def dup 4 get exch 5 get cairo_store_point
      /cairo_font where { pop cairo_selectfont } if } bind def
/Tm { 2 copy 8 2 roll 6 array astore /cairo_font_matrix exch def
      cairo_store_point /cairo_font where { pop cairo_selectfont } if } bind def
/g { setgray } bind def
/rg { setrgbcolor } bind def
/d1 { setcachedevice } bind def
%%EndProlog
%%BeginSetup
%%EndSetup
%%Page: 1 1
%%BeginPageSetup
%%PageBoundingBox: 0 -1 238 238
%%EndPageSetup
q 0 -1 238 239 rectclip q
0.721569 0.337255 0.152941 rg
237.602 118.799 m 237.602 53.19 184.41 -0.002 118.801 -0.002 c 53.188 -0.002
 0 53.19 0 118.799 c 0 184.413 53.188 237.6 118.801 237.6 c 184.41 237.6
 237.602 184.413 237.602 118.799 c h
237.602 118.799 m f
0.576471 0.211765 0.0823529 rg
206.203 138.85 m 194.363 129.733 180.383 125.038 165.199 121.998 c 161.199
 121.202 160.398 117.202 158 113.202 c 153.199 106.799 146 104.401 142 98.799
 c 127.602 81.202 121.199 61.998 106 45.202 c 103.602 42.799 106 37.202 
104.398 33.202 c 103.691 31.424 102.879 30.647 101.609 29.432 c 129.648 
0.498 l 186.461 5.643 231.723 50.776 237.066 107.534 c h
206.203 138.85 m f
0.941176 0.752941 0.509804 rg
112.172 44.729 m 112.293 44.846 l 115.996 41.241 121.918 41.264 125.582
 44.928 c 129.25 48.596 129.273 54.518 125.664 58.221 c 125.766 58.319 l
 129.465 54.709 135.387 54.733 139.055 58.401 c 142.719 62.065 142.742 67.987
 139.137 71.69 c 139.234 71.791 l 142.938 68.182 148.859 68.205 152.523 
71.87 c 156.191 75.538 156.215 81.459 152.605 85.159 c 152.707 85.26 l 156.406
 81.651 162.328 81.674 165.996 85.342 c 169.66 89.006 169.684 94.928 166.078
 98.631 c 166.176 98.729 l 169.875 95.123 175.801 95.147 179.465 98.811 
c 183.133 102.479 183.156 108.401 179.547 112.1 c 179.648 112.202 l 183.348
 108.592 189.27 108.62 192.938 112.284 c 196.301 115.647 196.59 120.905 
193.832 124.612 c 197.535 121.815 202.828 122.096 206.203 125.471 c 209.898
 129.166 209.898 135.159 206.203 138.854 c 202.508 142.545 196.52 142.545
 192.824 138.854 c 192.781 138.807 192.742 138.76 192.703 138.717 c 192.598
 138.823 l 192.641 138.866 192.688 138.901 192.73 138.944 c 196.426 142.639
 196.426 148.627 192.73 152.323 c 189.039 156.018 183.047 156.018 179.352
 152.323 c 179.309 152.28 179.273 152.233 179.23 152.19 c 179.129 152.291
 l 179.172 152.334 179.219 152.37 179.262 152.413 c 182.957 156.108 182.957
 162.1 179.262 165.791 c 175.566 169.487 169.578 169.487 165.883 165.791
 c 165.84 165.748 165.805 165.702 165.762 165.659 c 165.656 165.764 l 165.699
 165.803 165.746 165.842 165.793 165.885 c 169.484 169.577 169.484 175.569
 165.793 179.264 c 162.098 182.959 156.105 182.959 152.41 179.264 c 152.367
 179.221 152.332 179.174 152.289 179.127 c 152.188 179.233 l 152.23 179.276
 152.277 179.311 152.32 179.354 c 156.016 183.049 156.016 189.038 152.32
 192.733 c 148.625 196.428 142.637 196.428 138.941 192.733 c 138.898 192.69
 138.863 192.643 138.82 192.6 c 138.715 192.702 l 138.762 192.745 138.809
 192.78 138.852 192.827 c 142.543 196.518 142.543 202.51 138.852 206.205
 c 135.156 209.897 129.164 209.897 125.473 206.205 c 122.102 202.834 121.816
 197.561 124.594 193.854 c 120.887 196.631 115.613 196.346 112.242 192.975
 c 108.566 189.299 108.551 183.346 112.199 179.647 c 112.102 179.549 l 108.402
 183.198 102.453 183.186 98.773 179.506 c 95.094 175.827 95.082 169.873 
98.727 166.174 c 98.633 166.08 l 94.934 169.729 88.98 169.713 85.301 166.034
 c 81.625 162.358 81.609 156.405 85.258 152.705 c 85.16 152.608 l 81.465
 156.256 75.512 156.245 71.832 152.565 c 68.152 148.885 68.141 142.932 71.789
 139.237 c 71.691 139.139 l 67.992 142.788 62.039 142.772 58.363 139.096
 c 54.684 135.416 54.668 129.463 58.316 125.764 c 58.223 125.67 l 54.523
 129.315 48.57 129.303 44.891 125.623 c 41.211 121.944 41.199 115.995 44.848
 112.295 c 44.727 112.174 l 41.031 115.823 35.078 115.811 31.398 112.131
 c 27.703 108.436 27.703 102.448 31.398 98.752 c 35.094 95.057 41.082 95.057
 44.777 98.752 c 44.797 98.772 44.812 98.791 44.832 98.811 c 44.93 98.713
 l 44.91 98.698 44.887 98.678 44.867 98.663 c 41.176 94.967 41.176 88.975
 44.867 85.28 c 48.562 81.588 54.555 81.588 58.246 85.28 c 58.266 85.299
 58.281 85.323 58.301 85.342 c 58.398 85.245 l 58.379 85.225 58.359 85.209
 58.34 85.19 c 54.645 81.495 54.645 75.506 58.34 71.811 c 62.035 68.116 
68.023 68.116 71.719 71.811 c 71.738 71.83 71.754 71.85 71.773 71.87 c 71.871
 71.776 l 71.852 71.756 71.828 71.741 71.809 71.721 c 68.113 68.026 68.113
 62.034 71.809 58.342 c 75.504 54.647 81.496 54.647 85.188 58.342 c 85.207
 58.362 85.223 58.381 85.242 58.401 c 85.34 58.303 l 85.32 58.284 85.301
 58.268 85.281 58.248 c 81.586 54.557 81.586 48.565 85.281 44.87 c 88.973
 41.174 94.965 41.174 98.66 44.87 c 98.68 44.889 98.695 44.909 98.715 44.932
 c 98.809 44.834 l 98.793 44.815 98.77 44.799 98.75 44.78 c 95.055 41.084
 95.055 35.096 98.75 31.401 c 102.445 27.705 108.434 27.705 112.129 31.401
 c 115.809 35.077 115.82 41.03 112.172 44.729 c h
112.172 44.729 m f
0.827451 0.635294 0.423529 rg
206.203 138.85 m 202.508 142.545 196.516 142.545 192.824 138.85 c 192.777
 138.807 192.742 138.76 192.699 138.717 c 192.598 138.819 l 192.641 138.862
 192.688 138.897 192.73 138.94 c 196.426 142.635 196.426 148.627 192.73 
152.319 c 189.035 156.014 183.047 156.014 179.352 152.319 c 179.309 152.276
 179.273 152.229 179.23 152.186 c 179.125 152.291 l 179.172 152.33 179.219
 152.37 179.262 152.413 c 182.957 156.104 182.957 162.096 179.262 165.791
 c 175.566 169.487 169.574 169.487 165.883 165.791 c 165.84 165.748 165.801
 165.702 165.762 165.655 c 165.656 165.76 l 165.699 165.803 165.746 165.838
 165.789 165.881 c 169.484 169.577 169.484 175.565 165.789 179.26 c 162.098
 182.955 156.105 182.955 152.41 179.26 c 152.367 179.217 152.332 179.17 
152.289 179.127 c 152.188 179.229 l 152.23 179.272 152.277 179.307 152.32
 179.354 c 156.016 183.045 156.016 189.038 152.32 192.733 c 148.625 196.424
 142.637 196.424 138.941 192.733 c 138.898 192.69 138.863 192.639 138.82
 192.596 c 138.715 192.702 l 138.758 192.745 138.805 192.78 138.848 192.823
 c 142.543 196.518 142.543 202.506 138.848 206.202 c 135.156 209.897 129.164
 209.897 125.469 206.202 c 122.102 202.83 121.812 197.557 124.594 193.85
 c 122.656 195.303 120.297 195.909 118 195.686 c 118 42.205 l 120.711 41.948
 123.508 42.854 125.582 44.928 c 129.25 48.596 129.273 54.518 125.664 58.221
 c 125.766 58.319 l 129.465 54.709 135.387 54.733 139.055 58.401 c 142.719
 62.065 142.742 67.987 139.137 71.69 c 139.234 71.788 l 142.938 68.182 148.859
 68.205 152.523 71.87 c 156.191 75.538 156.215 81.459 152.605 85.159 c 152.707
 85.26 l 156.406 81.651 162.328 81.674 165.996 85.342 c 169.664 89.006 169.688
 94.928 166.078 98.631 c 166.176 98.729 l 169.879 95.123 175.801 95.147 
179.465 98.811 c 183.133 102.479 183.156 108.401 179.547 112.1 c 179.648
 112.202 l 183.348 108.592 189.27 108.62 192.938 112.284 c 196.301 115.647
 196.59 120.905 193.832 124.612 c 197.539 121.815 202.828 122.096 206.203
 125.471 c 209.898 129.166 209.898 135.155 206.203 138.85 c h
206.203 138.85 m f
0.313726 0.231373 0.172549 rg
136.613 167.084 m 136.613 165.291 135.16 163.834 133.363 163.834 c 131.566
 163.834 130.109 165.291 130.109 167.084 c 130.109 168.881 131.566 170.338
 133.363 170.338 c 135.16 170.338 136.613 168.881 136.613 167.084 c h
136.613 167.084 m f
153.477 150.225 m 153.477 148.428 152.02 146.971 150.223 146.971 c 148.43
 146.971 146.973 148.428 146.973 150.225 c 146.973 152.022 148.43 153.475
 150.223 153.475 c 152.02 153.475 153.477 152.022 153.477 150.225 c h
153.477 150.225 m f
172.637 131.065 m 172.637 129.268 171.18 127.811 169.387 127.811 c 167.59
 127.811 166.133 129.268 166.133 131.065 c 166.133 132.858 167.59 134.315
 169.387 134.315 c 171.18 134.315 172.637 132.858 172.637 131.065 c h
172.637 131.065 m f
115.922 146.393 m 115.922 144.596 114.465 143.139 112.668 143.139 c 110.871
 143.139 109.418 144.596 109.418 146.393 c 109.418 148.19 110.871 149.643
 112.668 149.643 c 114.465 149.643 115.922 148.19 115.922 146.393 c h
115.922 146.393 m f
132.781 129.53 m 132.781 127.733 131.328 126.28 129.531 126.28 c 127.734
 126.28 126.277 127.733 126.277 129.53 c 126.277 131.327 127.734 132.784
 129.531 132.784 c 131.328 132.784 132.781 131.327 132.781 129.53 c h
132.781 129.53 m f
151.941 110.37 m 151.941 108.573 150.488 107.116 148.691 107.116 c 146.895
 107.116 145.438 108.573 145.438 110.37 c 145.438 112.166 146.895 113.62
 148.691 113.62 c 150.488 113.62 151.941 112.166 151.941 110.37 c h
151.941 110.37 m f
94.461 124.932 m 94.461 123.135 93.004 121.678 91.207 121.678 c 89.41 121.678
 87.957 123.135 87.957 124.932 c 87.957 126.729 89.41 128.182 91.207 128.182
 c 93.004 128.182 94.461 126.729 94.461 124.932 c h
94.461 124.932 m f
111.32 108.069 m 111.32 106.272 109.867 104.819 108.07 104.819 c 106.273
 104.819 104.816 106.272 104.816 108.069 c 104.816 109.866 106.273 111.323
 108.07 111.323 c 109.867 111.323 111.32 109.866 111.32 108.069 c h
111.32 108.069 m f
130.48 88.909 m 130.48 87.112 129.027 85.659 127.23 85.659 c 125.434 85.659
 123.977 87.112 123.977 88.909 c 123.977 90.705 125.434 92.163 127.23 92.163
 c 129.027 92.163 130.48 90.705 130.48 88.909 c h
130.48 88.909 m f
73.766 104.237 m 73.766 102.44 72.309 100.987 70.516 100.987 c 68.719 100.987
 67.262 102.44 67.262 104.237 c 67.262 106.034 68.719 107.491 70.516 107.491
 c 72.309 107.491 73.766 106.034 73.766 104.237 c h
73.766 104.237 m f
90.629 87.377 m 90.629 85.58 89.172 84.123 87.375 84.123 c 85.578 84.123
 84.125 85.58 84.125 87.377 c 84.125 89.17 85.578 90.627 87.375 90.627 c
 89.172 90.627 90.629 89.17 90.629 87.377 c h
90.629 87.377 m f
109.789 68.213 m 109.789 66.42 108.332 64.963 106.535 64.963 c 104.742 
64.963 103.285 66.42 103.285 68.213 c 103.285 70.01 104.742 71.467 106.535
 71.467 c 108.332 71.467 109.789 70.01 109.789 68.213 c h
109.789 68.213 m f
Q Q
showpage
%%Trailer
end restore
%%EOF
