%!PS-Adobe-3.0 EPSF-3.0
%%Creator: cairo 1.14.2 (http://cairographics.org)
%%CreationDate: Tue Jun 21 12:26:15 2016
%%Pages: 1
%%DocumentData: Clean7Bit
%%LanguageLevel: 2
%%BoundingBox: 0 -1 238 238
%%EndComments
%%BeginProlog
save
50 dict begin
/q { gsave } bind def
/Q { grestore } bind def
/cm { 6 array astore concat } bind def
/w { setlinewidth } bind def
/J { setlinecap } bind def
/j { setlinejoin } bind def
/M { setmiterlimit } bind def
/d { setdash } bind def
/m { moveto } bind def
/l { lineto } bind def
/c { curveto } bind def
/h { closepath } bind def
/re { exch dup neg 3 1 roll 5 3 roll moveto 0 rlineto
      0 exch rlineto 0 rlineto closepath } bind def
/S { stroke } bind def
/f { fill } bind def
/f* { eofill } bind def
/n { newpath } bind def
/W { clip } bind def
/W* { eoclip } bind def
/BT { } bind def
/ET { } bind def
/pdfmark where { pop globaldict /?pdfmark /exec load put }
    { globaldict begin /?pdfmark /pop load def /pdfmark
    /cleartomark load def end } ifelse
/BDC { mark 3 1 roll /BDC pdfmark } bind def
/EMC { mark /EMC pdfmark } bind def
/cairo_store_point { /cairo_point_y exch def /cairo_point_x exch def } def
/Tj { show currentpoint cairo_store_point } bind def
/TJ {
  {
    dup
    type /stringtype eq
    { show } { -0.001 mul 0 cairo_font_matrix dtransform rmoveto } ifelse
  } forall
  currentpoint cairo_store_point
} bind def
/cairo_selectfont { cairo_font_matrix aload pop pop pop 0 0 6 array astore
    cairo_font exch selectfont cairo_point_x cairo_point_y moveto } bind def
/Tf { pop /cairo_font exch def /cairo_font_matrix where
      { pop cairo_selectfont } if } bind def
/Td { matrix translate cairo_font_matrix matrix concatmatrix dup
      /cairo_font_matrix exch def dup 4 get exch 5 get cairo_store_point
      /cairo_font where { pop cairo_selectfont } if } bind def
/Tm { 2 copy 8 2 roll 6 array astore /cairo_font_matrix exch def
      cairo_store_point /cairo_font where { pop cairo_selectfont } if } bind def
/g { setgray } bind def
/rg { setrgbcolor } bind def
/d1 { setcachedevice } bind def
%%EndProlog
%%BeginSetup
%%EndSetup
%%Page: 1 1
%%BeginPageSetup
%%PageBoundingBox: 0 -1 238 238
%%EndPageSetup
q 0 -1 238 239 rectclip q
0.368627 0.270588 0.203922 rg
237.602 118.8 m 237.602 53.191 184.41 -0.001 118.801 -0.001 c 53.188 -0.001
 0 53.191 0 118.8 c 0 184.413 53.188 237.601 118.801 237.601 c 184.41 237.601
 237.602 184.413 237.602 118.8 c h
237.602 118.8 m f
0.313726 0.231373 0.172549 rg
163.797 192.187 m 70.684 44.839 l 115.477 0.05 l 116.582 0.019 117.688 
-0.001 118.801 -0.001 c 184.273 -0.001 237.371 52.964 237.594 118.386 c 
h
163.797 192.187 m f
0.85098 0.329412 0.34902 rg
82.934 39.601 m 154.664 39.601 l 164.02 39.601 171.598 47.183 171.598 56.534
 c 171.598 154.667 l 171.598 164.019 164.02 171.601 154.664 171.601 c 82.934
 171.601 l 73.582 171.601 66 164.019 66 154.667 c 66 56.534 l 66 47.183 
73.582 39.601 82.934 39.601 c h
82.934 39.601 m f
0.717647 0.239216 0.27451 rg
154.664 171.601 m 119.066 171.601 l 119.066 39.601 l 154.664 39.601 l 164.02
 39.601 171.598 47.183 171.598 56.534 c 171.598 154.667 l 171.602 164.019
 164.02 171.601 154.664 171.601 c h
154.664 171.601 m f
0.92549 0.941176 0.945098 rg
152.664 79.202 m 84.934 79.202 l 81.766 79.202 79.199 81.769 79.199 84.933
 c 79.199 126.269 l 79.199 129.433 81.766 132.003 84.934 132.003 c 152.664
 132.003 l 155.832 132.003 158.398 129.433 158.398 126.269 c 158.398 84.933
 l 158.398 81.769 155.832 79.202 152.664 79.202 c h
152.664 79.202 m f
0.839216 0.847059 0.847059 rg
152.664 131.999 m 119.066 131.999 l 119.066 79.202 l 152.664 79.202 l 155.832
 79.202 158.398 81.769 158.398 84.933 c 158.398 126.269 l 158.398 129.433
 155.832 131.999 152.664 131.999 c h
152.664 131.999 m f
0.776471 0.235294 0.133333 rg
105.602 105.601 m 105.602 112.89 111.508 115.601 118.801 115.601 c 126.09
 115.601 132 112.89 132 105.601 c 132 98.312 126.09 87.601 118.801 87.601
 c 111.508 87.601 105.602 98.312 105.602 105.601 c h
105.602 105.601 m f
0.686275 0.192157 0.12549 rg
132 105.601 m 132 112.8 126.234 115.527 119.066 115.593 c 119.066 87.613
 l 126.234 87.87 132 98.402 132 105.601 c h
132 105.601 m f
0.741176 0.764706 0.780392 rg
161.719 173.234 m 181.652 163.269 l 184.961 161.613 184.488 156.761 180.922
 155.769 c 163.418 150.909 121.836 143.405 58.32 156.445 c 54.562 157.214
 53.887 162.296 57.316 164.011 c 75.766 173.234 l h
161.719 173.234 m f
0.670588 0.701961 0.717647 rg
181.652 163.269 m 161.719 173.234 l 119.066 173.234 l 119.066 149.253 l
 149.008 148.546 169.816 152.687 180.922 155.769 c 184.488 156.761 184.961
 161.613 181.652 163.269 c h
181.652 163.269 m f
0.92549 0.941176 0.945098 rg
77.203 170.402 m 160.395 170.402 l 163.051 170.402 165.199 172.554 165.199
 175.206 c 165.199 188.796 l 165.199 191.448 163.047 193.601 160.395 193.601
 c 77.203 193.601 l 74.551 193.601 72.398 191.448 72.398 188.796 c 72.398
 175.206 l 72.398 172.554 74.551 170.402 77.203 170.402 c h
77.203 170.402 m f
0.878431 g
160.395 193.601 m 119.066 193.601 l 119.066 170.402 l 160.395 170.402 l
 163.047 170.402 165.199 172.554 165.199 175.206 c 165.199 188.796 l 165.199
 191.448 163.047 193.601 160.395 193.601 c h
160.395 193.601 m f
0.152941 0.682353 0.376471 rg
117.781 112.773 m 117.613 114.972 117.844 123.198 130.305 125.312 c 130.695
 125.378 131.051 125.066 131.035 124.667 c 130.922 121.784 129.719 111.683
 118.379 112.195 c 118.062 112.21 117.805 112.456 117.781 112.773 c h
117.781 112.773 m f
0.203922 0.372549 0.254902 rg
118.793 112.218 m 118.879 114.011 118.445 119.534 109.949 121.066 c 109.555
 121.136 109.195 120.812 109.219 120.409 c 109.355 118.085 110.426 111.363
 118.188 111.624 c 118.512 111.636 118.773 111.894 118.793 112.218 c h
118.793 112.218 m f
Q Q
showpage
%%Trailer
end restore
%%EOF
