%!PS-Adobe-3.0 EPSF-3.0
%%Creator: cairo 1.14.2 (http://cairographics.org)
%%CreationDate: Tue Jun 21 12:28:34 2016
%%Pages: 1
%%DocumentData: Clean7Bit
%%LanguageLevel: 2
%%BoundingBox: 0 -1 238 238
%%EndComments
%%BeginProlog
save
50 dict begin
/q { gsave } bind def
/Q { grestore } bind def
/cm { 6 array astore concat } bind def
/w { setlinewidth } bind def
/J { setlinecap } bind def
/j { setlinejoin } bind def
/M { setmiterlimit } bind def
/d { setdash } bind def
/m { moveto } bind def
/l { lineto } bind def
/c { curveto } bind def
/h { closepath } bind def
/re { exch dup neg 3 1 roll 5 3 roll moveto 0 rlineto
      0 exch rlineto 0 rlineto closepath } bind def
/S { stroke } bind def
/f { fill } bind def
/f* { eofill } bind def
/n { newpath } bind def
/W { clip } bind def
/W* { eoclip } bind def
/BT { } bind def
/ET { } bind def
/pdfmark where { pop globaldict /?pdfmark /exec load put }
    { globaldict begin /?pdfmark /pop load def /pdfmark
    /cleartomark load def end } ifelse
/BDC { mark 3 1 roll /BDC pdfmark } bind def
/EMC { mark /EMC pdfmark } bind def
/cairo_store_point { /cairo_point_y exch def /cairo_point_x exch def } def
/Tj { show currentpoint cairo_store_point } bind def
/TJ {
  {
    dup
    type /stringtype eq
    { show } { -0.001 mul 0 cairo_font_matrix dtransform rmoveto } ifelse
  } forall
  currentpoint cairo_store_point
} bind def
/cairo_selectfont { cairo_font_matrix aload pop pop pop 0 0 6 array astore
    cairo_font exch selectfont cairo_point_x cairo_point_y moveto } bind def
/Tf { pop /cairo_font exch def /cairo_font_matrix where
      { pop cairo_selectfont } if } bind def
/Td { matrix translate cairo_font_matrix matrix concatmatrix dup
      /cairo_font_matrix exch def dup 4 get exch 5 get cairo_store_point
      /cairo_font where { pop cairo_selectfont } if } bind def
/Tm { 2 copy 8 2 roll 6 array astore /cairo_font_matrix exch def
      cairo_store_point /cairo_font where { pop cairo_selectfont } if } bind def
/g { setgray } bind def
/rg { setrgbcolor } bind def
/d1 { setcachedevice } bind def
%%EndProlog
%%BeginSetup
%%EndSetup
%%Page: 1 1
%%BeginPageSetup
%%PageBoundingBox: 0 -1 238 238
%%EndPageSetup
q 0 -1 238 239 rectclip q
0.152941 0.682353 0.376471 rg
237.602 118.799 m 237.602 53.19 184.41 -0.002 118.801 -0.002 c 53.188 -0.002
 0 53.19 0 118.799 c 0 184.413 53.188 237.6 118.801 237.6 c 184.41 237.6
 237.602 184.413 237.602 118.799 c h
237.602 118.799 m f
0.113725 0.529412 0.278431 rg
169.41 181.963 m 88.344 41.026 l 128.902 0.432 l 188.172 5.424 235.047 
53.924 237.492 113.881 c h
169.41 181.963 m f
0.815686 0.835294 0.85098 rg
92.832 39.6 m 144.77 39.6 l 148.762 39.6 152.102 42.623 152.5 46.596 c 
165 171.6 l 72.602 171.6 l 85.102 46.596 l 85.496 42.623 88.84 39.6 92.832
 39.6 c h
92.832 39.6 m f
0.74902 0.968627 0.588235 rg
77.199 184.268 m 141.141 197.053 l 144.508 197.729 147.992 196.674 150.422
 194.245 c 160.398 184.268 l h
77.199 184.268 m f
0.752941 0.760784 0.768627 rg
118.934 171.6 m 118.934 39.6 l 144.77 39.6 l 148.762 39.6 152.102 42.623
 152.5 46.596 c 165 171.6 l h
118.934 171.6 m f
0.643137 0.827451 0.498039 rg
150.422 194.245 m 147.992 196.674 144.508 197.729 141.141 197.053 c 118.934
 192.612 l 118.934 184.268 l 160.398 184.268 l h
150.422 194.245 m f
0.203922 0.372549 0.254902 rg
163.066 158.401 m 74.535 158.401 l 69.82 158.401 66 162.221 66 166.932 
c 66 176.268 l 66 180.979 69.82 184.799 74.535 184.799 c 163.066 184.799
 l 167.781 184.799 171.602 180.979 171.602 176.268 c 171.602 166.932 l 171.602
 162.221 167.777 158.401 163.066 158.401 c h
163.066 158.401 m f
0.164706 0.309804 0.203922 rg
163.066 184.799 m 118.934 184.799 l 118.934 158.401 l 163.066 158.401 l
 167.781 158.401 171.602 162.221 171.602 166.932 c 171.602 176.268 l 171.602
 180.979 167.777 184.799 163.066 184.799 c h
163.066 184.799 m f
0.521569 0.619608 0.470588 rg
159.125 112.866 m 78.473 112.866 l 79.926 98.334 l 157.672 98.334 l h
159.125 112.866 m f
0.462745 0.537255 0.419608 rg
159.125 112.866 m 118.934 112.866 l 118.934 98.334 l 157.672 98.334 l h
159.125 112.866 m f
0.52549 0.784314 0.403922 rg
136.398 105.6 m 136.398 95.881 128.52 87.998 118.801 87.998 c 109.078 87.998
 101.199 95.881 101.199 105.6 c 101.199 115.319 109.078 123.202 118.801 
123.202 c 128.52 123.202 136.398 115.319 136.398 105.6 c h
136.398 105.6 m f
0.152941 0.682353 0.376471 rg
136.398 105.6 m 136.398 115.276 128.594 123.123 118.934 123.198 c 118.934
 88.002 l 128.594 88.077 136.398 95.924 136.398 105.6 c h
136.398 105.6 m f
Q Q
showpage
%%Trailer
end restore
%%EOF
