%!PS-Adobe-3.0 EPSF-3.0
%%Creator: cairo 1.14.2 (http://cairographics.org)
%%CreationDate: Tue Jun 21 12:24:44 2016
%%Pages: 1
%%DocumentData: Clean7Bit
%%LanguageLevel: 2
%%BoundingBox: 0 -1 238 238
%%EndComments
%%BeginProlog
save
50 dict begin
/q { gsave } bind def
/Q { grestore } bind def
/cm { 6 array astore concat } bind def
/w { setlinewidth } bind def
/J { setlinecap } bind def
/j { setlinejoin } bind def
/M { setmiterlimit } bind def
/d { setdash } bind def
/m { moveto } bind def
/l { lineto } bind def
/c { curveto } bind def
/h { closepath } bind def
/re { exch dup neg 3 1 roll 5 3 roll moveto 0 rlineto
      0 exch rlineto 0 rlineto closepath } bind def
/S { stroke } bind def
/f { fill } bind def
/f* { eofill } bind def
/n { newpath } bind def
/W { clip } bind def
/W* { eoclip } bind def
/BT { } bind def
/ET { } bind def
/pdfmark where { pop globaldict /?pdfmark /exec load put }
    { globaldict begin /?pdfmark /pop load def /pdfmark
    /cleartomark load def end } ifelse
/BDC { mark 3 1 roll /BDC pdfmark } bind def
/EMC { mark /EMC pdfmark } bind def
/cairo_store_point { /cairo_point_y exch def /cairo_point_x exch def } def
/Tj { show currentpoint cairo_store_point } bind def
/TJ {
  {
    dup
    type /stringtype eq
    { show } { -0.001 mul 0 cairo_font_matrix dtransform rmoveto } ifelse
  } forall
  currentpoint cairo_store_point
} bind def
/cairo_selectfont { cairo_font_matrix aload pop pop pop 0 0 6 array astore
    cairo_font exch selectfont cairo_point_x cairo_point_y moveto } bind def
/Tf { pop /cairo_font exch def /cairo_font_matrix where
      { pop cairo_selectfont } if } bind def
/Td { matrix translate cairo_font_matrix matrix concatmatrix dup
      /cairo_font_matrix exch def dup 4 get exch 5 get cairo_store_point
      /cairo_font where { pop cairo_selectfont } if } bind def
/Tm { 2 copy 8 2 roll 6 array astore /cairo_font_matrix exch def
      cairo_store_point /cairo_font where { pop cairo_selectfont } if } bind def
/g { setgray } bind def
/rg { setrgbcolor } bind def
/d1 { setcachedevice } bind def
%%EndProlog
%%BeginSetup
%%EndSetup
%%Page: 1 1
%%BeginPageSetup
%%PageBoundingBox: 0 -1 238 238
%%EndPageSetup
q 0 -1 238 239 rectclip q
0.313726 0.231373 0.172549 rg
237.602 118.799 m 237.602 53.19 184.41 -0.002 118.801 -0.002 c 53.188 -0.002
 0 53.19 0 118.799 c 0 184.413 53.188 237.6 118.801 237.6 c 184.41 237.6
 237.602 184.413 237.602 118.799 c h
237.602 118.799 m f
0.258824 0.188235 0.141176 rg
237.523 122.885 m 184.293 176.112 l 139.359 139.881 86.109 112.635 58 57.202
 c 55.316 52.366 49.055 48.58 42.535 45.678 c 82.605 5.623 l 94.02 1.975
 106.176 -0.002 118.801 -0.002 c 184.41 -0.002 237.602 53.19 237.602 118.799
 c 237.602 120.17 237.566 121.53 237.523 122.885 c h
237.523 122.885 m f
0.85098 0.329412 0.34902 rg
64.379 43.881 m 67.633 43.881 70.316 46.393 70.582 49.639 c 71.359 59.194
 74 61.08 74 73.85 c 74 88.834 70.367 88.834 70.367 103.823 c 70.367 118.803
 74 118.803 74 133.788 c 74 148.768 70.367 148.768 70.367 163.752 c 70.367
 176.002 72.797 178.237 73.68 186.834 c 74.059 190.51 71.191 193.717 67.492
 193.717 c 50.023 193.717 l 46.766 193.717 44.082 191.205 43.82 187.963 
c 43.039 178.409 40.398 176.522 40.398 163.748 c 40.398 148.764 44.031 148.764
 44.031 133.78 c 44.031 118.795 40.398 118.795 40.398 103.815 c 40.398 88.83
 44.031 88.83 44.031 73.846 c 44.031 61.596 41.605 59.362 40.719 50.764 
c 40.34 47.088 43.211 43.881 46.906 43.881 c h
64.379 43.881 m f
107.578 43.881 m 110.832 43.881 113.516 46.393 113.781 49.639 c 114.562
 59.194 117.199 61.08 117.199 73.85 c 117.199 88.834 113.566 88.834 113.566
 103.823 c 113.566 118.803 117.199 118.803 117.199 133.788 c 117.199 148.768
 113.566 148.768 113.566 163.752 c 113.566 176.002 115.996 178.237 116.883
 186.834 c 117.262 190.51 114.391 193.717 110.695 193.717 c 93.223 193.717
 l 89.969 193.717 87.281 191.205 87.02 187.963 c 86.238 178.405 83.602 176.518
 83.602 163.748 c 83.602 148.764 87.234 148.764 87.234 133.78 c 87.234 118.795
 83.602 118.795 83.602 103.811 c 83.602 88.83 87.234 88.83 87.234 73.846
 c 87.234 61.596 84.805 59.362 83.918 50.764 c 83.539 47.088 86.41 43.881
 90.105 43.881 c h
107.578 43.881 m f
1 g
98.031 176.28 m 115.738 188.522 150.203 209.065 184.129 176.28 c 209.926
 151.354 175.469 127.245 169.777 90.186 c 164.125 53.37 131.945 18.584 83.684
 61.487 c 35.418 104.389 48.91 142.323 98.031 176.28 c h
98.031 176.28 m f
0.890196 0.898039 0.894118 rg
184.129 176.28 m 160.77 198.854 137.156 196.143 118.934 188.272 c 118.934
 42.264 l 147.336 37.452 165.645 63.272 169.777 90.186 c 175.469 127.245
 209.926 151.354 184.129 176.28 c h
184.129 176.28 m f
0.956863 0.686275 0.188235 rg
124.992 104.538 m 124.992 89.647 112.922 77.577 98.031 77.577 c 83.145 
77.577 71.074 89.647 71.074 104.538 c 71.074 119.424 83.145 131.495 98.031
 131.495 c 112.922 131.495 124.992 119.424 124.992 104.538 c h
124.992 104.538 m f
1 0.658824 0 rg
118.934 121.557 m 118.934 87.514 l 122.719 92.155 124.992 98.08 124.992
 104.538 c 124.992 110.995 122.719 116.916 118.934 121.557 c h
118.934 121.557 m f
Q Q
showpage
%%Trailer
end restore
%%EOF
