%!PS-Adobe-3.0 EPSF-3.0
%%Creator: cairo 1.14.2 (http://cairographics.org)
%%CreationDate: Tue Jun 21 12:29:32 2016
%%Pages: 1
%%DocumentData: Clean7Bit
%%LanguageLevel: 2
%%BoundingBox: 0 -1 238 238
%%EndComments
%%BeginProlog
save
50 dict begin
/q { gsave } bind def
/Q { grestore } bind def
/cm { 6 array astore concat } bind def
/w { setlinewidth } bind def
/J { setlinecap } bind def
/j { setlinejoin } bind def
/M { setmiterlimit } bind def
/d { setdash } bind def
/m { moveto } bind def
/l { lineto } bind def
/c { curveto } bind def
/h { closepath } bind def
/re { exch dup neg 3 1 roll 5 3 roll moveto 0 rlineto
      0 exch rlineto 0 rlineto closepath } bind def
/S { stroke } bind def
/f { fill } bind def
/f* { eofill } bind def
/n { newpath } bind def
/W { clip } bind def
/W* { eoclip } bind def
/BT { } bind def
/ET { } bind def
/pdfmark where { pop globaldict /?pdfmark /exec load put }
    { globaldict begin /?pdfmark /pop load def /pdfmark
    /cleartomark load def end } ifelse
/BDC { mark 3 1 roll /BDC pdfmark } bind def
/EMC { mark /EMC pdfmark } bind def
/cairo_store_point { /cairo_point_y exch def /cairo_point_x exch def } def
/Tj { show currentpoint cairo_store_point } bind def
/TJ {
  {
    dup
    type /stringtype eq
    { show } { -0.001 mul 0 cairo_font_matrix dtransform rmoveto } ifelse
  } forall
  currentpoint cairo_store_point
} bind def
/cairo_selectfont { cairo_font_matrix aload pop pop pop 0 0 6 array astore
    cairo_font exch selectfont cairo_point_x cairo_point_y moveto } bind def
/Tf { pop /cairo_font exch def /cairo_font_matrix where
      { pop cairo_selectfont } if } bind def
/Td { matrix translate cairo_font_matrix matrix concatmatrix dup
      /cairo_font_matrix exch def dup 4 get exch 5 get cairo_store_point
      /cairo_font where { pop cairo_selectfont } if } bind def
/Tm { 2 copy 8 2 roll 6 array astore /cairo_font_matrix exch def
      cairo_store_point /cairo_font where { pop cairo_selectfont } if } bind def
/g { setgray } bind def
/rg { setrgbcolor } bind def
/d1 { setcachedevice } bind def
%%EndProlog
%%BeginSetup
%%EndSetup
%%Page: 1 1
%%BeginPageSetup
%%PageBoundingBox: 0 -1 238 238
%%EndPageSetup
q 0 -1 238 239 rectclip q
0.203922 0.372549 0.254902 rg
237.602 118.799 m 237.602 53.19 184.41 -0.002 118.801 -0.002 c 53.188 -0.002
 0 53.19 0 118.799 c 0 184.413 53.188 237.6 118.801 237.6 c 184.41 237.6
 237.602 184.413 237.602 118.799 c h
237.602 118.799 m f
0.121569 0.266667 0.152941 rg
120.133 27.6 m 82.527 23.459 l 105.238 0.776 l 109.688 0.268 114.211 -0.002
 118.801 -0.002 c 184.41 -0.002 237.602 53.19 237.602 118.799 c 237.602 
122.057 237.465 125.28 237.207 128.471 c 181.82 183.983 l 120.133 150.299
 l 120.133 27.6 l f
0.92549 0.941176 0.945098 rg
151.609 30.799 m 123.199 30.799 l 123.199 98.561 l 181.996 180.873 l 183.168
 182.518 181.996 184.799 179.977 184.799 c 57.625 184.799 l 55.605 184.799
 54.43 182.518 55.605 180.873 c 114.398 98.561 l 114.398 30.799 l 85.988
 30.799 l 83.691 30.799 81.641 29.12 81.422 26.834 c 81.172 24.209 83.227
 21.998 85.801 21.998 c 151.801 21.998 l 154.371 21.998 156.43 24.209 156.18
 26.834 c 155.961 29.12 153.906 30.799 151.609 30.799 c h
151.609 30.799 m f
0.890196 0.898039 0.894118 rg
181.996 180.873 m 183.168 182.518 181.996 184.799 179.977 184.799 c 118.934
 184.799 l 118.934 21.998 l 151.801 21.998 l 154.371 21.998 156.43 24.209
 156.18 26.834 c 155.961 29.12 153.906 30.799 151.609 30.799 c 123.199 30.799
 l 123.199 98.561 l h
181.996 180.873 m f
0.74902 0.968627 0.588235 rg
81.602 170.577 m 73.395 176.698 71.699 188.307 77.816 196.514 c 83.934 
204.721 95.547 206.416 103.754 200.299 c h
81.602 170.577 m f
0.180392 0.8 0.443137 rg
81.684 170.018 m 81.363 170.256 l 72.992 176.498 71.258 188.385 77.496 
196.756 c 83.738 205.123 95.621 206.858 103.992 200.62 c 104.312 200.381
 l h
92.699 203.565 m 87.164 203.565 81.695 201.045 78.137 196.276 c 72.242 
188.366 73.777 177.178 81.52 171.143 c 103.191 200.213 l 100.02 202.475 
96.344 203.565 92.699 203.565 c h
92.699 203.565 m f
0.74902 0.968627 0.588235 rg
92.461 185.147 m 92.469 185.159 l 92.453 185.155 l h
92.461 185.147 m f
0.180392 0.8 0.443137 rg
92.543 184.6 m 91.48 185.385 l 93.402 185.737 l h
92.543 184.6 m f
92.453 183.557 m 92.098 183.557 91.754 183.67 91.469 183.889 c 76.832 195.241
 l 76.16 195.76 76.016 196.709 76.484 197.405 c 76.504 197.428 76.52 197.455
 76.535 197.475 c 79.703 201.725 84.336 204.514 89.582 205.33 c 90 205.397
 90.434 205.291 90.777 205.038 c 91.121 204.784 91.348 204.401 91.41 203.979
 c 94.109 185.467 l 94.172 185.045 94.062 184.62 93.809 184.28 c 93.75 184.202
 l 93.508 183.877 93.152 183.659 92.754 183.584 c 92.738 183.58 l 92.645
 183.565 92.547 183.557 92.453 183.557 c h
80.086 196.764 m 90.395 188.776 l 88.488 201.846 l 85.234 201.018 82.328
 199.264 80.086 196.764 c h
80.086 196.764 m f
0.74902 0.968627 0.588235 rg
89.828 203.748 m 85.199 203.03 80.836 200.569 77.816 196.514 c 77.812 196.51
 77.812 196.51 77.809 196.506 c 74.586 192.174 73.535 186.893 74.473 181.975
 c 75.309 177.577 77.727 173.463 81.602 170.577 c 92.461 185.147 l 92.453
 185.155 l 92.469 185.159 l 92.527 185.237 l 103.754 200.299 l 99.598 203.397
 94.574 204.487 89.828 203.748 c h
89.828 203.748 m f
0.180392 0.8 0.443137 rg
106.883 201.819 m 107.137 202.159 107.246 202.584 107.184 203.006 c 107.121
 203.424 106.898 203.803 106.559 204.057 c 96.289 211.709 81.711 209.584
 74.059 199.319 c 66.406 189.049 68.531 174.471 78.797 166.819 c 79.086 
166.604 79.422 166.502 79.754 166.502 c 80.242 166.502 80.723 166.725 81.035
 167.143 c h
77.363 184.112 m 77.082 187.319 77.789 190.483 79.414 193.237 c 88.621 
186.104 l h
81.312 195.819 m 83.305 198.006 85.859 199.545 88.715 200.299 c 90.395 
188.776 l h
82.246 174.123 m 80.219 175.987 78.758 178.342 77.969 180.967 c 88.773 
182.877 l h
93.551 189.291 m 91.875 200.803 l 94.922 200.967 97.918 200.229 100.539
 198.666 c h
93.551 189.291 m f
0.74902 0.968627 0.588235 rg
118.801 103.319 m 152.715 150.799 l 84.887 150.799 l h
118.801 103.319 m f
0.639216 0.866667 0.462745 rg
118.934 150.799 m 118.934 103.506 l 152.715 150.799 l h
118.934 150.799 m f
Q Q
showpage
%%Trailer
end restore
%%EOF
