%!PS-Adobe-3.0 EPSF-3.0
%%Creator: cairo 1.14.2 (http://cairographics.org)
%%CreationDate: Tue Jun 21 12:25:21 2016
%%Pages: 1
%%DocumentData: Clean7Bit
%%LanguageLevel: 2
%%BoundingBox: 0 -1 238 238
%%EndComments
%%BeginProlog
save
50 dict begin
/q { gsave } bind def
/Q { grestore } bind def
/cm { 6 array astore concat } bind def
/w { setlinewidth } bind def
/J { setlinecap } bind def
/j { setlinejoin } bind def
/M { setmiterlimit } bind def
/d { setdash } bind def
/m { moveto } bind def
/l { lineto } bind def
/c { curveto } bind def
/h { closepath } bind def
/re { exch dup neg 3 1 roll 5 3 roll moveto 0 rlineto
      0 exch rlineto 0 rlineto closepath } bind def
/S { stroke } bind def
/f { fill } bind def
/f* { eofill } bind def
/n { newpath } bind def
/W { clip } bind def
/W* { eoclip } bind def
/BT { } bind def
/ET { } bind def
/pdfmark where { pop globaldict /?pdfmark /exec load put }
    { globaldict begin /?pdfmark /pop load def /pdfmark
    /cleartomark load def end } ifelse
/BDC { mark 3 1 roll /BDC pdfmark } bind def
/EMC { mark /EMC pdfmark } bind def
/cairo_store_point { /cairo_point_y exch def /cairo_point_x exch def } def
/Tj { show currentpoint cairo_store_point } bind def
/TJ {
  {
    dup
    type /stringtype eq
    { show } { -0.001 mul 0 cairo_font_matrix dtransform rmoveto } ifelse
  } forall
  currentpoint cairo_store_point
} bind def
/cairo_selectfont { cairo_font_matrix aload pop pop pop 0 0 6 array astore
    cairo_font exch selectfont cairo_point_x cairo_point_y moveto } bind def
/Tf { pop /cairo_font exch def /cairo_font_matrix where
      { pop cairo_selectfont } if } bind def
/Td { matrix translate cairo_font_matrix matrix concatmatrix dup
      /cairo_font_matrix exch def dup 4 get exch 5 get cairo_store_point
      /cairo_font where { pop cairo_selectfont } if } bind def
/Tm { 2 copy 8 2 roll 6 array astore /cairo_font_matrix exch def
      cairo_store_point /cairo_font where { pop cairo_selectfont } if } bind def
/g { setgray } bind def
/rg { setrgbcolor } bind def
/d1 { setcachedevice } bind def
%%EndProlog
%%BeginSetup
%%EndSetup
%%Page: 1 1
%%BeginPageSetup
%%PageBoundingBox: 0 -1 238 238
%%EndPageSetup
q 0 -1 238 239 rectclip q
0.368627 0.270588 0.203922 rg
237.602 118.799 m 237.602 53.19 184.41 -0.002 118.801 -0.002 c 53.188 -0.002
 0 53.19 0 118.799 c 0 184.413 53.188 237.6 118.801 237.6 c 184.41 237.6
 237.602 184.413 237.602 118.799 c h
237.602 118.799 m f
0.313726 0.231373 0.172549 rg
236.352 136.038 m 192.895 179.495 l 61.898 44.205 l 105.328 0.764 l 109.75
 0.264 114.242 -0.002 118.801 -0.002 c 184.41 -0.002 237.602 53.19 237.602
 118.799 c 237.602 124.655 237.168 130.409 236.352 136.038 c h
236.352 136.038 m f
0.941176 0.752941 0.509804 rg
171.602 184.799 m 66 184.799 l 51.422 184.799 39.602 172.979 39.602 158.401
 c 39.602 146.1 48.012 135.764 59.398 132.83 c 59.398 58.1 l 59.398 49.651
 66.25 42.799 74.699 42.799 c 162.898 42.799 l 171.348 42.799 178.199 49.651
 178.199 58.1 c 178.199 132.83 l 189.586 135.764 198 146.1 198 158.401 c
 198 172.979 186.18 184.799 171.602 184.799 c h
171.602 184.799 m f
0.721569 0.337255 0.152941 rg
162.898 39.202 m 74.699 39.202 l 64.277 39.202 55.801 47.678 55.801 58.1
 c 55.801 130.178 l 44.012 134.424 36 145.655 36 158.401 c 36 174.944 49.457
 188.401 66 188.401 c 171.602 188.401 l 188.141 188.401 201.602 174.944 
201.602 158.401 c 201.602 145.655 193.586 134.424 181.801 130.178 c 181.801
 58.1 l 181.801 47.678 173.32 39.202 162.898 39.202 c h
66 181.202 m 53.43 181.202 43.199 170.971 43.199 158.401 c 43.199 147.991
 50.23 138.909 60.297 136.319 c 63 135.623 l 63 58.1 l 63 51.647 68.25 46.401
 74.699 46.401 c 162.898 46.401 l 169.352 46.401 174.602 51.647 174.602 
58.1 c 174.602 135.623 l 177.305 136.319 l 187.371 138.909 194.398 147.991
 194.398 158.401 c 194.398 170.971 184.172 181.202 171.602 181.202 c h
66 181.202 m f
0.839216 0.615686 0.372549 rg
171.602 184.799 m 118.535 184.799 l 118.535 42.799 l 162.898 42.799 l 171.348
 42.799 178.199 49.651 178.199 58.1 c 178.199 132.83 l 189.586 135.764 198
 146.1 198 158.401 c 198 172.979 186.18 184.799 171.602 184.799 c h
171.602 184.799 m f
0.647059 0.270588 0.12549 rg
171.602 188.401 m 118.535 188.401 l 118.535 181.202 l 171.602 181.202 l
 184.172 181.202 194.398 170.971 194.398 158.401 c 194.398 147.991 187.371
 138.909 177.305 136.319 c 174.602 135.623 l 174.602 58.1 l 174.602 51.647
 169.352 46.401 162.898 46.401 c 118.535 46.401 l 118.535 39.202 l 162.898
 39.202 l 173.32 39.202 181.801 47.678 181.801 58.1 c 181.801 130.178 l 
193.586 134.424 201.602 145.655 201.602 158.401 c 201.602 174.944 188.141
 188.401 171.602 188.401 c h
171.602 188.401 m f
0.847059 0.509804 0.407843 rg
86.801 162.799 m 86.801 161.034 85.367 159.6 83.602 159.6 c 81.832 159.6
 80.398 161.034 80.398 162.799 c 80.398 164.569 81.832 165.998 83.602 165.998
 c 85.367 165.998 86.801 164.569 86.801 162.799 c h
86.801 162.799 m f
85.602 95.6 m 85.602 93.834 84.168 92.401 82.398 92.401 c 80.633 92.401
 79.199 93.834 79.199 95.6 c 79.199 97.366 80.633 98.799 82.398 98.799 c
 84.168 98.799 85.602 97.366 85.602 95.6 c h
85.602 95.6 m f
0.768627 0.435294 0.360784 rg
153.602 82.401 m 153.602 80.631 152.168 79.202 150.398 79.202 c 148.633
 79.202 147.199 80.631 147.199 82.401 c 147.199 84.166 148.633 85.6 150.398
 85.6 c 152.168 85.6 153.602 84.166 153.602 82.401 c h
153.602 82.401 m f
0.847059 0.509804 0.407843 rg
112 148.401 m 112 146.631 110.566 145.202 108.801 145.202 c 107.031 145.202
 105.602 146.631 105.602 148.401 c 105.602 150.166 107.031 151.6 108.801
 151.6 c 110.566 151.6 112 150.166 112 148.401 c h
112 148.401 m f
0.768627 0.435294 0.360784 rg
127.199 89.202 m 127.199 87.432 125.766 85.998 124 85.998 c 122.234 85.998
 120.801 87.432 120.801 89.202 c 120.801 90.967 122.234 92.401 124 92.401
 c 125.766 92.401 127.199 90.967 127.199 89.202 c h
127.199 89.202 m f
134 62.799 m 134 61.034 132.566 59.6 130.801 59.6 c 129.031 59.6 127.602
 61.034 127.602 62.799 c 127.602 64.569 129.031 65.998 130.801 65.998 c 
132.566 65.998 134 64.569 134 62.799 c h
134 62.799 m f
0.847059 0.509804 0.407843 rg
85.602 135.202 m 85.602 133.432 84.168 131.998 82.398 131.998 c 80.633 
131.998 79.199 133.432 79.199 135.202 c 79.199 136.967 80.633 138.401 82.398
 138.401 c 84.168 138.401 85.602 136.967 85.602 135.202 c h
85.602 135.202 m f
0.768627 0.435294 0.360784 rg
160.398 128.799 m 160.398 127.034 158.969 125.6 157.199 125.6 c 155.434
 125.6 154 127.034 154 128.799 c 154 130.569 155.434 131.998 157.199 131.998
 c 158.969 131.998 160.398 130.569 160.398 128.799 c h
160.398 128.799 m f
0.847059 0.509804 0.407843 rg
79.199 62.799 m 79.199 61.034 77.766 59.6 76 59.6 c 74.234 59.6 72.801 
61.034 72.801 62.799 c 72.801 64.569 74.234 65.998 76 65.998 c 77.766 65.998
 79.199 64.569 79.199 62.799 c h
79.199 62.799 m f
0.768627 0.435294 0.360784 rg
127.199 161.6 m 127.199 159.834 125.766 158.401 124 158.401 c 122.234 158.401
 120.801 159.834 120.801 161.6 c 120.801 163.366 122.234 164.799 124 164.799
 c 125.766 164.799 127.199 163.366 127.199 161.6 c h
127.199 161.6 m f
166.801 168.401 m 166.801 166.631 165.367 165.202 163.602 165.202 c 161.832
 165.202 160.398 166.631 160.398 168.401 c 160.398 170.166 161.832 171.6
 163.602 171.6 c 165.367 171.6 166.801 170.166 166.801 168.401 c h
166.801 168.401 m f
148.801 148.401 m 148.801 145.748 146.652 143.6 144 143.6 c 141.348 143.6
 139.199 145.748 139.199 148.401 c 139.199 151.049 141.348 153.202 144 153.202
 c 146.652 153.202 148.801 151.049 148.801 148.401 c h
148.801 148.401 m f
0.847059 0.509804 0.407843 rg
105.602 110.401 m 105.602 107.748 103.449 105.6 100.801 105.6 c 98.148 
105.6 96 107.748 96 110.401 c 96 113.049 98.148 115.202 100.801 115.202 
c 103.449 115.202 105.602 113.049 105.602 110.401 c h
105.602 110.401 m f
102 61.202 m 102 58.549 99.852 56.401 97.199 56.401 c 94.551 56.401 92.398
 58.549 92.398 61.202 c 92.398 63.85 94.551 65.998 97.199 65.998 c 99.852
 65.998 102 63.85 102 61.202 c h
102 61.202 m f
0.768627 0.435294 0.360784 rg
130.398 113.998 m 130.398 111.35 128.25 109.202 125.602 109.202 c 122.949
 109.202 120.801 111.35 120.801 113.998 c 120.801 116.651 122.949 118.799
 125.602 118.799 c 128.25 118.799 130.398 116.651 130.398 113.998 c h
130.398 113.998 m f
Q Q
showpage
%%Trailer
end restore
%%EOF
