%!PS-Adobe-3.0 EPSF-3.0
%%Creator: cairo 1.14.2 (http://cairographics.org)
%%CreationDate: Tue Jun 21 12:29:50 2016
%%Pages: 1
%%DocumentData: Clean7Bit
%%LanguageLevel: 2
%%BoundingBox: 0 -1 238 238
%%EndComments
%%BeginProlog
save
50 dict begin
/q { gsave } bind def
/Q { grestore } bind def
/cm { 6 array astore concat } bind def
/w { setlinewidth } bind def
/J { setlinecap } bind def
/j { setlinejoin } bind def
/M { setmiterlimit } bind def
/d { setdash } bind def
/m { moveto } bind def
/l { lineto } bind def
/c { curveto } bind def
/h { closepath } bind def
/re { exch dup neg 3 1 roll 5 3 roll moveto 0 rlineto
      0 exch rlineto 0 rlineto closepath } bind def
/S { stroke } bind def
/f { fill } bind def
/f* { eofill } bind def
/n { newpath } bind def
/W { clip } bind def
/W* { eoclip } bind def
/BT { } bind def
/ET { } bind def
/pdfmark where { pop globaldict /?pdfmark /exec load put }
    { globaldict begin /?pdfmark /pop load def /pdfmark
    /cleartomark load def end } ifelse
/BDC { mark 3 1 roll /BDC pdfmark } bind def
/EMC { mark /EMC pdfmark } bind def
/cairo_store_point { /cairo_point_y exch def /cairo_point_x exch def } def
/Tj { show currentpoint cairo_store_point } bind def
/TJ {
  {
    dup
    type /stringtype eq
    { show } { -0.001 mul 0 cairo_font_matrix dtransform rmoveto } ifelse
  } forall
  currentpoint cairo_store_point
} bind def
/cairo_selectfont { cairo_font_matrix aload pop pop pop 0 0 6 array astore
    cairo_font exch selectfont cairo_point_x cairo_point_y moveto } bind def
/Tf { pop /cairo_font exch def /cairo_font_matrix where
      { pop cairo_selectfont } if } bind def
/Td { matrix translate cairo_font_matrix matrix concatmatrix dup
      /cairo_font_matrix exch def dup 4 get exch 5 get cairo_store_point
      /cairo_font where { pop cairo_selectfont } if } bind def
/Tm { 2 copy 8 2 roll 6 array astore /cairo_font_matrix exch def
      cairo_store_point /cairo_font where { pop cairo_selectfont } if } bind def
/g { setgray } bind def
/rg { setrgbcolor } bind def
/d1 { setcachedevice } bind def
%%EndProlog
%%BeginSetup
%%EndSetup
%%Page: 1 1
%%BeginPageSetup
%%PageBoundingBox: 0 -1 238 238
%%EndPageSetup
q 0 -1 238 239 rectclip q
0.956863 0.686275 0.188235 rg
237.602 118.799 m 237.602 53.19 184.41 -0.002 118.801 -0.002 c 53.188 -0.002
 0 53.19 0 118.799 c 0 184.413 53.188 237.6 118.801 237.6 c 184.41 237.6
 237.602 184.413 237.602 118.799 c h
237.602 118.799 m f
0.819608 0.52549 0 rg
237.289 127.377 m 184 180.666 l 58.133 54.799 l 112.785 0.151 l 114.777
 0.053 116.781 -0.002 118.801 -0.002 c 184.41 -0.002 237.602 53.19 237.602
 118.799 c 237.602 121.686 237.492 124.541 237.289 127.377 c h
237.289 127.377 m f
0.556863 0.447059 0.368627 rg
164.195 200.467 m 199.266 165.397 l 190.5 156.627 l 155.426 191.702 l h
164.195 200.467 m f
47.102 83.373 m 82.172 48.299 l 73.402 39.534 l 38.332 74.604 l h
47.102 83.373 m f
0.368627 0.270588 0.203922 rg
46.746 80.049 m 78.848 47.948 l 80.293 46.502 82.637 46.502 84.082 47.948
 c 190.852 154.717 l 192.297 156.163 192.297 158.506 190.852 159.952 c 158.754
 192.053 l 157.305 193.498 154.965 193.498 153.52 192.053 c 46.746 85.284
 l 45.301 83.838 45.301 81.495 46.746 80.049 c h
46.746 80.049 m f
0.313726 0.231373 0.172549 rg
190.852 159.952 m 158.754 192.053 l 157.305 193.498 154.965 193.498 153.52
 192.053 c 118 156.538 l 118 81.866 l 190.852 154.717 l 192.297 156.163 
192.297 158.506 190.852 159.952 c h
190.852 159.952 m f
0.752941 0.223529 0.168627 rg
186.305 150.17 m 92.965 131.502 l 64.398 102.936 l 157.738 121.604 l h
186.305 150.17 m f
0.576471 0.341176 0.2 rg
157.738 121.604 m 64.398 102.936 l 47.336 85.87 l 45.562 84.1 45.086 81.709
 46.266 80.53 c 49.281 77.51 l 129.734 93.6 l h
157.738 121.604 m f
0.619608 0.176471 0.156863 rg
186.305 150.17 m 118 136.51 l 118 113.655 l 157.738 121.604 l h
186.305 150.17 m f
0.47451 0.298039 0.168627 rg
157.738 121.604 m 118 113.655 l 118 91.256 l 129.734 93.6 l h
157.738 121.604 m f
Q Q
showpage
%%Trailer
end restore
%%EOF
