%!PS-Adobe-3.0 EPSF-3.0
%%Creator: cairo 1.14.2 (http://cairographics.org)
%%CreationDate: Tue Jun 21 12:27:50 2016
%%Pages: 1
%%DocumentData: Clean7Bit
%%LanguageLevel: 2
%%BoundingBox: 0 -1 238 238
%%EndComments
%%BeginProlog
save
50 dict begin
/q { gsave } bind def
/Q { grestore } bind def
/cm { 6 array astore concat } bind def
/w { setlinewidth } bind def
/J { setlinecap } bind def
/j { setlinejoin } bind def
/M { setmiterlimit } bind def
/d { setdash } bind def
/m { moveto } bind def
/l { lineto } bind def
/c { curveto } bind def
/h { closepath } bind def
/re { exch dup neg 3 1 roll 5 3 roll moveto 0 rlineto
      0 exch rlineto 0 rlineto closepath } bind def
/S { stroke } bind def
/f { fill } bind def
/f* { eofill } bind def
/n { newpath } bind def
/W { clip } bind def
/W* { eoclip } bind def
/BT { } bind def
/ET { } bind def
/pdfmark where { pop globaldict /?pdfmark /exec load put }
    { globaldict begin /?pdfmark /pop load def /pdfmark
    /cleartomark load def end } ifelse
/BDC { mark 3 1 roll /BDC pdfmark } bind def
/EMC { mark /EMC pdfmark } bind def
/cairo_store_point { /cairo_point_y exch def /cairo_point_x exch def } def
/Tj { show currentpoint cairo_store_point } bind def
/TJ {
  {
    dup
    type /stringtype eq
    { show } { -0.001 mul 0 cairo_font_matrix dtransform rmoveto } ifelse
  } forall
  currentpoint cairo_store_point
} bind def
/cairo_selectfont { cairo_font_matrix aload pop pop pop 0 0 6 array astore
    cairo_font exch selectfont cairo_point_x cairo_point_y moveto } bind def
/Tf { pop /cairo_font exch def /cairo_font_matrix where
      { pop cairo_selectfont } if } bind def
/Td { matrix translate cairo_font_matrix matrix concatmatrix dup
      /cairo_font_matrix exch def dup 4 get exch 5 get cairo_store_point
      /cairo_font where { pop cairo_selectfont } if } bind def
/Tm { 2 copy 8 2 roll 6 array astore /cairo_font_matrix exch def
      cairo_store_point /cairo_font where { pop cairo_selectfont } if } bind def
/g { setgray } bind def
/rg { setrgbcolor } bind def
/d1 { setcachedevice } bind def
%%EndProlog
%%BeginSetup
%%EndSetup
%%Page: 1 1
%%BeginPageSetup
%%PageBoundingBox: 0 -1 238 238
%%EndPageSetup
q 0 -1 238 239 rectclip q
0.0901961 0.670588 0.576471 rg
237.602 118.8 m 237.602 53.191 184.41 -0.001 118.801 -0.001 c 53.188 -0.001
 0 53.191 0 118.8 c 0 184.413 53.188 237.601 118.801 237.601 c 184.41 237.601
 237.602 184.413 237.602 118.8 c h
237.602 118.8 m f
0.0509804 0.447059 0.372549 rg
144.016 186.066 m 142.613 159.765 141.273 134.081 133.199 108.402 c 126.801
 89.202 131.602 66.8 122.801 51.601 c 116.398 41.202 102 33.999 95.602 21.202
 c 95.551 21.116 95.496 21.241 95.445 21.159 c 116.367 0.03 l 117.176 0.015
 117.988 -0.001 118.801 -0.001 c 176.223 -0.001 224.125 40.738 235.191 94.886
 c h
144.016 186.066 m f
0.92549 0.941176 0.945098 rg
167.199 128.859 m 167.199 98.308 145.531 73.542 118.801 73.542 c 92.07 
73.542 70.398 98.308 70.398 128.859 c 70.398 159.405 92.07 197.999 118.801
 197.999 c 145.531 197.999 167.199 159.405 167.199 128.859 c h
167.199 128.859 m f
0.85098 0.858824 0.858824 rg
118.801 197.999 m 118.531 197.999 118.266 197.991 118 197.984 c 118 73.566
 l 118.266 73.562 118.531 73.542 118.801 73.542 c 145.531 73.542 167.199
 98.308 167.199 128.859 c 167.199 159.405 145.531 197.999 118.801 197.999
 c h
118.801 197.999 m f
0.192157 0.294118 0.352941 rg
168 114.171 m 69.602 114.171 l 69.602 89.546 84.363 59.62 104.621 49.57
 c 100.746 46.23 93.902 32.753 92.562 27.366 c 91.703 23.909 94.367 20.573
 97.93 20.573 c 139.668 20.573 l 143.23 20.573 145.898 23.909 145.039 27.366
 c 143.699 32.753 136.855 46.23 132.977 49.57 c 153.238 59.62 168 89.546
 168 114.171 c h
168 114.171 m f
0.14902 0.227451 0.266667 rg
168 114.171 m 118 114.171 l 118 20.573 l 139.668 20.573 l 143.23 20.573
 145.898 23.909 145.039 27.366 c 143.699 32.753 136.855 46.23 132.977 49.57
 c 153.238 59.62 168 89.546 168 114.171 c h
168 114.171 m f
0.74902 0.968627 0.588235 rg
169 108.37 m 68.602 108.37 l 64.957 108.37 62 111.327 62 114.972 c 62 118.616
 64.957 121.573 68.602 121.573 c 169 121.573 l 172.645 121.573 175.602 118.616
 175.602 114.972 c 175.602 111.327 172.645 108.37 169 108.37 c h
169 108.37 m f
0.654902 0.858824 0.490196 rg
169 121.573 m 118 121.573 l 118 108.37 l 169 108.37 l 172.645 108.37 175.602
 111.327 175.602 114.972 c 175.602 118.616 172.645 121.573 169 121.573 c
 h
169 121.573 m f
Q Q
showpage
%%Trailer
end restore
%%EOF
