%!PS-Adobe-3.0 EPSF-3.0
%%Creator: cairo 1.14.2 (http://cairographics.org)
%%CreationDate: Tue Jun 21 12:29:58 2016
%%Pages: 1
%%DocumentData: Clean7Bit
%%LanguageLevel: 2
%%BoundingBox: 0 -1 238 238
%%EndComments
%%BeginProlog
save
50 dict begin
/q { gsave } bind def
/Q { grestore } bind def
/cm { 6 array astore concat } bind def
/w { setlinewidth } bind def
/J { setlinecap } bind def
/j { setlinejoin } bind def
/M { setmiterlimit } bind def
/d { setdash } bind def
/m { moveto } bind def
/l { lineto } bind def
/c { curveto } bind def
/h { closepath } bind def
/re { exch dup neg 3 1 roll 5 3 roll moveto 0 rlineto
      0 exch rlineto 0 rlineto closepath } bind def
/S { stroke } bind def
/f { fill } bind def
/f* { eofill } bind def
/n { newpath } bind def
/W { clip } bind def
/W* { eoclip } bind def
/BT { } bind def
/ET { } bind def
/pdfmark where { pop globaldict /?pdfmark /exec load put }
    { globaldict begin /?pdfmark /pop load def /pdfmark
    /cleartomark load def end } ifelse
/BDC { mark 3 1 roll /BDC pdfmark } bind def
/EMC { mark /EMC pdfmark } bind def
/cairo_store_point { /cairo_point_y exch def /cairo_point_x exch def } def
/Tj { show currentpoint cairo_store_point } bind def
/TJ {
  {
    dup
    type /stringtype eq
    { show } { -0.001 mul 0 cairo_font_matrix dtransform rmoveto } ifelse
  } forall
  currentpoint cairo_store_point
} bind def
/cairo_selectfont { cairo_font_matrix aload pop pop pop 0 0 6 array astore
    cairo_font exch selectfont cairo_point_x cairo_point_y moveto } bind def
/Tf { pop /cairo_font exch def /cairo_font_matrix where
      { pop cairo_selectfont } if } bind def
/Td { matrix translate cairo_font_matrix matrix concatmatrix dup
      /cairo_font_matrix exch def dup 4 get exch 5 get cairo_store_point
      /cairo_font where { pop cairo_selectfont } if } bind def
/Tm { 2 copy 8 2 roll 6 array astore /cairo_font_matrix exch def
      cairo_store_point /cairo_font where { pop cairo_selectfont } if } bind def
/g { setgray } bind def
/rg { setrgbcolor } bind def
/d1 { setcachedevice } bind def
%%EndProlog
%%BeginSetup
%%EndSetup
%%Page: 1 1
%%BeginPageSetup
%%PageBoundingBox: 0 -1 238 238
%%EndPageSetup
q 0 -1 238 239 rectclip q
1 0.658824 0 rg
237.602 118.799 m 237.602 53.19 184.41 -0.002 118.801 -0.002 c 53.188 -0.002
 0 53.19 0 118.799 c 0 184.413 53.188 237.6 118.801 237.6 c 184.41 237.6
 237.602 184.413 237.602 118.799 c h
237.602 118.799 m f
0.807843 0.517647 0 rg
150.273 168.811 m 87.621 28.834 l 116.453 0.03 l 117.234 0.014 118.016 
-0.002 118.801 -0.002 c 173.062 -0.002 218.828 36.381 233.035 86.08 c h
150.273 168.811 m f
0.752941 0.223529 0.168627 rg
115.914 219.901 m 105.602 178.647 l 132 178.647 l 121.688 219.901 l 120.934
 222.905 116.664 222.905 115.914 219.901 c h
115.914 219.901 m f
0.619608 0.137255 0.113725 rg
121.688 219.901 m 121.285 221.51 119.875 222.248 118.535 222.135 c 118.535
 178.647 l 132 178.647 l h
121.688 219.901 m f
1 g
92.398 170.6 m 145.199 170.6 l 145.199 180.233 l 145.199 182.202 143.602
 183.799 141.633 183.799 c 95.969 183.799 l 93.996 183.799 92.402 182.202
 92.402 180.233 c h
92.398 170.6 m f
0.890196 0.898039 0.894118 rg
145.199 180.233 m 145.199 182.202 143.602 183.799 141.633 183.799 c 118.535
 183.799 l 118.535 170.6 l 145.199 170.6 l h
145.199 180.233 m f
0.776471 0.235294 0.133333 rg
93.035 26.401 m 144.566 26.401 l 148.562 26.401 151.801 29.639 151.801 
33.635 c 151.801 164.366 l 151.801 168.362 148.562 171.6 144.566 171.6 c
 93.035 171.6 l 89.039 171.6 85.801 168.362 85.801 164.366 c 85.801 33.635
 l 85.801 29.639 89.039 26.401 93.035 26.401 c h
93.035 26.401 m f
0.619608 0.137255 0.113725 rg
144.566 171.6 m 118.535 171.6 l 118.535 26.401 l 144.566 26.401 l 148.562
 26.401 151.801 29.639 151.801 33.635 c 151.801 164.366 l 151.801 168.362
 148.562 171.6 144.566 171.6 c h
144.566 171.6 m f
1 g
92.398 118.799 52.801 -39.598 re f
0.890196 0.898039 0.894118 rg
118.535 118.799 26.664 -39.598 re f
Q Q
showpage
%%Trailer
end restore
%%EOF
