%!PS-Adobe-3.0 EPSF-3.0
%%Creator: cairo 1.14.2 (http://cairographics.org)
%%CreationDate: Tue Jun 21 12:28:17 2016
%%Pages: 1
%%DocumentData: Clean7Bit
%%LanguageLevel: 2
%%BoundingBox: 0 -1 238 238
%%EndComments
%%BeginProlog
save
50 dict begin
/q { gsave } bind def
/Q { grestore } bind def
/cm { 6 array astore concat } bind def
/w { setlinewidth } bind def
/J { setlinecap } bind def
/j { setlinejoin } bind def
/M { setmiterlimit } bind def
/d { setdash } bind def
/m { moveto } bind def
/l { lineto } bind def
/c { curveto } bind def
/h { closepath } bind def
/re { exch dup neg 3 1 roll 5 3 roll moveto 0 rlineto
      0 exch rlineto 0 rlineto closepath } bind def
/S { stroke } bind def
/f { fill } bind def
/f* { eofill } bind def
/n { newpath } bind def
/W { clip } bind def
/W* { eoclip } bind def
/BT { } bind def
/ET { } bind def
/pdfmark where { pop globaldict /?pdfmark /exec load put }
    { globaldict begin /?pdfmark /pop load def /pdfmark
    /cleartomark load def end } ifelse
/BDC { mark 3 1 roll /BDC pdfmark } bind def
/EMC { mark /EMC pdfmark } bind def
/cairo_store_point { /cairo_point_y exch def /cairo_point_x exch def } def
/Tj { show currentpoint cairo_store_point } bind def
/TJ {
  {
    dup
    type /stringtype eq
    { show } { -0.001 mul 0 cairo_font_matrix dtransform rmoveto } ifelse
  } forall
  currentpoint cairo_store_point
} bind def
/cairo_selectfont { cairo_font_matrix aload pop pop pop 0 0 6 array astore
    cairo_font exch selectfont cairo_point_x cairo_point_y moveto } bind def
/Tf { pop /cairo_font exch def /cairo_font_matrix where
      { pop cairo_selectfont } if } bind def
/Td { matrix translate cairo_font_matrix matrix concatmatrix dup
      /cairo_font_matrix exch def dup 4 get exch 5 get cairo_store_point
      /cairo_font where { pop cairo_selectfont } if } bind def
/Tm { 2 copy 8 2 roll 6 array astore /cairo_font_matrix exch def
      cairo_store_point /cairo_font where { pop cairo_selectfont } if } bind def
/g { setgray } bind def
/rg { setrgbcolor } bind def
/d1 { setcachedevice } bind def
%%EndProlog
%%BeginSetup
%%EndSetup
%%Page: 1 1
%%BeginPageSetup
%%PageBoundingBox: 0 -1 238 238
%%EndPageSetup
q 0 -1 238 239 rectclip q
0.721569 0.337255 0.152941 rg
237.602 118.799 m 237.602 53.19 184.41 -0.002 118.801 -0.002 c 53.188 -0.002
 0 53.19 0 118.799 c 0 184.413 53.188 237.6 118.801 237.6 c 184.41 237.6
 237.602 184.413 237.602 118.799 c h
237.602 118.799 m f
0.576471 0.211765 0.0823529 rg
158.074 188.295 m 74.016 47.6 l 121.582 0.034 l 182.68 1.44 232.375 48.967
 237.211 109.163 c h
158.074 188.295 m f
0.956863 0.686275 0.188235 rg
93.332 39.6 m 144.266 39.6 l 159.363 39.6 171.602 51.838 171.602 66.932
 c 171.602 144.268 l 171.602 159.362 159.363 171.6 144.266 171.6 c 93.332
 171.6 l 78.238 171.6 66 159.362 66 144.268 c 66 66.932 l 66 51.838 78.238
 39.6 93.332 39.6 c h
93.332 39.6 m f
0.866667 0.6 0.164706 rg
144.266 171.6 m 118.133 171.6 l 118.133 39.6 l 144.266 39.6 l 159.363 39.6
 171.602 51.838 171.602 66.932 c 171.602 144.268 l 171.602 159.362 159.363
 171.6 144.266 171.6 c h
144.266 171.6 m f
0.92549 0.941176 0.945098 rg
152.668 79.202 m 84.934 79.202 l 81.766 79.202 79.199 81.768 79.199 84.932
 c 79.199 126.268 l 79.199 129.432 81.766 132.002 84.934 132.002 c 152.668
 132.002 l 155.832 132.002 158.398 129.432 158.398 126.268 c 158.398 84.932
 l 158.398 81.768 155.832 79.202 152.668 79.202 c h
152.668 79.202 m f
0.862745 0.87451 0.878431 rg
152.668 131.998 m 118.133 131.998 l 118.133 79.202 l 152.668 79.202 l 155.832
 79.202 158.398 81.768 158.398 84.932 c 158.398 126.268 l 158.398 129.432
 155.832 131.998 152.668 131.998 c h
152.668 131.998 m f
0.901961 0.494118 0.133333 rg
104.398 109.448 m 99 118.799 l 104.398 128.155 l 115.199 128.155 l 120.602
 118.799 l 115.199 109.448 l h
104.398 109.448 m f
124 99.045 m 118.602 108.401 l 124 117.752 l 134.801 117.752 l 140.199 
108.401 l 134.801 99.045 l h
124 99.045 m f
104.801 86.893 m 99.398 96.248 l 104.801 105.6 l 115.602 105.6 l 121 96.248
 l 115.602 86.893 l h
104.801 86.893 m f
0.47451 0.298039 0.168627 rg
82.582 169.498 m 155.02 169.498 l 157.328 169.498 159.199 171.373 159.199
 173.682 c 159.199 185.518 l 159.199 187.827 157.328 189.702 155.02 189.702
 c 82.582 189.702 l 80.273 189.702 78.398 187.827 78.398 185.518 c 78.398
 173.682 l 78.398 171.373 80.273 169.498 82.582 169.498 c h
82.582 169.498 m f
0.427451 0.262745 0.14902 rg
155.016 189.702 m 118.133 189.702 l 118.133 169.498 l 155.016 169.498 l
 157.328 169.498 159.199 171.373 159.199 173.682 c 159.199 185.518 l 159.199
 187.827 157.328 189.702 155.016 189.702 c h
155.016 189.702 m f
Q Q
showpage
%%Trailer
end restore
%%EOF
