%!PS-Adobe-3.0 EPSF-3.0
%%Creator: cairo 1.14.2 (http://cairographics.org)
%%CreationDate: Tue Jun 21 12:28:26 2016
%%Pages: 1
%%DocumentData: Clean7Bit
%%LanguageLevel: 2
%%BoundingBox: 0 -1 238 238
%%EndComments
%%BeginProlog
save
50 dict begin
/q { gsave } bind def
/Q { grestore } bind def
/cm { 6 array astore concat } bind def
/w { setlinewidth } bind def
/J { setlinecap } bind def
/j { setlinejoin } bind def
/M { setmiterlimit } bind def
/d { setdash } bind def
/m { moveto } bind def
/l { lineto } bind def
/c { curveto } bind def
/h { closepath } bind def
/re { exch dup neg 3 1 roll 5 3 roll moveto 0 rlineto
      0 exch rlineto 0 rlineto closepath } bind def
/S { stroke } bind def
/f { fill } bind def
/f* { eofill } bind def
/n { newpath } bind def
/W { clip } bind def
/W* { eoclip } bind def
/BT { } bind def
/ET { } bind def
/pdfmark where { pop globaldict /?pdfmark /exec load put }
    { globaldict begin /?pdfmark /pop load def /pdfmark
    /cleartomark load def end } ifelse
/BDC { mark 3 1 roll /BDC pdfmark } bind def
/EMC { mark /EMC pdfmark } bind def
/cairo_store_point { /cairo_point_y exch def /cairo_point_x exch def } def
/Tj { show currentpoint cairo_store_point } bind def
/TJ {
  {
    dup
    type /stringtype eq
    { show } { -0.001 mul 0 cairo_font_matrix dtransform rmoveto } ifelse
  } forall
  currentpoint cairo_store_point
} bind def
/cairo_selectfont { cairo_font_matrix aload pop pop pop 0 0 6 array astore
    cairo_font exch selectfont cairo_point_x cairo_point_y moveto } bind def
/Tf { pop /cairo_font exch def /cairo_font_matrix where
      { pop cairo_selectfont } if } bind def
/Td { matrix translate cairo_font_matrix matrix concatmatrix dup
      /cairo_font_matrix exch def dup 4 get exch 5 get cairo_store_point
      /cairo_font where { pop cairo_selectfont } if } bind def
/Tm { 2 copy 8 2 roll 6 array astore /cairo_font_matrix exch def
      cairo_store_point /cairo_font where { pop cairo_selectfont } if } bind def
/g { setgray } bind def
/rg { setrgbcolor } bind def
/d1 { setcachedevice } bind def
%%EndProlog
%%BeginSetup
%%EndSetup
%%Page: 1 1
%%BeginPageSetup
%%PageBoundingBox: 0 -1 238 238
%%EndPageSetup
q 0 -1 238 239 rectclip q
0.368627 0.203922 0.368627 rg
237.602 118.799 m 237.602 53.19 184.41 -0.002 118.801 -0.002 c 53.188 -0.002
 0 53.19 0 118.799 c 0 184.413 53.188 237.6 118.801 237.6 c 184.41 237.6
 237.602 184.413 237.602 118.799 c h
237.602 118.799 m f
0.27451 0.129412 0.278431 rg
187.262 156.272 m 28.715 80.815 l 109.137 0.393 l 112.324 0.135 115.547
 -0.002 118.801 -0.002 c 180.277 -0.002 230.848 46.698 236.977 106.557 c
 h
187.262 156.272 m f
0.847059 0.364706 0.447059 rg
36 88.799 m 95.145 88.799 l 84.902 148.647 l 83.992 155.03 78.527 159.772
 72.078 159.772 c 59.066 159.772 l 52.617 159.772 47.152 155.03 46.238 148.647
 c h
36 88.799 m f
0.788235 0.341176 0.435294 rg
142.457 88.799 m 201.602 88.799 l 191.359 148.647 l 190.449 155.03 184.984
 159.772 178.535 159.772 c 165.523 159.772 l 159.074 159.772 153.609 155.03
 152.695 148.647 c h
142.457 88.799 m f
0.847059 0.466667 0.533333 rg
118.801 88.799 m 177.941 88.799 l 167.703 159.772 l 166.793 166.155 161.328
 170.893 154.879 170.893 c 141.863 170.893 l 135.418 170.893 129.953 166.155
 129.039 159.772 c h
118.801 88.799 m f
0.929412 0.501961 0.552941 rg
59.656 88.799 m 118.801 88.799 l 108.562 159.772 l 107.648 166.155 102.184
 170.893 95.734 170.893 c 82.723 170.893 l 76.273 170.893 70.809 166.155
 69.895 159.772 c h
59.656 88.799 m f
0.937255 0.670588 0.729412 rg
89.23 88.799 m 148.371 88.799 l 138.133 160.475 l 137.223 166.858 131.754
 171.6 125.309 171.6 c 112.293 171.6 l 105.848 171.6 100.379 166.858 99.469
 160.475 c h
89.23 88.799 m f
0.827451 0.564706 0.631373 rg
138.133 160.475 m 137.219 166.858 131.754 171.6 125.309 171.6 c 119.336
 171.6 l 119.336 88.799 l 148.371 88.799 l h
138.133 160.475 m f
0.92549 0.941176 0.945098 rg
33 79.202 m 204.602 79.202 l 208.246 79.202 211.199 82.155 211.199 85.799
 c 211.199 89.444 208.246 92.401 204.602 92.401 c 33 92.401 l 29.355 92.401
 26.398 89.444 26.398 85.799 c 26.398 82.155 29.355 79.202 33 79.202 c h
33 79.202 m f
0.815686 0.835294 0.85098 rg
204.602 92.401 m 119.332 92.401 l 119.332 79.202 l 204.602 79.202 l 208.246
 79.202 211.199 82.155 211.199 85.799 c 211.199 89.444 208.246 92.401 204.602
 92.401 c h
204.602 92.401 m f
Q Q
showpage
%%Trailer
end restore
%%EOF
