%!PS-Adobe-3.0 EPSF-3.0
%%Creator: cairo 1.14.2 (http://cairographics.org)
%%CreationDate: Tue Jun 21 12:30:42 2016
%%Pages: 1
%%DocumentData: Clean7Bit
%%LanguageLevel: 2
%%BoundingBox: 0 -1 238 238
%%EndComments
%%BeginProlog
save
50 dict begin
/q { gsave } bind def
/Q { grestore } bind def
/cm { 6 array astore concat } bind def
/w { setlinewidth } bind def
/J { setlinecap } bind def
/j { setlinejoin } bind def
/M { setmiterlimit } bind def
/d { setdash } bind def
/m { moveto } bind def
/l { lineto } bind def
/c { curveto } bind def
/h { closepath } bind def
/re { exch dup neg 3 1 roll 5 3 roll moveto 0 rlineto
      0 exch rlineto 0 rlineto closepath } bind def
/S { stroke } bind def
/f { fill } bind def
/f* { eofill } bind def
/n { newpath } bind def
/W { clip } bind def
/W* { eoclip } bind def
/BT { } bind def
/ET { } bind def
/pdfmark where { pop globaldict /?pdfmark /exec load put }
    { globaldict begin /?pdfmark /pop load def /pdfmark
    /cleartomark load def end } ifelse
/BDC { mark 3 1 roll /BDC pdfmark } bind def
/EMC { mark /EMC pdfmark } bind def
/cairo_store_point { /cairo_point_y exch def /cairo_point_x exch def } def
/Tj { show currentpoint cairo_store_point } bind def
/TJ {
  {
    dup
    type /stringtype eq
    { show } { -0.001 mul 0 cairo_font_matrix dtransform rmoveto } ifelse
  } forall
  currentpoint cairo_store_point
} bind def
/cairo_selectfont { cairo_font_matrix aload pop pop pop 0 0 6 array astore
    cairo_font exch selectfont cairo_point_x cairo_point_y moveto } bind def
/Tf { pop /cairo_font exch def /cairo_font_matrix where
      { pop cairo_selectfont } if } bind def
/Td { matrix translate cairo_font_matrix matrix concatmatrix dup
      /cairo_font_matrix exch def dup 4 get exch 5 get cairo_store_point
      /cairo_font where { pop cairo_selectfont } if } bind def
/Tm { 2 copy 8 2 roll 6 array astore /cairo_font_matrix exch def
      cairo_store_point /cairo_font where { pop cairo_selectfont } if } bind def
/g { setgray } bind def
/rg { setrgbcolor } bind def
/d1 { setcachedevice } bind def
%%EndProlog
%%BeginSetup
%%EndSetup
%%Page: 1 1
%%BeginPageSetup
%%PageBoundingBox: 0 -1 238 238
%%EndPageSetup
q 0 -1 238 239 rectclip q
0.203922 0.313726 0.396078 rg
237.602 118.799 m 237.602 53.19 184.41 -0.002 118.801 -0.002 c 53.188 -0.002
 0 53.19 0 118.799 c 0 184.413 53.188 237.6 118.801 237.6 c 184.41 237.6
 237.602 184.413 237.602 118.799 c h
237.602 118.799 m f
0.172549 0.243137 0.313726 rg
173.516 149.811 m 34.145 82.518 l 116.633 0.026 l 117.355 0.014 118.074
 -0.002 118.801 -0.002 c 174.262 -0.002 220.844 38.006 233.93 89.397 c h
173.516 149.811 m f
0.803922 0.819608 0.827451 rg
39.199 91.998 m 39.199 135.963 74.84 171.6 118.801 171.6 c 162.762 171.6
 198.398 135.963 198.398 91.998 c h
39.199 91.998 m f
0.639216 0.654902 0.658824 rg
118.801 171.6 m 118.801 91.998 l 198.398 91.998 l 198.398 135.963 162.762
 171.6 118.801 171.6 c h
118.801 171.6 m f
0.6 0.670588 0.835294 rg
43.602 78.799 m 194 78.799 l 201.953 78.799 208.398 85.248 208.398 93.202
 c 29.199 93.202 l 29.199 85.248 35.648 78.799 43.602 78.799 c h
43.602 78.799 m f
125.602 177.998 m 125.602 174.245 122.555 171.202 118.801 171.202 c 115.043
 171.202 112 174.245 112 177.998 c 112 181.756 115.043 184.799 118.801 184.799
 c 122.555 184.799 125.602 181.756 125.602 177.998 c h
125.602 177.998 m f
0.501961 0.572549 0.717647 rg
118.801 93.202 m 118.801 78.799 l 194 78.799 l 201.953 78.799 208.398 85.248
 208.398 93.202 c h
118.801 93.202 m f
125.602 177.998 m 125.602 181.756 122.555 184.799 118.801 184.799 c 118.801
 171.202 l 122.555 171.202 125.602 174.245 125.602 177.998 c h
125.602 177.998 m f
Q Q
showpage
%%Trailer
end restore
%%EOF
