%!PS-Adobe-3.0 EPSF-3.0
%%Creator: cairo 1.14.2 (http://cairographics.org)
%%CreationDate: Tue Jun 21 12:31:09 2016
%%Pages: 1
%%DocumentData: Clean7Bit
%%LanguageLevel: 2
%%BoundingBox: 0 -1 238 238
%%EndComments
%%BeginProlog
save
50 dict begin
/q { gsave } bind def
/Q { grestore } bind def
/cm { 6 array astore concat } bind def
/w { setlinewidth } bind def
/J { setlinecap } bind def
/j { setlinejoin } bind def
/M { setmiterlimit } bind def
/d { setdash } bind def
/m { moveto } bind def
/l { lineto } bind def
/c { curveto } bind def
/h { closepath } bind def
/re { exch dup neg 3 1 roll 5 3 roll moveto 0 rlineto
      0 exch rlineto 0 rlineto closepath } bind def
/S { stroke } bind def
/f { fill } bind def
/f* { eofill } bind def
/n { newpath } bind def
/W { clip } bind def
/W* { eoclip } bind def
/BT { } bind def
/ET { } bind def
/pdfmark where { pop globaldict /?pdfmark /exec load put }
    { globaldict begin /?pdfmark /pop load def /pdfmark
    /cleartomark load def end } ifelse
/BDC { mark 3 1 roll /BDC pdfmark } bind def
/EMC { mark /EMC pdfmark } bind def
/cairo_store_point { /cairo_point_y exch def /cairo_point_x exch def } def
/Tj { show currentpoint cairo_store_point } bind def
/TJ {
  {
    dup
    type /stringtype eq
    { show } { -0.001 mul 0 cairo_font_matrix dtransform rmoveto } ifelse
  } forall
  currentpoint cairo_store_point
} bind def
/cairo_selectfont { cairo_font_matrix aload pop pop pop 0 0 6 array astore
    cairo_font exch selectfont cairo_point_x cairo_point_y moveto } bind def
/Tf { pop /cairo_font exch def /cairo_font_matrix where
      { pop cairo_selectfont } if } bind def
/Td { matrix translate cairo_font_matrix matrix concatmatrix dup
      /cairo_font_matrix exch def dup 4 get exch 5 get cairo_store_point
      /cairo_font where { pop cairo_selectfont } if } bind def
/Tm { 2 copy 8 2 roll 6 array astore /cairo_font_matrix exch def
      cairo_store_point /cairo_font where { pop cairo_selectfont } if } bind def
/g { setgray } bind def
/rg { setrgbcolor } bind def
/d1 { setcachedevice } bind def
%%EndProlog
%%BeginSetup
%%EndSetup
%%Page: 1 1
%%BeginPageSetup
%%PageBoundingBox: 0 -1 238 238
%%EndPageSetup
q 0 -1 238 239 rectclip q
0.309804 0.168627 0.309804 rg
237.602 118.799 m 237.602 53.19 184.41 -0.002 118.801 -0.002 c 53.188 -0.002
 0 53.19 0 118.799 c 0 184.413 53.188 237.6 118.801 237.6 c 184.41 237.6
 237.602 184.413 237.602 118.799 c h
237.602 118.799 m f
0.27451 0.129412 0.278431 rg
147.414 201.588 m 112.152 31.198 l 141.191 2.116 l 193.809 12.155 234.113
 56.893 237.379 111.612 c h
147.414 201.588 m f
0.976471 0.713726 0.372549 rg
118.801 29.022 m 125.004 29.022 130.035 34.049 130.035 40.256 c 130.035
 83.952 l 107.562 83.952 l 107.562 40.256 l 107.562 34.053 112.594 29.022
 118.801 29.022 c h
118.801 29.022 m f
1 0.658824 0 rg
118.934 83.955 m 118.934 29.026 l 125.078 29.1 130.035 34.096 130.035 40.256
 c 130.035 83.955 l h
118.934 83.955 m f
0.85098 0.329412 0.34902 rg
77.602 172.178 m 77.602 195.17 96.43 213.76 119.504 213.373 c 142.094 212.998
 160 194.096 160 171.502 c 160 87.006 l 160 80.952 155.094 76.045 149.043
 76.045 c 88.559 76.045 l 82.508 76.045 77.602 80.952 77.602 87.006 c h
77.602 172.178 m f
0.698039 0.247059 0.278431 rg
119.504 213.373 m 119.312 213.377 119.125 213.37 118.934 213.37 c 118.934
 76.045 l 149.043 76.045 l 155.094 76.045 160 80.952 160 87.006 c 160 171.502
 l 160 194.096 142.094 212.998 119.504 213.373 c h
119.504 213.373 m f
Q Q
showpage
%%Trailer
end restore
%%EOF
