%!PS-Adobe-3.0 EPSF-3.0
%%Creator: cairo 1.14.2 (http://cairographics.org)
%%CreationDate: Tue Jun 21 12:29:07 2016
%%Pages: 1
%%DocumentData: Clean7Bit
%%LanguageLevel: 2
%%BoundingBox: 0 -1 238 238
%%EndComments
%%BeginProlog
save
50 dict begin
/q { gsave } bind def
/Q { grestore } bind def
/cm { 6 array astore concat } bind def
/w { setlinewidth } bind def
/J { setlinecap } bind def
/j { setlinejoin } bind def
/M { setmiterlimit } bind def
/d { setdash } bind def
/m { moveto } bind def
/l { lineto } bind def
/c { curveto } bind def
/h { closepath } bind def
/re { exch dup neg 3 1 roll 5 3 roll moveto 0 rlineto
      0 exch rlineto 0 rlineto closepath } bind def
/S { stroke } bind def
/f { fill } bind def
/f* { eofill } bind def
/n { newpath } bind def
/W { clip } bind def
/W* { eoclip } bind def
/BT { } bind def
/ET { } bind def
/pdfmark where { pop globaldict /?pdfmark /exec load put }
    { globaldict begin /?pdfmark /pop load def /pdfmark
    /cleartomark load def end } ifelse
/BDC { mark 3 1 roll /BDC pdfmark } bind def
/EMC { mark /EMC pdfmark } bind def
/cairo_store_point { /cairo_point_y exch def /cairo_point_x exch def } def
/Tj { show currentpoint cairo_store_point } bind def
/TJ {
  {
    dup
    type /stringtype eq
    { show } { -0.001 mul 0 cairo_font_matrix dtransform rmoveto } ifelse
  } forall
  currentpoint cairo_store_point
} bind def
/cairo_selectfont { cairo_font_matrix aload pop pop pop 0 0 6 array astore
    cairo_font exch selectfont cairo_point_x cairo_point_y moveto } bind def
/Tf { pop /cairo_font exch def /cairo_font_matrix where
      { pop cairo_selectfont } if } bind def
/Td { matrix translate cairo_font_matrix matrix concatmatrix dup
      /cairo_font_matrix exch def dup 4 get exch 5 get cairo_store_point
      /cairo_font where { pop cairo_selectfont } if } bind def
/Tm { 2 copy 8 2 roll 6 array astore /cairo_font_matrix exch def
      cairo_store_point /cairo_font where { pop cairo_selectfont } if } bind def
/g { setgray } bind def
/rg { setrgbcolor } bind def
/d1 { setcachedevice } bind def
%%EndProlog
%%BeginSetup
%%EndSetup
%%Page: 1 1
%%BeginPageSetup
%%PageBoundingBox: 0 -1 238 238
%%EndPageSetup
q 0 -1 238 239 rectclip q
0.901961 0.494118 0.133333 rg
237.602 118.799 m 237.602 53.19 184.41 -0.002 118.801 -0.002 c 53.188 -0.002
 0 53.19 0 118.799 c 0 184.413 53.188 237.6 118.801 237.6 c 184.41 237.6
 237.602 184.413 237.602 118.799 c h
237.602 118.799 m f
0.678431 0.282353 0.109804 rg
145.199 184.799 m 79.199 39.6 l 118.801 -0.002 l 176.199 -0.002 224.086
 40.705 235.18 94.823 c h
145.199 184.799 m f
1 0.803922 0.00784314 rg
92.398 184.799 52.801 -13.199 re f
0.917647 0.752941 0.0588235 rg
118.535 184.799 26.664 -13.199 re f
1 0.803922 0.00784314 rg
79.199 39.6 m 158.398 39.6 l 158.398 159.401 l 145.199 162.202 l 92.398
 162.202 l 79.199 159.401 l h
79.199 39.6 m f
0.917647 0.752941 0.0588235 rg
158.398 159.401 m 145.199 162.202 l 118.535 162.202 l 118.535 39.6 l 158.398
 39.6 l h
158.398 159.401 m f
0.827451 0.329412 0 rg
102.133 65.998 m 135.469 65.998 l 140.844 65.998 145.199 70.358 145.199
 75.733 c 145.199 109.069 l 145.199 114.444 140.844 118.799 135.469 118.799
 c 102.133 118.799 l 96.758 118.799 92.402 114.444 92.402 109.069 c 92.402
 75.733 l 92.398 70.358 96.758 65.998 102.133 65.998 c h
102.133 65.998 m f
0.709804 0.266667 0.0235294 rg
135.469 118.799 m 118.535 118.799 l 118.535 65.998 l 135.469 65.998 l 140.844
 65.998 145.199 70.358 145.199 75.733 c 145.199 109.069 l 145.199 114.444
 140.844 118.799 135.469 118.799 c h
135.469 118.799 m f
0.92549 0.941176 0.945098 rg
79.199 159.401 m 158.398 159.401 l 145.199 172.6 l 92.398 172.6 l h
79.199 159.401 m f
0.815686 0.839216 0.847059 rg
145.199 172.6 m 118.535 172.6 l 118.535 159.401 l 158.398 159.401 l h
145.199 172.6 m f
0.47451 0.188235 0.164706 rg
118 164.401 m 117.281 164.401 116.566 164.674 116.02 165.221 c 90.441 190.799
 l 65.199 190.799 l 63.652 190.799 62.398 192.053 62.398 193.6 c 62.398 
195.147 63.652 196.401 65.199 196.401 c 92.762 196.401 l 119.98 169.178 
l 121.074 168.088 121.074 166.315 119.98 165.221 c 119.434 164.674 118.719
 164.401 118 164.401 c h
118 164.401 m f
Q Q
showpage
%%Trailer
end restore
%%EOF
