%!PS-Adobe-3.0 EPSF-3.0
%%Creator: cairo 1.14.2 (http://cairographics.org)
%%CreationDate: Tue Jun 21 12:27:07 2016
%%Pages: 1
%%DocumentData: Clean7Bit
%%LanguageLevel: 2
%%BoundingBox: 0 -1 238 238
%%EndComments
%%BeginProlog
save
50 dict begin
/q { gsave } bind def
/Q { grestore } bind def
/cm { 6 array astore concat } bind def
/w { setlinewidth } bind def
/J { setlinecap } bind def
/j { setlinejoin } bind def
/M { setmiterlimit } bind def
/d { setdash } bind def
/m { moveto } bind def
/l { lineto } bind def
/c { curveto } bind def
/h { closepath } bind def
/re { exch dup neg 3 1 roll 5 3 roll moveto 0 rlineto
      0 exch rlineto 0 rlineto closepath } bind def
/S { stroke } bind def
/f { fill } bind def
/f* { eofill } bind def
/n { newpath } bind def
/W { clip } bind def
/W* { eoclip } bind def
/BT { } bind def
/ET { } bind def
/pdfmark where { pop globaldict /?pdfmark /exec load put }
    { globaldict begin /?pdfmark /pop load def /pdfmark
    /cleartomark load def end } ifelse
/BDC { mark 3 1 roll /BDC pdfmark } bind def
/EMC { mark /EMC pdfmark } bind def
/cairo_store_point { /cairo_point_y exch def /cairo_point_x exch def } def
/Tj { show currentpoint cairo_store_point } bind def
/TJ {
  {
    dup
    type /stringtype eq
    { show } { -0.001 mul 0 cairo_font_matrix dtransform rmoveto } ifelse
  } forall
  currentpoint cairo_store_point
} bind def
/cairo_selectfont { cairo_font_matrix aload pop pop pop 0 0 6 array astore
    cairo_font exch selectfont cairo_point_x cairo_point_y moveto } bind def
/Tf { pop /cairo_font exch def /cairo_font_matrix where
      { pop cairo_selectfont } if } bind def
/Td { matrix translate cairo_font_matrix matrix concatmatrix dup
      /cairo_font_matrix exch def dup 4 get exch 5 get cairo_store_point
      /cairo_font where { pop cairo_selectfont } if } bind def
/Tm { 2 copy 8 2 roll 6 array astore /cairo_font_matrix exch def
      cairo_store_point /cairo_font where { pop cairo_selectfont } if } bind def
/g { setgray } bind def
/rg { setrgbcolor } bind def
/d1 { setcachedevice } bind def
%%EndProlog
%%BeginSetup
%%EndSetup
%%Page: 1 1
%%BeginPageSetup
%%PageBoundingBox: 0 -1 238 238
%%EndPageSetup
q 0 -1 238 239 rectclip q
0.309804 0.168627 0.309804 rg
237.602 118.799 m 237.602 53.19 184.41 -0.002 118.801 -0.002 c 53.188 -0.002
 0 53.19 0 118.799 c 0 184.413 53.188 237.6 118.801 237.6 c 184.41 237.6
 237.602 184.413 237.602 118.799 c h
237.602 118.799 m f
0.27451 0.129412 0.278431 rg
170.012 170.252 m 135.926 135.838 l 140.051 131.491 142.609 125.588 142.895
 119.202 c 143.473 106.26 131.469 95.241 118.934 95.241 c 112.379 95.241
 106.66 97.858 102.449 102.041 c 67.84 67.104 l 133.984 0.963 l 187.457 
7.784 229.82 50.151 236.641 103.623 c h
170.012 170.252 m f
0.941176 0.752941 0.509804 rg
118.801 191.401 m 78.703 191.401 46.199 158.897 46.199 118.799 c 46.199
 78.705 78.703 46.202 118.801 46.202 c 158.895 46.202 191.398 78.705 191.398
 118.799 c 191.398 158.897 158.895 191.401 118.801 191.401 c h
118.801 98.998 m 107.863 98.998 99 107.866 99 118.799 c 99 129.737 107.863
 138.6 118.801 138.6 c 129.734 138.6 138.602 129.737 138.602 118.799 c 138.602
 107.866 129.734 98.998 118.801 98.998 c h
118.801 98.998 m f
0.827451 0.643137 0.443137 rg
191.398 118.799 m 191.398 158.717 159.184 191.104 119.332 191.393 c 119.332
 138.588 l 130.023 138.303 138.602 129.557 138.602 118.799 c 138.602 108.045
 130.023 99.295 119.332 99.014 c 119.332 46.205 l 159.184 46.495 191.398
 78.881 191.398 118.799 c h
191.398 118.799 m f
0.941176 0.752941 0.509804 rg
118.801 98.998 m 107.863 98.998 99 107.866 99 118.799 c 99 129.737 107.863
 138.6 118.801 138.6 c 118.98 138.6 119.156 138.592 119.332 138.588 c 119.332
 191.393 l 119.156 191.393 118.977 191.401 118.801 191.401 c 78.703 191.401
 46.199 158.897 46.199 118.799 c 46.199 78.705 78.703 46.202 118.801 46.202
 c 118.977 46.202 119.156 46.205 119.332 46.205 c 119.332 99.014 l 119.156
 99.01 118.98 98.998 118.801 98.998 c h
118.801 98.998 m f
0.952941 0.431373 0.505882 rg
73.199 106.799 m 81.066 119.467 89.281 121.502 99.02 119.487 c 99.379 130.104
 108.094 138.6 118.801 138.6 c 129.734 138.6 138.602 129.737 138.602 118.799
 c 138.602 116.424 138.18 114.151 137.414 112.041 c 147.469 98.686 165.211
 104.17 178 113.202 c 181.434 115.651 186.367 116.592 191.328 115.67 c 191.371
 116.709 191.398 117.752 191.398 118.799 c 191.398 158.897 158.895 191.401
 118.801 191.401 c 78.93 191.401 46.574 159.26 46.207 119.479 c 53.207 116.666
 58.848 110.338 65.199 105.202 c 68 102.932 70.66 102.709 73.199 106.799
 c h
73.199 106.799 m f
118.801 191.401 m 78.93 191.401 46.574 159.26 46.207 119.479 c 53.207 116.666
 58.848 110.338 65.199 105.202 c 68 102.932 70.66 102.709 73.199 106.799
 c 81.066 119.467 89.281 121.502 99.02 119.487 c 99.379 130.104 108.094 
138.6 118.801 138.6 c 118.98 138.6 119.156 138.592 119.332 138.588 c 119.332
 191.393 l 119.156 191.393 118.977 191.401 118.801 191.401 c h
118.801 191.401 m f
0.866667 0.356863 0.454902 rg
119.332 191.393 m 119.332 138.588 l 130.023 138.303 138.602 129.557 138.602
 118.799 c 138.602 116.424 138.18 114.151 137.414 112.041 c 147.469 98.686
 165.211 104.17 178 113.202 c 181.434 115.651 186.367 116.592 191.328 115.67
 c 191.371 116.709 191.398 117.752 191.398 118.799 c 191.398 158.717 159.184
 191.104 119.332 191.393 c h
119.332 191.393 m f
0.564706 0.345098 0.207843 rg
82.207 137.795 m 78.395 135.596 l 77.344 134.987 75.996 135.346 75.391 
136.401 c 74.781 137.452 75.141 138.799 76.195 139.405 c 80.004 141.604 
l 81.059 142.213 82.402 141.854 83.012 140.799 c 83.617 139.748 83.258 138.401
 82.207 137.795 c h
82.207 137.795 m f
117.125 176.842 m 116.637 172.471 l 116.5 171.264 115.414 170.393 114.203
 170.53 c 112.996 170.663 112.129 171.752 112.262 172.959 c 112.754 177.33
 l 112.887 178.538 113.977 179.409 115.184 179.272 c 116.391 179.139 117.262
 178.049 117.125 176.842 c h
117.125 176.842 m f
0.776471 0.235294 0.133333 rg
139.109 154.295 m 135.301 152.096 l 134.25 151.487 132.902 151.846 132.297
 152.901 c 131.688 153.952 132.047 155.299 133.102 155.905 c 136.91 158.104
 l 137.965 158.713 139.309 158.354 139.918 157.299 c 140.523 156.248 140.164
 154.901 139.109 154.295 c h
139.109 154.295 m f
64.301 130.631 m 61.285 132.17 l 60.453 132.592 60.121 133.608 60.543 134.44
 c 60.969 135.268 61.988 135.596 62.82 135.17 c 65.836 133.635 l 66.668 
133.209 67 132.194 66.574 131.366 c 66.152 130.534 65.133 130.205 64.301
 130.631 c h
64.301 130.631 m f
175.539 132.186 m 172.523 133.725 l 171.691 134.147 171.359 135.163 171.785
 135.995 c 172.207 136.823 173.227 137.151 174.062 136.725 c 177.074 135.19
 l 177.91 134.764 178.238 133.748 177.816 132.92 c 177.391 132.088 176.371
 131.76 175.539 132.186 c h
175.539 132.186 m f
1 0.803922 0.00784314 rg
84.18 152.112 m 80.32 154.225 l 79.254 154.811 78.863 156.147 79.445 157.213
 c 80.031 158.28 81.367 158.67 82.434 158.084 c 86.293 155.971 l 87.359 
155.389 87.75 154.053 87.164 152.987 c 86.582 151.92 85.246 151.53 84.18
 152.112 c h
84.18 152.112 m f
110.602 152.155 m 106.742 154.268 l 105.68 154.854 105.289 156.19 105.871
 157.256 c 106.457 158.323 107.793 158.713 108.859 158.127 c 112.719 156.014
 l 113.781 155.432 114.172 154.096 113.59 153.03 c 113.004 151.963 111.668
 151.573 110.602 152.155 c h
110.602 152.155 m f
159.566 127.795 m 161.586 131.705 l 162.141 132.788 163.469 133.209 164.547
 132.655 c 165.629 132.096 166.051 130.768 165.492 129.69 c 163.477 125.78
 l 162.918 124.698 161.594 124.276 160.512 124.834 c 159.434 125.389 159.008
 126.717 159.566 127.795 c h
159.566 127.795 m f
0.92549 0.941176 0.945098 rg
104.57 141.686 m 101.215 138.842 l 100.289 138.057 98.898 138.17 98.113
 139.096 c 97.328 140.022 97.441 141.413 98.367 142.198 c 101.727 145.041
 l 102.652 145.83 104.039 145.713 104.824 144.788 c 105.613 143.862 105.496
 142.471 104.57 141.686 c h
104.57 141.686 m f
144.422 135.366 m 141.066 132.522 l 140.141 131.737 138.75 131.85 137.965
 132.776 c 137.18 133.702 137.293 135.092 138.223 135.877 c 141.578 138.725
 l 142.504 139.51 143.891 139.393 144.676 138.467 c 145.465 137.541 145.348
 136.155 144.422 135.366 c h
144.422 135.366 m f
157.398 161.788 m 154.285 159.143 l 153.426 158.413 152.137 158.522 151.406
 159.381 c 150.676 160.241 150.781 161.53 151.645 162.26 c 154.758 164.901
 l 155.617 165.631 156.906 165.526 157.637 164.663 c 158.367 163.803 158.262
 162.514 157.398 161.788 c h
157.398 161.788 m f
Q Q
showpage
%%Trailer
end restore
%%EOF
