%!PS-Adobe-3.0 EPSF-3.0
%%Creator: cairo 1.14.2 (http://cairographics.org)
%%CreationDate: Tue Jun 21 12:26:58 2016
%%Pages: 1
%%DocumentData: Clean7Bit
%%LanguageLevel: 2
%%BoundingBox: 0 -1 238 238
%%EndComments
%%BeginProlog
save
50 dict begin
/q { gsave } bind def
/Q { grestore } bind def
/cm { 6 array astore concat } bind def
/w { setlinewidth } bind def
/J { setlinecap } bind def
/j { setlinejoin } bind def
/M { setmiterlimit } bind def
/d { setdash } bind def
/m { moveto } bind def
/l { lineto } bind def
/c { curveto } bind def
/h { closepath } bind def
/re { exch dup neg 3 1 roll 5 3 roll moveto 0 rlineto
      0 exch rlineto 0 rlineto closepath } bind def
/S { stroke } bind def
/f { fill } bind def
/f* { eofill } bind def
/n { newpath } bind def
/W { clip } bind def
/W* { eoclip } bind def
/BT { } bind def
/ET { } bind def
/pdfmark where { pop globaldict /?pdfmark /exec load put }
    { globaldict begin /?pdfmark /pop load def /pdfmark
    /cleartomark load def end } ifelse
/BDC { mark 3 1 roll /BDC pdfmark } bind def
/EMC { mark /EMC pdfmark } bind def
/cairo_store_point { /cairo_point_y exch def /cairo_point_x exch def } def
/Tj { show currentpoint cairo_store_point } bind def
/TJ {
  {
    dup
    type /stringtype eq
    { show } { -0.001 mul 0 cairo_font_matrix dtransform rmoveto } ifelse
  } forall
  currentpoint cairo_store_point
} bind def
/cairo_selectfont { cairo_font_matrix aload pop pop pop 0 0 6 array astore
    cairo_font exch selectfont cairo_point_x cairo_point_y moveto } bind def
/Tf { pop /cairo_font exch def /cairo_font_matrix where
      { pop cairo_selectfont } if } bind def
/Td { matrix translate cairo_font_matrix matrix concatmatrix dup
      /cairo_font_matrix exch def dup 4 get exch 5 get cairo_store_point
      /cairo_font where { pop cairo_selectfont } if } bind def
/Tm { 2 copy 8 2 roll 6 array astore /cairo_font_matrix exch def
      cairo_store_point /cairo_font where { pop cairo_selectfont } if } bind def
/g { setgray } bind def
/rg { setrgbcolor } bind def
/d1 { setcachedevice } bind def
%%EndProlog
%%BeginSetup
%%EndSetup
%%Page: 1 1
%%BeginPageSetup
%%PageBoundingBox: 0 -1 238 238
%%EndPageSetup
q 0 -1 238 239 rectclip q
0.835294 0.760784 0.584314 rg
237.602 118.799 m 237.602 53.19 184.41 -0.002 118.801 -0.002 c 53.188 -0.002
 0 53.19 0 118.799 c 0 184.413 53.188 237.6 118.801 237.6 c 184.41 237.6
 237.602 184.413 237.602 118.799 c h
237.602 118.799 m f
0.537255 0.447059 0.337255 rg
235.172 142.803 m 207.18 170.795 l 198.238 167.159 189.215 161.655 179.602
 164.401 c 177.199 165.998 172.398 166.799 169.199 165.202 c 146 152.401
 128.398 133.998 111.602 113.202 c 109.199 111.6 108.398 107.6 106.801 105.202
 c 96.398 93.202 90 81.202 81.199 67.6 c 74.801 59.6 66 57.202 57.199 53.202
 c 55.695 52.299 54.922 50.436 53.602 49.026 c 101.348 1.28 l 107.043 0.44
 112.871 0.002 118.801 0.002 c 184.41 0.002 237.602 53.19 237.602 118.799
 c 237.602 127.022 236.766 135.053 235.172 142.803 c h
235.172 142.803 m f
0.415686 0.67451 0.294118 rg
159.371 157.061 m 159.504 157.85 177.176 180.737 161.352 192.455 c 150.344
 200.608 143.574 189.463 152.152 185.268 c 164.262 179.342 159.371 157.061
 159.371 157.061 c h
159.371 157.061 m f
158.07 158.358 m 158.922 158.444 182.617 175.487 196.477 157.991 c 206.117
 145.819 194.453 139.455 189.289 148.788 c 181.996 161.967 158.07 158.358
 158.07 158.358 c h
158.07 158.358 m f
0.270588 0.411765 0.341176 rg
155.844 154.69 m 156.262 155.514 181.477 170.92 170.797 194.045 c 163.367
 210.127 152.828 201.502 159.414 191.44 c 168.711 177.233 155.844 154.69
 155.844 154.69 c h
155.844 154.69 m f
0.211765 0.337255 0.270588 rg
155.844 154.69 m 156.766 155.291 175.504 189.01 200.293 176.127 c 217.539
 167.166 207.496 152.733 196.812 160.905 c 181.73 172.448 155.844 154.69
 155.844 154.69 c h
155.844 154.69 m f
0.901961 0.494118 0.133333 rg
162.43 157.854 m 167.043 153.241 175.273 145.514 169.184 131.588 c 163.098
 117.659 112.227 62.952 53.602 49.026 c 67.527 107.655 122.234 158.522 136.16
 164.612 c 150.086 170.698 157.812 162.471 162.43 157.854 c h
162.43 157.854 m f
0.819608 0.403922 0.0941176 rg
162.43 157.854 m 157.812 162.471 150.086 170.698 136.16 164.612 c 132.711
 163.104 126.758 158.842 119.543 152.405 c 118.746 128.342 118.328 104.28
 118.023 80.217 c 145.832 100.288 165.539 123.248 169.184 131.588 c 175.273
 145.514 167.043 153.241 162.43 157.854 c h
162.43 157.854 m f
0.756863 0.298039 0.137255 rg
129.406 108.319 m 136.234 94.663 l 137.469 95.737 138.676 96.803 139.855
 97.87 c h
129.406 108.319 m f
154.395 112.135 m 156.32 114.209 158.086 116.194 159.68 118.073 c 143.164
 134.588 l h
154.395 112.135 m f
127.91 159.35 m 145.918 141.342 l 134.656 163.866 l 132.836 162.873 130.551
 161.35 127.91 159.35 c h
127.91 159.35 m f
0.843137 0.368627 0.160784 rg
114.047 147.295 m 112.871 146.166 111.68 144.991 110.469 143.772 c 121.148
 133.088 l h
114.047 147.295 m f
115.469 78.397 m 117.609 79.901 119.703 81.42 121.746 82.955 c 104.637 
100.065 l h
115.469 78.397 m f
94.797 126.416 m 112.895 108.319 l 100.5 133.104 l 98.609 130.959 96.703
 128.733 94.797 126.416 c h
94.797 126.416 m f
80.652 107.538 m 96.383 91.807 l 85.242 114.08 l 83.695 111.948 82.16 109.768
 80.652 107.538 c h
80.652 107.538 m f
Q Q
showpage
%%Trailer
end restore
%%EOF
