%!PS-Adobe-3.0 EPSF-3.0
%%Creator: cairo 1.14.2 (http://cairographics.org)
%%CreationDate: Tue Jun 21 12:24:54 2016
%%Pages: 1
%%DocumentData: Clean7Bit
%%LanguageLevel: 2
%%BoundingBox: 0 -1 238 238
%%EndComments
%%BeginProlog
save
50 dict begin
/q { gsave } bind def
/Q { grestore } bind def
/cm { 6 array astore concat } bind def
/w { setlinewidth } bind def
/J { setlinecap } bind def
/j { setlinejoin } bind def
/M { setmiterlimit } bind def
/d { setdash } bind def
/m { moveto } bind def
/l { lineto } bind def
/c { curveto } bind def
/h { closepath } bind def
/re { exch dup neg 3 1 roll 5 3 roll moveto 0 rlineto
      0 exch rlineto 0 rlineto closepath } bind def
/S { stroke } bind def
/f { fill } bind def
/f* { eofill } bind def
/n { newpath } bind def
/W { clip } bind def
/W* { eoclip } bind def
/BT { } bind def
/ET { } bind def
/pdfmark where { pop globaldict /?pdfmark /exec load put }
    { globaldict begin /?pdfmark /pop load def /pdfmark
    /cleartomark load def end } ifelse
/BDC { mark 3 1 roll /BDC pdfmark } bind def
/EMC { mark /EMC pdfmark } bind def
/cairo_store_point { /cairo_point_y exch def /cairo_point_x exch def } def
/Tj { show currentpoint cairo_store_point } bind def
/TJ {
  {
    dup
    type /stringtype eq
    { show } { -0.001 mul 0 cairo_font_matrix dtransform rmoveto } ifelse
  } forall
  currentpoint cairo_store_point
} bind def
/cairo_selectfont { cairo_font_matrix aload pop pop pop 0 0 6 array astore
    cairo_font exch selectfont cairo_point_x cairo_point_y moveto } bind def
/Tf { pop /cairo_font exch def /cairo_font_matrix where
      { pop cairo_selectfont } if } bind def
/Td { matrix translate cairo_font_matrix matrix concatmatrix dup
      /cairo_font_matrix exch def dup 4 get exch 5 get cairo_store_point
      /cairo_font where { pop cairo_selectfont } if } bind def
/Tm { 2 copy 8 2 roll 6 array astore /cairo_font_matrix exch def
      cairo_store_point /cairo_font where { pop cairo_selectfont } if } bind def
/g { setgray } bind def
/rg { setrgbcolor } bind def
/d1 { setcachedevice } bind def
%%EndProlog
%%BeginSetup
%%EndSetup
%%Page: 1 1
%%BeginPageSetup
%%PageBoundingBox: 0 -1 238 238
%%EndPageSetup
q 0 -1 238 239 rectclip q
0.203922 0.313726 0.396078 rg
237.602 118.799 m 237.602 53.19 184.41 -0.002 118.801 -0.002 c 53.188 -0.002
 0 53.19 0 118.799 c 0 184.413 53.188 237.6 118.801 237.6 c 184.41 237.6
 237.602 184.413 237.602 118.799 c h
237.602 118.799 m f
0.172549 0.243137 0.313726 rg
237.559 121.959 m 199.492 159.991 l 197.527 158.709 195.902 157.526 194
 157.998 c 166 162.799 130.801 165.202 119.602 135.6 c 109.199 110.799 110.801
 80.401 88.398 61.202 c 80.145 53.698 67.668 58.862 56.91 56.229 c 112.996
 0.143 l 114.922 0.049 116.855 -0.002 118.801 -0.002 c 184.41 -0.002 237.602
 53.19 237.602 118.799 c 237.602 119.858 237.586 120.909 237.559 121.959
 c h
237.559 121.959 m f
0.682353 0.756863 0.811765 rg
154.805 98.217 m 154.727 98.217 154.648 98.217 154.566 98.217 c 146.406
 98.264 142.668 101.741 140.973 104.655 c 135.672 113.752 143.562 127.862
 150.527 140.311 c 152.859 144.479 155.059 148.416 155.738 150.502 c 157.875
 157.084 162.453 162.44 168.617 165.58 c 174.789 168.725 181.809 169.276
 188.391 167.139 c 201.98 162.721 209.445 148.073 205.031 134.487 c 200.789
 121.432 180.398 98.217 154.805 98.217 c h
166.387 147.041 m 165.371 143.909 163.023 139.709 160.301 134.846 c 157.465
 129.772 154.25 124.026 152.254 118.948 c 149.609 112.209 150.605 110.366
 150.652 110.291 c 150.777 110.073 151.789 109.436 154.629 109.42 c 154.691
 109.416 154.75 109.416 154.809 109.416 c 175.789 109.416 191.816 130.065
 194.379 137.948 c 196.887 145.663 192.645 153.979 184.93 156.487 c 181.191
 157.702 177.203 157.389 173.703 155.604 c 170.199 153.819 167.602 150.78
 166.387 147.041 c h
166.387 147.041 m f
1 g
173.805 171.6 m 44.676 171.6 l 44.676 171.6 40.379 128.108 70.461 94.248
 c 80.402 83.061 86.586 72.225 90.414 62.737 c 128.07 62.737 l 131.898 72.225
 138.082 83.061 148.023 94.248 c 178.102 128.108 173.805 171.6 173.805 171.6
 c h
173.805 171.6 m f
0.831373 0.854902 0.866667 rg
173.805 171.6 m 110.535 171.6 l 110.535 62.737 l 128.066 62.737 l 131.895
 72.229 138.078 83.061 148.023 94.248 c 178.102 128.108 173.805 171.6 173.805
 171.6 c h
173.805 171.6 m f
0.815686 0.835294 0.85098 rg
63.039 52.6 m 155.441 52.6 l 162.73 52.6 168.641 58.51 168.641 65.799 c
 49.84 65.799 l 49.84 58.51 55.75 52.6 63.039 52.6 c h
63.039 52.6 m f
0.74902 0.760784 0.768627 rg
110.535 65.799 m 110.535 52.6 l 155.441 52.6 l 162.73 52.6 168.641 58.51
 168.641 65.799 c h
110.535 65.799 m f
Q Q
showpage
%%Trailer
end restore
%%EOF
