%!PS-Adobe-3.0 EPSF-3.0
%%Creator: cairo 1.14.2 (http://cairographics.org)
%%CreationDate: Tue Jun 21 12:26:32 2016
%%Pages: 1
%%DocumentData: Clean7Bit
%%LanguageLevel: 2
%%BoundingBox: 0 -1 238 238
%%EndComments
%%BeginProlog
save
50 dict begin
/q { gsave } bind def
/Q { grestore } bind def
/cm { 6 array astore concat } bind def
/w { setlinewidth } bind def
/J { setlinecap } bind def
/j { setlinejoin } bind def
/M { setmiterlimit } bind def
/d { setdash } bind def
/m { moveto } bind def
/l { lineto } bind def
/c { curveto } bind def
/h { closepath } bind def
/re { exch dup neg 3 1 roll 5 3 roll moveto 0 rlineto
      0 exch rlineto 0 rlineto closepath } bind def
/S { stroke } bind def
/f { fill } bind def
/f* { eofill } bind def
/n { newpath } bind def
/W { clip } bind def
/W* { eoclip } bind def
/BT { } bind def
/ET { } bind def
/pdfmark where { pop globaldict /?pdfmark /exec load put }
    { globaldict begin /?pdfmark /pop load def /pdfmark
    /cleartomark load def end } ifelse
/BDC { mark 3 1 roll /BDC pdfmark } bind def
/EMC { mark /EMC pdfmark } bind def
/cairo_store_point { /cairo_point_y exch def /cairo_point_x exch def } def
/Tj { show currentpoint cairo_store_point } bind def
/TJ {
  {
    dup
    type /stringtype eq
    { show } { -0.001 mul 0 cairo_font_matrix dtransform rmoveto } ifelse
  } forall
  currentpoint cairo_store_point
} bind def
/cairo_selectfont { cairo_font_matrix aload pop pop pop 0 0 6 array astore
    cairo_font exch selectfont cairo_point_x cairo_point_y moveto } bind def
/Tf { pop /cairo_font exch def /cairo_font_matrix where
      { pop cairo_selectfont } if } bind def
/Td { matrix translate cairo_font_matrix matrix concatmatrix dup
      /cairo_font_matrix exch def dup 4 get exch 5 get cairo_store_point
      /cairo_font where { pop cairo_selectfont } if } bind def
/Tm { 2 copy 8 2 roll 6 array astore /cairo_font_matrix exch def
      cairo_store_point /cairo_font where { pop cairo_selectfont } if } bind def
/g { setgray } bind def
/rg { setrgbcolor } bind def
/d1 { setcachedevice } bind def
%%EndProlog
%%BeginSetup
%%EndSetup
%%Page: 1 1
%%BeginPageSetup
%%PageBoundingBox: 0 -1 238 238
%%EndPageSetup
q 0 -1 238 239 rectclip q
0.901961 0.494118 0.133333 rg
237.602 118.799 m 237.602 53.19 184.41 -0.002 118.801 -0.002 c 53.188 -0.002
 0 53.19 0 118.799 c 0 184.413 53.188 237.6 118.801 237.6 c 184.41 237.6
 237.602 184.413 237.602 118.799 c h
237.602 118.799 m f
0.678431 0.282353 0.109804 rg
180.164 149.366 m 38.234 71.639 l 109.527 0.358 l 112.586 0.123 115.68 
-0.002 118.801 -0.002 c 176.062 -0.002 223.855 40.51 235.094 94.436 c h
180.164 149.366 m f
0.407843 0.141176 0.129412 rg
52.402 110.319 m 52.402 80.475 96.082 71.721 139.246 71.721 c 182.414 71.721
 191.355 88.198 191.355 118.041 c 191.355 147.885 173.73 164.358 130.562
 164.358 c 87.395 164.358 52.402 140.163 52.402 110.319 c h
52.402 110.319 m f
0.941176 0.870588 0.705882 rg
42.027 163.284 m 59.477 150.561 l 63.719 156.377 l 46.266 169.1 l 48.609
 172.315 47.902 176.819 44.691 179.159 c 41.477 181.502 36.977 180.795 34.633
 177.58 c 33.859 176.522 33.426 175.319 33.297 174.1 c 32.176 173.608 31.164
 172.827 30.391 171.764 c 28.051 168.553 28.754 164.049 31.969 161.705 c
 35.18 159.366 39.684 160.069 42.027 163.284 c h
42.027 163.284 m f
0.356863 0.113725 0.113725 rg
130.562 164.358 m 126.934 164.358 123.363 164.182 119.867 163.85 c 119.867
 72.362 l 126.238 71.924 132.75 71.721 139.246 71.721 c 182.414 71.721 191.355
 88.198 191.355 118.041 c 191.355 147.885 173.73 164.358 130.562 164.358
 c h
130.562 164.358 m f
0.509804 0.215686 0.2 rg
103.406 149.721 m 113.043 142.694 109.938 133.373 102.91 123.733 c 95.887
 114.096 87.598 107.788 77.961 114.815 c 68.32 121.838 48.754 148.073 55.781
 157.709 c 62.809 167.35 93.77 156.745 103.406 149.721 c h
103.406 149.721 m f
0.752941 0.223529 0.168627 rg
157.668 93.885 m 157.668 102.413 165.84 106.987 175.914 106.987 c 185.992
 106.987 194.164 102.413 194.164 93.885 c 194.164 85.358 185.992 78.444 
175.914 78.444 c 165.84 78.444 157.668 85.358 157.668 93.885 c h
157.668 93.885 m f
52.402 93.885 m 52.402 102.413 60.57 106.987 70.648 106.987 c 80.727 106.987
 88.895 102.413 88.895 93.885 c 88.895 85.358 80.727 78.444 70.648 78.444
 c 60.57 78.444 52.402 85.358 52.402 93.885 c h
52.402 93.885 m f
0.415686 0.67451 0.294118 rg
154.395 88.737 m 154.395 86.413 152.508 84.53 150.184 84.53 c 147.859 84.53
 145.973 86.413 145.973 88.737 c 145.973 91.065 147.859 92.948 150.184 92.948
 c 152.508 92.948 154.395 91.065 154.395 88.737 c h
154.395 88.737 m f
138.02 88.737 m 138.02 86.413 136.133 84.53 133.809 84.53 c 131.484 84.53
 129.598 86.413 129.598 88.737 c 129.598 91.065 131.484 92.948 133.809 92.948
 c 136.133 92.948 138.02 91.065 138.02 88.737 c h
138.02 88.737 m f
0.34902 0.568627 0.235294 rg
145.035 88.737 m 145.035 86.413 143.152 84.53 140.828 84.53 c 138.5 84.53
 136.617 86.413 136.617 88.737 c 136.617 91.065 138.5 92.948 140.828 92.948
 c 143.152 92.948 145.035 91.065 145.035 88.737 c h
145.035 88.737 m f
0.941176 0.870588 0.705882 rg
43.746 69.323 m 197.672 69.323 l 201.934 69.323 205.391 72.78 205.391 77.041
 c 205.391 81.303 201.934 84.76 197.672 84.76 c 43.746 84.76 l 39.484 84.76
 36.027 81.303 36.027 77.041 c 36.027 72.78 39.484 69.323 43.746 69.323 
c h
43.746 69.323 m f
0.839216 0.760784 0.6 rg
197.672 84.76 m 119.867 84.76 l 119.867 69.323 l 197.672 69.323 l 201.934
 69.323 205.391 72.78 205.391 77.041 c 205.391 81.307 201.934 84.76 197.672
 84.76 c h
197.672 84.76 m f
Q Q
showpage
%%Trailer
end restore
%%EOF
