%!PS-Adobe-3.0 EPSF-3.0
%%Creator: cairo 1.14.2 (http://cairographics.org)
%%CreationDate: Tue Jun 21 12:25:49 2016
%%Pages: 1
%%DocumentData: Clean7Bit
%%LanguageLevel: 2
%%BoundingBox: 0 -1 238 238
%%EndComments
%%BeginProlog
save
50 dict begin
/q { gsave } bind def
/Q { grestore } bind def
/cm { 6 array astore concat } bind def
/w { setlinewidth } bind def
/J { setlinecap } bind def
/j { setlinejoin } bind def
/M { setmiterlimit } bind def
/d { setdash } bind def
/m { moveto } bind def
/l { lineto } bind def
/c { curveto } bind def
/h { closepath } bind def
/re { exch dup neg 3 1 roll 5 3 roll moveto 0 rlineto
      0 exch rlineto 0 rlineto closepath } bind def
/S { stroke } bind def
/f { fill } bind def
/f* { eofill } bind def
/n { newpath } bind def
/W { clip } bind def
/W* { eoclip } bind def
/BT { } bind def
/ET { } bind def
/pdfmark where { pop globaldict /?pdfmark /exec load put }
    { globaldict begin /?pdfmark /pop load def /pdfmark
    /cleartomark load def end } ifelse
/BDC { mark 3 1 roll /BDC pdfmark } bind def
/EMC { mark /EMC pdfmark } bind def
/cairo_store_point { /cairo_point_y exch def /cairo_point_x exch def } def
/Tj { show currentpoint cairo_store_point } bind def
/TJ {
  {
    dup
    type /stringtype eq
    { show } { -0.001 mul 0 cairo_font_matrix dtransform rmoveto } ifelse
  } forall
  currentpoint cairo_store_point
} bind def
/cairo_selectfont { cairo_font_matrix aload pop pop pop 0 0 6 array astore
    cairo_font exch selectfont cairo_point_x cairo_point_y moveto } bind def
/Tf { pop /cairo_font exch def /cairo_font_matrix where
      { pop cairo_selectfont } if } bind def
/Td { matrix translate cairo_font_matrix matrix concatmatrix dup
      /cairo_font_matrix exch def dup 4 get exch 5 get cairo_store_point
      /cairo_font where { pop cairo_selectfont } if } bind def
/Tm { 2 copy 8 2 roll 6 array astore /cairo_font_matrix exch def
      cairo_store_point /cairo_font where { pop cairo_selectfont } if } bind def
/g { setgray } bind def
/rg { setrgbcolor } bind def
/d1 { setcachedevice } bind def
%%EndProlog
%%BeginSetup
%%EndSetup
%%Page: 1 1
%%BeginPageSetup
%%PageBoundingBox: 0 -1 238 238
%%EndPageSetup
q 0 -1 238 239 rectclip q
0.776471 0.235294 0.133333 rg
237.602 118.799 m 237.602 53.19 184.41 -0.002 118.801 -0.002 c 53.188 -0.002
 0 53.19 0 118.799 c 0 184.413 53.188 237.6 118.801 237.6 c 184.41 237.6
 237.602 184.413 237.602 118.799 c h
237.602 118.799 m f
0.956863 0.686275 0.188235 rg
116.035 171.6 m 121.566 171.6 l 123.684 171.6 125.402 173.315 125.402 175.432
 c 125.402 194.166 l 125.402 196.284 123.684 197.998 121.566 197.998 c 116.035
 197.998 l 113.918 197.998 112.199 196.284 112.199 194.166 c 112.199 175.432
 l 112.199 173.315 113.914 171.6 116.035 171.6 c h
116.035 171.6 m f
0.941176 0.870588 0.705882 rg
111.602 206.401 m 111.602 210.377 114.824 220.799 118.801 220.799 c 122.777
 220.799 126 210.377 126 206.401 c 126 202.424 122.777 199.202 118.801 199.202
 c 114.824 199.202 111.602 202.424 111.602 206.401 c h
111.602 206.401 m f
0.909804 0.615686 0.145098 rg
121.566 197.998 m 118.535 197.998 l 118.535 171.6 l 121.566 171.6 l 123.684
 171.6 125.402 173.315 125.402 175.432 c 125.402 194.166 l 125.398 196.284
 123.684 197.998 121.566 197.998 c h
121.566 197.998 m f
0.909804 0.819608 0.639216 rg
118.801 220.799 m 118.711 220.799 118.621 220.788 118.535 220.78 c 118.535
 199.213 l 118.621 199.209 118.711 199.202 118.801 199.202 c 122.777 199.202
 126 202.424 126 206.401 c 126 210.377 122.777 220.799 118.801 220.799 c
 h
118.801 220.799 m f
0.627451 0.145098 0.121569 rg
166.781 169.686 m 27.953 55.151 l 74.602 8.502 l 88.266 3.022 103.18 -0.002
 118.801 -0.002 c 178.129 -0.002 227.293 43.491 236.168 100.327 c h
166.781 169.686 m f
0.929412 0.717647 0.670588 rg
39.602 65.998 m 198 65.998 l 198 115.534 l 198 124.627 190.629 131.998 
181.535 131.998 c 56.066 131.998 l 46.973 131.998 39.602 124.627 39.602 
115.534 c h
39.602 65.998 m f
0.92549 0.941176 0.945098 rg
66.781 131.998 m 170.82 131.998 l 170.82 158.881 l 170.82 167.975 163.445
 175.35 154.352 175.35 c 83.246 175.35 l 74.152 175.35 66.781 167.975 66.781
 158.881 c h
66.781 131.998 m f
0.827451 0.6 0.564706 rg
198 115.534 m 198 124.627 190.629 131.998 181.535 131.998 c 118.535 131.998
 l 118.535 65.998 l 198 65.998 l h
198 115.534 m f
0.835294 0.870588 0.878431 rg
170.82 158.881 m 170.82 167.975 163.445 175.35 154.352 175.35 c 118.535
 175.35 l 118.535 131.998 l 170.82 131.998 l h
170.82 158.881 m f
0.937255 0.443137 0.478431 rg
76.875 93.561 m 76.875 86.913 71.488 81.522 64.84 81.522 c 58.191 81.522
 52.801 86.913 52.801 93.561 c 52.801 100.209 58.191 105.6 64.84 105.6 c
 71.488 105.6 76.875 100.209 76.875 93.561 c h
76.875 93.561 m f
112.992 93.561 m 112.992 86.913 107.602 81.522 100.953 81.522 c 94.305 
81.522 88.914 86.913 88.914 93.561 c 88.914 100.209 94.305 105.6 100.953
 105.6 c 107.602 105.6 112.992 100.209 112.992 93.561 c h
112.992 93.561 m f
0.85098 0.329412 0.34902 rg
149.105 93.561 m 149.105 86.913 143.719 81.522 137.07 81.522 c 130.422 
81.522 125.031 86.913 125.031 93.561 c 125.031 100.209 130.422 105.6 137.07
 105.6 c 143.719 105.6 149.105 100.209 149.105 93.561 c h
149.105 93.561 m f
185.223 93.561 m 185.223 86.913 179.832 81.522 173.184 81.522 c 166.535
 81.522 161.145 86.913 161.145 93.561 c 161.145 100.209 166.535 105.6 173.184
 105.6 c 179.832 105.6 185.223 100.209 185.223 93.561 c h
185.223 93.561 m f
0.886275 0.709804 0.823529 rg
81.414 156.569 m 81.414 154.522 79.754 152.862 77.707 152.862 c 75.66 152.862
 74 154.522 74 156.569 c 74 158.616 75.66 160.272 77.707 160.272 c 79.754
 160.272 81.414 158.616 81.414 156.569 c h
81.414 156.569 m f
93.152 156.569 m 93.152 154.522 91.496 152.862 89.445 152.862 c 87.398 
152.862 85.742 154.522 85.742 156.569 c 85.742 158.616 87.398 160.272 89.445
 160.272 c 91.496 160.272 93.152 158.616 93.152 156.569 c h
93.152 156.569 m f
104.895 156.569 m 104.895 154.522 103.234 152.862 101.188 152.862 c 99.141
 152.862 97.48 154.522 97.48 156.569 c 97.48 158.616 99.141 160.272 101.188
 160.272 c 103.234 160.272 104.895 158.616 104.895 156.569 c h
104.895 156.569 m f
116.637 156.569 m 116.637 154.522 114.977 152.862 112.93 152.862 c 110.883
 152.862 109.223 154.522 109.223 156.569 c 109.223 158.616 110.883 160.272
 112.93 160.272 c 114.977 160.272 116.637 158.616 116.637 156.569 c h
116.637 156.569 m f
0.827451 0.623529 0.764706 rg
128.375 156.569 m 128.375 154.522 126.719 152.862 124.672 152.862 c 122.625
 152.862 120.965 154.522 120.965 156.569 c 120.965 158.616 122.625 160.272
 124.672 160.272 c 126.719 160.272 128.375 158.616 128.375 156.569 c h
128.375 156.569 m f
140.117 156.569 m 140.117 154.522 138.457 152.862 136.41 152.862 c 134.363
 152.862 132.703 154.522 132.703 156.569 c 132.703 158.616 134.363 160.272
 136.41 160.272 c 138.457 160.272 140.117 158.616 140.117 156.569 c h
140.117 156.569 m f
151.859 156.569 m 151.859 154.522 150.199 152.862 148.152 152.862 c 146.105
 152.862 144.445 154.522 144.445 156.569 c 144.445 158.616 146.105 160.272
 148.152 160.272 c 150.199 160.272 151.859 158.616 151.859 156.569 c h
151.859 156.569 m f
163.602 156.569 m 163.602 154.522 161.941 152.862 159.895 152.862 c 157.848
 152.862 156.188 154.522 156.188 156.569 c 156.188 158.616 157.848 160.272
 159.895 160.272 c 161.941 160.272 163.602 158.616 163.602 156.569 c h
163.602 156.569 m f
0.356863 0.345098 0.411765 rg
33 52.799 m 204.602 52.799 l 208.246 52.799 211.199 55.756 211.199 59.401
 c 211.199 63.045 208.246 65.998 204.602 65.998 c 33 65.998 l 29.355 65.998
 26.398 63.045 26.398 59.401 c 26.398 55.756 29.355 52.799 33 52.799 c h
33 52.799 m f
0.309804 0.301961 0.368627 rg
204.602 65.998 m 118.535 65.998 l 118.535 52.799 l 204.602 52.799 l 208.246
 52.799 211.199 55.756 211.199 59.401 c 211.199 63.045 208.246 65.998 204.602
 65.998 c h
204.602 65.998 m f
Q Q
showpage
%%Trailer
end restore
%%EOF
