<?xml version="1.0" encoding="UTF-8" standalone="no"?>
<!-- Generator: Fusion 360, Shaper Origin Export Add-In, Version 1.6.3  -->

<svg
   shaper:fusionaddin="version:1.6.3"
   width="15cm"
   height="3.3cm"
   version="1.1"
   x="0cm"
   y="0cm"
   viewBox="0 0 15 3.3"
   enable-background="new 0 0 15 3.3"
   xml:space="preserve"
   id="svg4"
   sodipodi:docname="elobox-two-side.svg"
   inkscape:version="1.1.1 (3bf5ae0d25, 2021-09-20)"
   xmlns:inkscape="http://www.inkscape.org/namespaces/inkscape"
   xmlns:sodipodi="http://sodipodi.sourceforge.net/DTD/sodipodi-0.dtd"
   xmlns="http://www.w3.org/2000/svg"
   xmlns:svg="http://www.w3.org/2000/svg"
   xmlns:shaper="http://www.shapertools.com/namespaces/shaper"><defs
     id="defs8" /><sodipodi:namedview
     id="namedview6"
     pagecolor="#ffffff"
     bordercolor="#666666"
     borderopacity="1.0"
     inkscape:pageshadow="2"
     inkscape:pageopacity="0.0"
     inkscape:pagecheckerboard="0"
     inkscape:document-units="cm"
     showgrid="false"
     inkscape:zoom="1.9914306"
     inkscape:cx="283.46457"
     inkscape:cy="62.517872"
     inkscape:window-width="1920"
     inkscape:window-height="1017"
     inkscape:window-x="1912"
     inkscape:window-y="-8"
     inkscape:window-maximized="1"
     inkscape:current-layer="svg4" /><path
     d="M-7.8,3.3 L-7.555,3 -5.825,3 A0.02,0.02 90 0,0 -5.805,2.98 L-5.805,2.9132014 A0.02,0.02 0 0,0 -5.8091842,2.9009597 A0.05,0.05 142.2594519 0,1 -5.7390403,2.8308158 A0.02,0.02 127.7405481 0,0 -5.7267986,2.835 L-4.8732014,2.835 A0.02,0.02 90 0,0 -4.8609597,2.8308158 A0.05,0.05 232.2594519 0,1 -4.7908158,2.9009597 A0.02,0.02 217.7405481 0,0 -4.795,2.9132014 L-4.795,2.98 A0.02,0.02 180 0,0 -4.775,3 L-3.825,3 A0.02,0.02 90 0,0 -3.805,2.98 L-3.805,2.9132014 A0.02,0.02 0 0,0 -3.8091842,2.9009597 A0.05,0.05 142.2594519 0,1 -3.7390403,2.8308158 A0.02,0.02 127.7405481 0,0 -3.7267986,2.835 L-2.8732014,2.835 A0.02,0.02 90 0,0 -2.8609597,2.8308158 A0.05,0.05 232.2594519 0,1 -2.7908158,2.9009597 A0.02,0.02 217.7405481 0,0 -2.795,2.9132014 L-2.795,2.98 A0.02,0.02 180 0,0 -2.775,3 L-1.825,3 A0.02,0.02 90 0,0 -1.805,2.98 L-1.805,2.9132014 A0.02,0.02 0 0,0 -1.8091842,2.9009597 A0.05,0.05 142.2594519 0,1 -1.7390403,2.8308158 A0.02,0.02 127.7405481 0,0 -1.7267986,2.835 L-0.8732014,2.835 A0.02,0.02 90 0,0 -0.8609597,2.8308158 A0.05,0.05 232.2594519 0,1 -0.7908158,2.9009597 A0.02,0.02 217.7405481 0,0 -0.795,2.9132014 L-0.795,2.98 A0.02,0.02 180 0,0 -0.775,3 L0.175,3 A0.02,0.02 90 0,0 0.195,2.98 L0.195,2.9132014 A0.02,0.02 0 0,0 0.1908158,2.9009597 A0.05,0.05 142.2594519 0,1 0.2609597,2.8308158 A0.02,0.02 127.7405481 0,0 0.2732014,2.835 L1.1267986,2.835 A0.02,0.02 90 0,0 1.1390403,2.8308158 A0.05,0.05 232.2594519 0,1 1.2091842,2.9009597 A0.02,0.02 217.7405481 0,0 1.205,2.9132014 L1.205,2.98 A0.02,0.02 180 0,0 1.225,3 L2.175,3 A0.02,0.02 90 0,0 2.195,2.98 L2.195,2.9132014 A0.02,0.02 0 0,0 2.1908158,2.9009597 A0.05,0.05 142.2594519 0,1 2.2609597,2.8308158 A0.02,0.02 127.7405481 0,0 2.2732014,2.835 L3.1267986,2.835 A0.02,0.02 90 0,0 3.1390403,2.8308158 A0.05,0.05 232.2594519 0,1 3.2091842,2.9009597 A0.02,0.02 217.7405481 0,0 3.205,2.9132014 L3.205,2.98 A0.02,0.02 180 0,0 3.225,3 L4.955,3 5.2,3.3 6.2,3.3 6.2,2.025 A0.02,0.02 0 0,0 6.18,2.005 L6.1132014,2.005 A0.02,0.02 270 0,0 6.1009597,2.0091842 A0.05,0.05 52.2594519 0,1 6.0308158,1.9390403 A0.02,0.02 37.7405481 0,0 6.035,1.9267986 L6.035,1.0732014 A0.02,0.02 0 0,0 6.0308158,1.0609597 A0.05,0.05 142.2594519 0,1 6.1009597,0.9908158 A0.02,0.02 127.7405481 0,0 6.1132014,0.995 L6.18,0.995 A0.02,0.02 90 0,0 6.2,0.975 L6.2,0.2 5.15,0.2 4.95,-0 0,0 -0.2,0.2 -2.4,0.2 -2.6,-0 -7.55,-0 -7.75,0.2 -8.635,0.2 -8.635,0.9267986 A0.02,0.02 180 0,0 -8.6308158,0.9390403 A0.05,0.05 322.2594519 0,1 -8.7009597,1.0091842 A0.02,0.02 307.7405481 0,0 -8.7132014,1.005 L-8.78,1.005 A0.02,0.02 270 0,0 -8.8,1.025 L-8.8,1.975 A0.02,0.02 180 0,0 -8.78,1.995 L-8.7132014,1.995 A0.02,0.02 90 0,0 -8.7009597,1.9908158 A0.05,0.05 232.2594519 0,1 -8.6308158,2.0609597 A0.02,0.02 217.7405481 0,0 -8.635,2.0732014 L-8.635,3.3 -7.8,3.3z"
     transform="matrix(1,0,0,-1,8.8,3.3)"
     fill="rgb(0,0,0)"
     shaper:cutDepth="0.0016"
     stroke-linecap="round"
     stroke-linejoin="round"
     id="path2"
     style="fill:none;stroke:#000000;stroke-opacity:1;stroke-width:0.01;stroke-miterlimit:4;stroke-dasharray:none" /></svg>
