%TF.GenerationSoftware,KiCad,Pcbnew,(6.0.4)*%
%TF.CreationDate,2022-04-14T22:56:31+02:00*%
%TF.ProjectId,elobox-two-base,656c6f62-6f78-42d7-9477-6f2d62617365,hv1.0.1*%
%TF.SameCoordinates,Original*%
%TF.FileFunction,Legend,Top*%
%TF.FilePolarity,Positive*%
%FSLAX46Y46*%
G04 Gerber Fmt 4.6, Leading zero omitted, Abs format (unit mm)*
G04 Created by KiCad (PCBNEW (6.0.4)) date 2022-04-14 22:56:31*
%MOMM*%
%LPD*%
G01*
G04 APERTURE LIST*
%ADD10C,0.120000*%
G04 APERTURE END LIST*
D10*
%TO.C,TP1*%
X76450000Y-63950000D02*
X78850000Y-63950000D01*
X78850000Y-63950000D02*
X78850000Y-66350000D01*
X78850000Y-66350000D02*
X76450000Y-66350000D01*
X76450000Y-66350000D02*
X76450000Y-63950000D01*
%TD*%
M02*
