%TF.GenerationSoftware,KiCad,Pcbnew,(6.0.4)*%
%TF.CreationDate,2022-04-14T22:56:31+02:00*%
%TF.ProjectId,elobox-two-base,656c6f62-6f78-42d7-9477-6f2d62617365,hv1.0.1*%
%TF.SameCoordinates,Original*%
%TF.FileFunction,Soldermask,Top*%
%TF.FilePolarity,Negative*%
%FSLAX46Y46*%
G04 Gerber Fmt 4.6, Leading zero omitted, Abs format (unit mm)*
G04 Created by KiCad (PCBNEW (6.0.4)) date 2022-04-14 22:56:31*
%MOMM*%
%LPD*%
G01*
G04 APERTURE LIST*
%ADD10R,2.000000X2.000000*%
G04 APERTURE END LIST*
D10*
%TO.C,TP1*%
X77650000Y-65150000D03*
%TD*%
G36*
X78592121Y-133870002D02*
G01*
X78638614Y-133923658D01*
X78650000Y-133976000D01*
X78650000Y-135723996D01*
X78629998Y-135792117D01*
X78576342Y-135838610D01*
X78524000Y-135849996D01*
X76776000Y-135849996D01*
X76707879Y-135829994D01*
X76661386Y-135776338D01*
X76650000Y-135723996D01*
X76650000Y-133976000D01*
X76670002Y-133907879D01*
X76723658Y-133861386D01*
X76776000Y-133850000D01*
X78524000Y-133850000D01*
X78592121Y-133870002D01*
G37*
G36*
X223292121Y-133870002D02*
G01*
X223338614Y-133923658D01*
X223350000Y-133976000D01*
X223350000Y-135723996D01*
X223329998Y-135792117D01*
X223276342Y-135838610D01*
X223224000Y-135849996D01*
X221476000Y-135849996D01*
X221407879Y-135829994D01*
X221361386Y-135776338D01*
X221350000Y-135723996D01*
X221350000Y-133976000D01*
X221370002Y-133907879D01*
X221423658Y-133861386D01*
X221476000Y-133850000D01*
X223224000Y-133850000D01*
X223292121Y-133870002D01*
G37*
G36*
X223242121Y-64170002D02*
G01*
X223288614Y-64223658D01*
X223300000Y-64276000D01*
X223300000Y-66024000D01*
X223279998Y-66092121D01*
X223226342Y-66138614D01*
X223174000Y-66150000D01*
X221426000Y-66150000D01*
X221357879Y-66129998D01*
X221311386Y-66076342D01*
X221300000Y-66024000D01*
X221300000Y-64276000D01*
X221320002Y-64207879D01*
X221373658Y-64161386D01*
X221426000Y-64150000D01*
X223174000Y-64150000D01*
X223242121Y-64170002D01*
G37*
G36*
X151942121Y-134020002D02*
G01*
X151988614Y-134073658D01*
X152000000Y-134126000D01*
X152000000Y-135874000D01*
X151979998Y-135942121D01*
X151926342Y-135988614D01*
X151874000Y-136000000D01*
X148126000Y-136000000D01*
X148057879Y-135979998D01*
X148011386Y-135926342D01*
X148000000Y-135874000D01*
X148000000Y-134126000D01*
X148020002Y-134057879D01*
X148073658Y-134011386D01*
X148126000Y-134000000D01*
X151874000Y-134000000D01*
X151942121Y-134020002D01*
G37*
G36*
X111942121Y-134020002D02*
G01*
X111988614Y-134073658D01*
X112000000Y-134126000D01*
X112000000Y-135874000D01*
X111979998Y-135942121D01*
X111926342Y-135988614D01*
X111874000Y-136000000D01*
X108126000Y-136000000D01*
X108057879Y-135979998D01*
X108011386Y-135926342D01*
X108000000Y-135874000D01*
X108000000Y-134126000D01*
X108020002Y-134057879D01*
X108073658Y-134011386D01*
X108126000Y-134000000D01*
X111874000Y-134000000D01*
X111942121Y-134020002D01*
G37*
G36*
X191942121Y-134020002D02*
G01*
X191988614Y-134073658D01*
X192000000Y-134126000D01*
X192000000Y-135874000D01*
X191979998Y-135942121D01*
X191926342Y-135988614D01*
X191874000Y-136000000D01*
X188126000Y-136000000D01*
X188057879Y-135979998D01*
X188011386Y-135926342D01*
X188000000Y-135874000D01*
X188000000Y-134126000D01*
X188020002Y-134057879D01*
X188073658Y-134011386D01*
X188126000Y-134000000D01*
X191874000Y-134000000D01*
X191942121Y-134020002D01*
G37*
G36*
X191942121Y-64020002D02*
G01*
X191988614Y-64073658D01*
X192000000Y-64126000D01*
X192000000Y-65874000D01*
X191979998Y-65942121D01*
X191926342Y-65988614D01*
X191874000Y-66000000D01*
X188126000Y-66000000D01*
X188057879Y-65979998D01*
X188011386Y-65926342D01*
X188000000Y-65874000D01*
X188000000Y-64126000D01*
X188020002Y-64057879D01*
X188073658Y-64011386D01*
X188126000Y-64000000D01*
X191874000Y-64000000D01*
X191942121Y-64020002D01*
G37*
G36*
X151942121Y-64020002D02*
G01*
X151988614Y-64073658D01*
X152000000Y-64126000D01*
X152000000Y-65874000D01*
X151979998Y-65942121D01*
X151926342Y-65988614D01*
X151874000Y-66000000D01*
X148126000Y-66000000D01*
X148057879Y-65979998D01*
X148011386Y-65926342D01*
X148000000Y-65874000D01*
X148000000Y-64126000D01*
X148020002Y-64057879D01*
X148073658Y-64011386D01*
X148126000Y-64000000D01*
X151874000Y-64000000D01*
X151942121Y-64020002D01*
G37*
G36*
X111942121Y-64020002D02*
G01*
X111988614Y-64073658D01*
X112000000Y-64126000D01*
X112000000Y-65874000D01*
X111979998Y-65942121D01*
X111926342Y-65988614D01*
X111874000Y-66000000D01*
X108126000Y-66000000D01*
X108057879Y-65979998D01*
X108011386Y-65926342D01*
X108000000Y-65874000D01*
X108000000Y-64126000D01*
X108020002Y-64057879D01*
X108073658Y-64011386D01*
X108126000Y-64000000D01*
X111874000Y-64000000D01*
X111942121Y-64020002D01*
G37*
G36*
X223442121Y-98020002D02*
G01*
X223488614Y-98073658D01*
X223500000Y-98126000D01*
X223500000Y-101874000D01*
X223479998Y-101942121D01*
X223426342Y-101988614D01*
X223374000Y-102000000D01*
X221626000Y-102000000D01*
X221557879Y-101979998D01*
X221511386Y-101926342D01*
X221500000Y-101874000D01*
X221500000Y-98126000D01*
X221520002Y-98057879D01*
X221573658Y-98011386D01*
X221626000Y-98000000D01*
X223374000Y-98000000D01*
X223442121Y-98020002D01*
G37*
G36*
X78442121Y-98020002D02*
G01*
X78488614Y-98073658D01*
X78500000Y-98126000D01*
X78500000Y-101874000D01*
X78479998Y-101942121D01*
X78426342Y-101988614D01*
X78374000Y-102000000D01*
X76626000Y-102000000D01*
X76557879Y-101979998D01*
X76511386Y-101926342D01*
X76500000Y-101874000D01*
X76500000Y-98126000D01*
X76520002Y-98057879D01*
X76573658Y-98011386D01*
X76626000Y-98000000D01*
X78374000Y-98000000D01*
X78442121Y-98020002D01*
G37*
M02*
