<?xml version="1.0" encoding="UTF-8" standalone="no"?>
<!-- Generator: Fusion 360, Shaper Origin Export Add-In, Version 1.6.3  -->

<svg
   shaper:fusionaddin="version:1.6.3"
   width="7.5cm"
   height="7.5cm"
   version="1.1"
   x="0cm"
   y="0cm"
   viewBox="0 0 7.5 7.5"
   enable-background="new 0 0 7.5 7.5"
   xml:space="preserve"
   id="svg4"
   sodipodi:docname="elobox-one-base.svg"
   inkscape:version="1.1.1 (3bf5ae0d25, 2021-09-20)"
   xmlns:inkscape="http://www.inkscape.org/namespaces/inkscape"
   xmlns:sodipodi="http://sodipodi.sourceforge.net/DTD/sodipodi-0.dtd"
   xmlns="http://www.w3.org/2000/svg"
   xmlns:svg="http://www.w3.org/2000/svg"
   xmlns:shaper="http://www.shapertools.com/namespaces/shaper"><defs
     id="defs8" /><sodipodi:namedview
     id="namedview6"
     pagecolor="#ffffff"
     bordercolor="#666666"
     borderopacity="1.0"
     inkscape:pageshadow="2"
     inkscape:pageopacity="0.0"
     inkscape:pagecheckerboard="0"
     inkscape:document-units="cm"
     showgrid="false"
     inkscape:zoom="2.9351111"
     inkscape:cx="141.56193"
     inkscape:cy="141.90263"
     inkscape:window-width="1920"
     inkscape:window-height="1017"
     inkscape:window-x="1912"
     inkscape:window-y="-8"
     inkscape:window-maximized="1"
     inkscape:current-layer="svg4" /><path
     d="M5.09,7.315 L5.09,7.2482014 A0.02,0.02 180 0,1 5.0941842,7.2359597 A0.05,0.05 37.7405481 0,0 5.0240403,7.1658158 A0.02,0.02 52.2594519 0,1 5.0117986,7.17 L4.1582014,7.17 A0.02,0.02 90 0,1 4.1459597,7.1658158 A0.05,0.05 307.7405481 0,0 4.0758158,7.2359597 A0.02,0.02 322.2594519 0,1 4.08,7.2482014 L4.08,7.315 A0.02,0.02 0 0,1 4.06,7.335 L3.11,7.335 A0.02,0.02 90 0,1 3.09,7.315 L3.09,7.2482014 A0.02,0.02 180 0,1 3.0941842,7.2359597 A0.05,0.05 37.7405481 0,0 3.0240403,7.1658158 A0.02,0.02 52.2594519 0,1 3.0117986,7.17 L2.1582014,7.17 A0.02,0.02 90 0,1 2.1459597,7.1658158 A0.05,0.05 307.7405481 0,0 2.0758158,7.2359597 A0.02,0.02 322.2594519 0,1 2.08,7.2482014 L2.08,7.315 A0.02,0.02 0 0,1 2.06,7.335 L1.11,7.335 A0.02,0.02 90 0,1 1.09,7.315 L1.09,7.2482014 A0.02,0.02 180 0,1 1.0941842,7.2359597 A0.05,0.05 37.7405481 0,0 1.0240403,7.1658158 A0.02,0.02 52.2594519 0,1 1.0117986,7.17 L0,7.17 0,6.1582014 A0.02,0.02 180 0,1 0.0041842,6.1459597 A0.05,0.05 37.7405481 0,0 -0.0659597,6.0758158 A0.02,0.02 52.2594519 0,1 -0.0782014,6.08 L-0.145,6.08 A0.02,0.02 90 0,1 -0.165,6.06 L-0.165,5.11 A0.02,0.02 180 0,1 -0.145,5.09 L-0.0782014,5.09 A0.02,0.02 270 0,1 -0.0659597,5.0941842 A0.05,0.05 127.7405481 0,0 0.0041842,5.0240403 A0.02,0.02 142.2594519 0,1 0,5.0117986 L0,4.1582014 A0.02,0.02 180 0,1 0.0041842,4.1459597 A0.05,0.05 37.7405481 0,0 -0.0659597,4.0758158 A0.02,0.02 52.2594519 0,1 -0.0782014,4.08 L-0.145,4.08 A0.02,0.02 90 0,1 -0.165,4.06 L-0.165,3.11 A0.02,0.02 180 0,1 -0.145,3.09 L-0.0782014,3.09 A0.02,0.02 270 0,1 -0.0659597,3.0941842 A0.05,0.05 127.7405481 0,0 0.0041842,3.0240403 A0.02,0.02 142.2594519 0,1 0,3.0117986 L-0,2.1582014 A0.02,0.02 180 0,1 0.0041842,2.1459597 A0.05,0.05 37.7405481 0,0 -0.0659597,2.0758158 A0.02,0.02 52.2594519 0,1 -0.0782014,2.08 L-0.145,2.08 A0.02,0.02 90 0,1 -0.165,2.06 L-0.165,1.11 A0.02,0.02 180 0,1 -0.145,1.09 L-0.0782014,1.09 A0.02,0.02 270 0,1 -0.0659597,1.0941842 A0.05,0.05 127.7405481 0,0 0.0041842,1.0240403 A0.02,0.02 142.2594519 0,1 0,1.0117986 L-0,0 1.0117986,0 A0.02,0.02 270 0,1 1.0240403,0.0041842 A0.05,0.05 127.7405481 0,0 1.0941842,-0.0659597 A0.02,0.02 142.2594519 0,1 1.09,-0.0782014 L1.09,-0.145 A0.02,0.02 180 0,1 1.11,-0.165 L2.06,-0.165 A0.02,0.02 270 0,1 2.08,-0.145 L2.08,-0.0782014 A0.02,0.02 0 0,1 2.0758158,-0.0659597 A0.05,0.05 217.7405481 0,0 2.1459597,0.0041842 A0.02,0.02 232.2594519 0,1 2.1582014,-0 L3.0117986,0 A0.02,0.02 270 0,1 3.0240403,0.0041842 A0.05,0.05 127.7405481 0,0 3.0941842,-0.0659597 A0.02,0.02 142.2594519 0,1 3.09,-0.0782014 L3.09,-0.145 A0.02,0.02 180 0,1 3.11,-0.165 L4.06,-0.165 A0.02,0.02 270 0,1 4.08,-0.145 L4.08,-0.0782014 A0.02,0.02 0 0,1 4.0758158,-0.0659597 A0.05,0.05 217.7405481 0,0 4.1459597,0.0041842 A0.02,0.02 232.2594519 0,1 4.1582014,-0 L5.0117986,0 A0.02,0.02 270 0,1 5.0240403,0.0041842 A0.05,0.05 127.7405481 0,0 5.0941842,-0.0659597 A0.02,0.02 142.2594519 0,1 5.09,-0.0782014 L5.09,-0.145 A0.02,0.02 180 0,1 5.11,-0.165 L6.06,-0.165 A0.02,0.02 270 0,1 6.08,-0.145 L6.08,-0.0782014 A0.02,0.02 0 0,1 6.0758158,-0.0659597 A0.05,0.05 217.7405481 0,0 6.1459597,0.0041842 A0.02,0.02 232.2594519 0,1 6.1582014,-0 L7.17,0 7.17,1.0117986 A0.02,0.02 0 0,1 7.1658158,1.0240403 A0.05,0.05 217.7405481 0,0 7.2359597,1.0941842 A0.02,0.02 232.2594519 0,1 7.2482014,1.09 L7.315,1.09 A0.02,0.02 270 0,1 7.335,1.11 L7.335,2.06 A0.02,0.02 0 0,1 7.315,2.08 L7.2482014,2.08 A0.02,0.02 90 0,1 7.2359597,2.0758158 A0.05,0.05 307.7405481 0,0 7.1658158,2.1459597 A0.02,0.02 322.2594519 0,1 7.17,2.1582014 L7.17,3.0117986 A0.02,0.02 0 0,1 7.1658158,3.0240403 A0.05,0.05 217.7405481 0,0 7.2359597,3.0941842 A0.02,0.02 232.2594519 0,1 7.2482014,3.09 L7.315,3.09 A0.02,0.02 270 0,1 7.335,3.11 L7.335,4.06 A0.02,0.02 0 0,1 7.315,4.08 L7.2482014,4.08 A0.02,0.02 90 0,1 7.2359597,4.0758158 A0.05,0.05 307.7405481 0,0 7.1658158,4.1459597 A0.02,0.02 322.2594519 0,1 7.17,4.1582014 L7.17,5.0117986 A0.02,0.02 0 0,1 7.1658158,5.0240403 A0.05,0.05 217.7405481 0,0 7.2359597,5.0941842 A0.02,0.02 232.2594519 0,1 7.2482014,5.09 L7.315,5.09 A0.02,0.02 270 0,1 7.335,5.11 L7.335,6.06 A0.02,0.02 0 0,1 7.315,6.08 L7.2482014,6.08 A0.02,0.02 90 0,1 7.2359597,6.0758158 A0.05,0.05 307.7405481 0,0 7.1658158,6.1459597 A0.02,0.02 322.2594519 0,1 7.17,6.1582014 L7.17,7.17 6.1582014,7.17 A0.02,0.02 90 0,1 6.1459597,7.1658158 A0.05,0.05 307.7405481 0,0 6.0758158,7.2359597 A0.02,0.02 322.2594519 0,1 6.08,7.2482014 L6.08,7.315 A0.02,0.02 0 0,1 6.06,7.335 L5.11,7.335 A0.02,0.02 90 0,1 5.09,7.315z"
     transform="matrix(1,0,0,-1,0.165,7.335)"
     fill="rgb(0,0,0)"
     shaper:cutDepth="0.0016"
     stroke-linecap="round"
     stroke-linejoin="round"
     id="path2"
     style="fill:none;stroke:#000000;stroke-opacity:1;stroke-width:0.01;stroke-miterlimit:4;stroke-dasharray:none" /></svg>
