(kicad_sch (version 20211123) (generator eeschema)

  (uuid 21237dc0-19fc-4952-997b-c4b3464efb3e)

  (paper "A4")

  (lib_symbols
    (symbol "Connector:TestPoint" (pin_numbers hide) (pin_names (offset 0.762) hide) (in_bom yes) (on_board yes)
      (property "Reference" "TP" (id 0) (at 0 6.858 0)
        (effects (font (size 1.27 1.27)))
      )
      (property "Value" "TestPoint" (id 1) (at 0 5.08 0)
        (effects (font (size 1.27 1.27)))
      )
      (property "Footprint" "" (id 2) (at 5.08 0 0)
        (effects (font (size 1.27 1.27)) hide)
      )
      (property "Datasheet" "~" (id 3) (at 5.08 0 0)
        (effects (font (size 1.27 1.27)) hide)
      )
      (property "ki_keywords" "test point tp" (id 4) (at 0 0 0)
        (effects (font (size 1.27 1.27)) hide)
      )
      (property "ki_description" "test point" (id 5) (at 0 0 0)
        (effects (font (size 1.27 1.27)) hide)
      )
      (property "ki_fp_filters" "Pin* Test*" (id 6) (at 0 0 0)
        (effects (font (size 1.27 1.27)) hide)
      )
      (symbol "TestPoint_0_1"
        (circle (center 0 3.302) (radius 0.762)
          (stroke (width 0) (type default) (color 0 0 0 0))
          (fill (type none))
        )
      )
      (symbol "TestPoint_1_1"
        (pin passive line (at 0 0 90) (length 2.54)
          (name "1" (effects (font (size 1.27 1.27))))
          (number "1" (effects (font (size 1.27 1.27))))
        )
      )
    )
    (symbol "Device:C" (pin_numbers hide) (pin_names (offset 0.254)) (in_bom yes) (on_board yes)
      (property "Reference" "C" (id 0) (at 0.635 2.54 0)
        (effects (font (size 1.27 1.27)) (justify left))
      )
      (property "Value" "C" (id 1) (at 0.635 -2.54 0)
        (effects (font (size 1.27 1.27)) (justify left))
      )
      (property "Footprint" "" (id 2) (at 0.9652 -3.81 0)
        (effects (font (size 1.27 1.27)) hide)
      )
      (property "Datasheet" "~" (id 3) (at 0 0 0)
        (effects (font (size 1.27 1.27)) hide)
      )
      (property "ki_keywords" "cap capacitor" (id 4) (at 0 0 0)
        (effects (font (size 1.27 1.27)) hide)
      )
      (property "ki_description" "Unpolarized capacitor" (id 5) (at 0 0 0)
        (effects (font (size 1.27 1.27)) hide)
      )
      (property "ki_fp_filters" "C_*" (id 6) (at 0 0 0)
        (effects (font (size 1.27 1.27)) hide)
      )
      (symbol "C_0_1"
        (polyline
          (pts
            (xy -2.032 -0.762)
            (xy 2.032 -0.762)
          )
          (stroke (width 0.508) (type default) (color 0 0 0 0))
          (fill (type none))
        )
        (polyline
          (pts
            (xy -2.032 0.762)
            (xy 2.032 0.762)
          )
          (stroke (width 0.508) (type default) (color 0 0 0 0))
          (fill (type none))
        )
      )
      (symbol "C_1_1"
        (pin passive line (at 0 3.81 270) (length 2.794)
          (name "~" (effects (font (size 1.27 1.27))))
          (number "1" (effects (font (size 1.27 1.27))))
        )
        (pin passive line (at 0 -3.81 90) (length 2.794)
          (name "~" (effects (font (size 1.27 1.27))))
          (number "2" (effects (font (size 1.27 1.27))))
        )
      )
    )
    (symbol "Device:LED" (pin_numbers hide) (pin_names (offset 1.016) hide) (in_bom yes) (on_board yes)
      (property "Reference" "D" (id 0) (at 0 2.54 0)
        (effects (font (size 1.27 1.27)))
      )
      (property "Value" "LED" (id 1) (at 0 -2.54 0)
        (effects (font (size 1.27 1.27)))
      )
      (property "Footprint" "" (id 2) (at 0 0 0)
        (effects (font (size 1.27 1.27)) hide)
      )
      (property "Datasheet" "~" (id 3) (at 0 0 0)
        (effects (font (size 1.27 1.27)) hide)
      )
      (property "ki_keywords" "LED diode" (id 4) (at 0 0 0)
        (effects (font (size 1.27 1.27)) hide)
      )
      (property "ki_description" "Light emitting diode" (id 5) (at 0 0 0)
        (effects (font (size 1.27 1.27)) hide)
      )
      (property "ki_fp_filters" "LED* LED_SMD:* LED_THT:*" (id 6) (at 0 0 0)
        (effects (font (size 1.27 1.27)) hide)
      )
      (symbol "LED_0_1"
        (polyline
          (pts
            (xy -1.27 -1.27)
            (xy -1.27 1.27)
          )
          (stroke (width 0.254) (type default) (color 0 0 0 0))
          (fill (type none))
        )
        (polyline
          (pts
            (xy -1.27 0)
            (xy 1.27 0)
          )
          (stroke (width 0) (type default) (color 0 0 0 0))
          (fill (type none))
        )
        (polyline
          (pts
            (xy 1.27 -1.27)
            (xy 1.27 1.27)
            (xy -1.27 0)
            (xy 1.27 -1.27)
          )
          (stroke (width 0.254) (type default) (color 0 0 0 0))
          (fill (type none))
        )
        (polyline
          (pts
            (xy -3.048 -0.762)
            (xy -4.572 -2.286)
            (xy -3.81 -2.286)
            (xy -4.572 -2.286)
            (xy -4.572 -1.524)
          )
          (stroke (width 0) (type default) (color 0 0 0 0))
          (fill (type none))
        )
        (polyline
          (pts
            (xy -1.778 -0.762)
            (xy -3.302 -2.286)
            (xy -2.54 -2.286)
            (xy -3.302 -2.286)
            (xy -3.302 -1.524)
          )
          (stroke (width 0) (type default) (color 0 0 0 0))
          (fill (type none))
        )
      )
      (symbol "LED_1_1"
        (pin passive line (at -3.81 0 0) (length 2.54)
          (name "K" (effects (font (size 1.27 1.27))))
          (number "1" (effects (font (size 1.27 1.27))))
        )
        (pin passive line (at 3.81 0 180) (length 2.54)
          (name "A" (effects (font (size 1.27 1.27))))
          (number "2" (effects (font (size 1.27 1.27))))
        )
      )
    )
    (symbol "Device:R" (pin_numbers hide) (pin_names (offset 0)) (in_bom yes) (on_board yes)
      (property "Reference" "R" (id 0) (at 2.032 0 90)
        (effects (font (size 1.27 1.27)))
      )
      (property "Value" "R" (id 1) (at 0 0 90)
        (effects (font (size 1.27 1.27)))
      )
      (property "Footprint" "" (id 2) (at -1.778 0 90)
        (effects (font (size 1.27 1.27)) hide)
      )
      (property "Datasheet" "~" (id 3) (at 0 0 0)
        (effects (font (size 1.27 1.27)) hide)
      )
      (property "ki_keywords" "R res resistor" (id 4) (at 0 0 0)
        (effects (font (size 1.27 1.27)) hide)
      )
      (property "ki_description" "Resistor" (id 5) (at 0 0 0)
        (effects (font (size 1.27 1.27)) hide)
      )
      (property "ki_fp_filters" "R_*" (id 6) (at 0 0 0)
        (effects (font (size 1.27 1.27)) hide)
      )
      (symbol "R_0_1"
        (rectangle (start -1.016 -2.54) (end 1.016 2.54)
          (stroke (width 0.254) (type default) (color 0 0 0 0))
          (fill (type none))
        )
      )
      (symbol "R_1_1"
        (pin passive line (at 0 3.81 270) (length 1.27)
          (name "~" (effects (font (size 1.27 1.27))))
          (number "1" (effects (font (size 1.27 1.27))))
        )
        (pin passive line (at 0 -3.81 90) (length 1.27)
          (name "~" (effects (font (size 1.27 1.27))))
          (number "2" (effects (font (size 1.27 1.27))))
        )
      )
    )
    (symbol "Diode:1N4148W" (pin_numbers hide) (pin_names (offset 1.016) hide) (in_bom yes) (on_board yes)
      (property "Reference" "D" (id 0) (at 0 2.54 0)
        (effects (font (size 1.27 1.27)))
      )
      (property "Value" "1N4148W" (id 1) (at 0 -2.54 0)
        (effects (font (size 1.27 1.27)))
      )
      (property "Footprint" "Diode_SMD:D_SOD-123" (id 2) (at 0 -4.445 0)
        (effects (font (size 1.27 1.27)) hide)
      )
      (property "Datasheet" "https://www.vishay.com/docs/85748/1n4148w.pdf" (id 3) (at 0 0 0)
        (effects (font (size 1.27 1.27)) hide)
      )
      (property "ki_keywords" "diode" (id 4) (at 0 0 0)
        (effects (font (size 1.27 1.27)) hide)
      )
      (property "ki_description" "75V 0.15A Fast Switching Diode, SOD-123" (id 5) (at 0 0 0)
        (effects (font (size 1.27 1.27)) hide)
      )
      (property "ki_fp_filters" "D*SOD?123*" (id 6) (at 0 0 0)
        (effects (font (size 1.27 1.27)) hide)
      )
      (symbol "1N4148W_0_1"
        (polyline
          (pts
            (xy -1.27 1.27)
            (xy -1.27 -1.27)
          )
          (stroke (width 0.254) (type default) (color 0 0 0 0))
          (fill (type none))
        )
        (polyline
          (pts
            (xy 1.27 0)
            (xy -1.27 0)
          )
          (stroke (width 0) (type default) (color 0 0 0 0))
          (fill (type none))
        )
        (polyline
          (pts
            (xy 1.27 1.27)
            (xy 1.27 -1.27)
            (xy -1.27 0)
            (xy 1.27 1.27)
          )
          (stroke (width 0.254) (type default) (color 0 0 0 0))
          (fill (type none))
        )
      )
      (symbol "1N4148W_1_1"
        (pin passive line (at -3.81 0 0) (length 2.54)
          (name "K" (effects (font (size 1.27 1.27))))
          (number "1" (effects (font (size 1.27 1.27))))
        )
        (pin passive line (at 3.81 0 180) (length 2.54)
          (name "A" (effects (font (size 1.27 1.27))))
          (number "2" (effects (font (size 1.27 1.27))))
        )
      )
    )
    (symbol "Transistor_BJT:BC846" (pin_names (offset 0) hide) (in_bom yes) (on_board yes)
      (property "Reference" "Q" (id 0) (at 5.08 1.905 0)
        (effects (font (size 1.27 1.27)) (justify left))
      )
      (property "Value" "BC846" (id 1) (at 5.08 0 0)
        (effects (font (size 1.27 1.27)) (justify left))
      )
      (property "Footprint" "Package_TO_SOT_SMD:SOT-23" (id 2) (at 5.08 -1.905 0)
        (effects (font (size 1.27 1.27) italic) (justify left) hide)
      )
      (property "Datasheet" "https://assets.nexperia.com/documents/data-sheet/BC846_SER.pdf" (id 3) (at 0 0 0)
        (effects (font (size 1.27 1.27)) (justify left) hide)
      )
      (property "ki_keywords" "NPN Transistor" (id 4) (at 0 0 0)
        (effects (font (size 1.27 1.27)) hide)
      )
      (property "ki_description" "0.1A Ic, 65V Vce, NPN Transistor, SOT-23" (id 5) (at 0 0 0)
        (effects (font (size 1.27 1.27)) hide)
      )
      (property "ki_fp_filters" "SOT?23*" (id 6) (at 0 0 0)
        (effects (font (size 1.27 1.27)) hide)
      )
      (symbol "BC846_0_1"
        (polyline
          (pts
            (xy 0.635 0.635)
            (xy 2.54 2.54)
          )
          (stroke (width 0) (type default) (color 0 0 0 0))
          (fill (type none))
        )
        (polyline
          (pts
            (xy 0.635 -0.635)
            (xy 2.54 -2.54)
            (xy 2.54 -2.54)
          )
          (stroke (width 0) (type default) (color 0 0 0 0))
          (fill (type none))
        )
        (polyline
          (pts
            (xy 0.635 1.905)
            (xy 0.635 -1.905)
            (xy 0.635 -1.905)
          )
          (stroke (width 0.508) (type default) (color 0 0 0 0))
          (fill (type none))
        )
        (polyline
          (pts
            (xy 1.27 -1.778)
            (xy 1.778 -1.27)
            (xy 2.286 -2.286)
            (xy 1.27 -1.778)
            (xy 1.27 -1.778)
          )
          (stroke (width 0) (type default) (color 0 0 0 0))
          (fill (type outline))
        )
        (circle (center 1.27 0) (radius 2.8194)
          (stroke (width 0.254) (type default) (color 0 0 0 0))
          (fill (type none))
        )
      )
      (symbol "BC846_1_1"
        (pin input line (at -5.08 0 0) (length 5.715)
          (name "B" (effects (font (size 1.27 1.27))))
          (number "1" (effects (font (size 1.27 1.27))))
        )
        (pin passive line (at 2.54 -5.08 90) (length 2.54)
          (name "E" (effects (font (size 1.27 1.27))))
          (number "2" (effects (font (size 1.27 1.27))))
        )
        (pin passive line (at 2.54 5.08 270) (length 2.54)
          (name "C" (effects (font (size 1.27 1.27))))
          (number "3" (effects (font (size 1.27 1.27))))
        )
      )
    )
    (symbol "Transistor_BJT:BC856" (pin_names (offset 0) hide) (in_bom yes) (on_board yes)
      (property "Reference" "Q" (id 0) (at 5.08 1.905 0)
        (effects (font (size 1.27 1.27)) (justify left))
      )
      (property "Value" "BC856" (id 1) (at 5.08 0 0)
        (effects (font (size 1.27 1.27)) (justify left))
      )
      (property "Footprint" "Package_TO_SOT_SMD:SOT-23" (id 2) (at 5.08 -1.905 0)
        (effects (font (size 1.27 1.27) italic) (justify left) hide)
      )
      (property "Datasheet" "https://www.onsemi.com/pub/Collateral/BC860-D.pdf" (id 3) (at 0 0 0)
        (effects (font (size 1.27 1.27)) (justify left) hide)
      )
      (property "ki_keywords" "PNP transistor" (id 4) (at 0 0 0)
        (effects (font (size 1.27 1.27)) hide)
      )
      (property "ki_description" "0.1A Ic, 65V Vce, PNP Transistor, SOT-23" (id 5) (at 0 0 0)
        (effects (font (size 1.27 1.27)) hide)
      )
      (property "ki_fp_filters" "SOT?23*" (id 6) (at 0 0 0)
        (effects (font (size 1.27 1.27)) hide)
      )
      (symbol "BC856_0_1"
        (polyline
          (pts
            (xy 0.635 0.635)
            (xy 2.54 2.54)
          )
          (stroke (width 0) (type default) (color 0 0 0 0))
          (fill (type none))
        )
        (polyline
          (pts
            (xy 0.635 -0.635)
            (xy 2.54 -2.54)
            (xy 2.54 -2.54)
          )
          (stroke (width 0) (type default) (color 0 0 0 0))
          (fill (type none))
        )
        (polyline
          (pts
            (xy 0.635 1.905)
            (xy 0.635 -1.905)
            (xy 0.635 -1.905)
          )
          (stroke (width 0.508) (type default) (color 0 0 0 0))
          (fill (type none))
        )
        (polyline
          (pts
            (xy 2.286 -1.778)
            (xy 1.778 -2.286)
            (xy 1.27 -1.27)
            (xy 2.286 -1.778)
            (xy 2.286 -1.778)
          )
          (stroke (width 0) (type default) (color 0 0 0 0))
          (fill (type outline))
        )
        (circle (center 1.27 0) (radius 2.8194)
          (stroke (width 0.254) (type default) (color 0 0 0 0))
          (fill (type none))
        )
      )
      (symbol "BC856_1_1"
        (pin input line (at -5.08 0 0) (length 5.715)
          (name "B" (effects (font (size 1.27 1.27))))
          (number "1" (effects (font (size 1.27 1.27))))
        )
        (pin passive line (at 2.54 -5.08 90) (length 2.54)
          (name "E" (effects (font (size 1.27 1.27))))
          (number "2" (effects (font (size 1.27 1.27))))
        )
        (pin passive line (at 2.54 5.08 270) (length 2.54)
          (name "C" (effects (font (size 1.27 1.27))))
          (number "3" (effects (font (size 1.27 1.27))))
        )
      )
    )
    (symbol "Transistor_FET:BSS138" (pin_names hide) (in_bom yes) (on_board yes)
      (property "Reference" "Q" (id 0) (at 5.08 1.905 0)
        (effects (font (size 1.27 1.27)) (justify left))
      )
      (property "Value" "BSS138" (id 1) (at 5.08 0 0)
        (effects (font (size 1.27 1.27)) (justify left))
      )
      (property "Footprint" "Package_TO_SOT_SMD:SOT-23" (id 2) (at 5.08 -1.905 0)
        (effects (font (size 1.27 1.27) italic) (justify left) hide)
      )
      (property "Datasheet" "https://www.onsemi.com/pub/Collateral/BSS138-D.PDF" (id 3) (at 0 0 0)
        (effects (font (size 1.27 1.27)) (justify left) hide)
      )
      (property "ki_keywords" "N-Channel MOSFET" (id 4) (at 0 0 0)
        (effects (font (size 1.27 1.27)) hide)
      )
      (property "ki_description" "50V Vds, 0.22A Id, N-Channel MOSFET, SOT-23" (id 5) (at 0 0 0)
        (effects (font (size 1.27 1.27)) hide)
      )
      (property "ki_fp_filters" "SOT?23*" (id 6) (at 0 0 0)
        (effects (font (size 1.27 1.27)) hide)
      )
      (symbol "BSS138_0_1"
        (polyline
          (pts
            (xy 0.254 0)
            (xy -2.54 0)
          )
          (stroke (width 0) (type default) (color 0 0 0 0))
          (fill (type none))
        )
        (polyline
          (pts
            (xy 0.254 1.905)
            (xy 0.254 -1.905)
          )
          (stroke (width 0.254) (type default) (color 0 0 0 0))
          (fill (type none))
        )
        (polyline
          (pts
            (xy 0.762 -1.27)
            (xy 0.762 -2.286)
          )
          (stroke (width 0.254) (type default) (color 0 0 0 0))
          (fill (type none))
        )
        (polyline
          (pts
            (xy 0.762 0.508)
            (xy 0.762 -0.508)
          )
          (stroke (width 0.254) (type default) (color 0 0 0 0))
          (fill (type none))
        )
        (polyline
          (pts
            (xy 0.762 2.286)
            (xy 0.762 1.27)
          )
          (stroke (width 0.254) (type default) (color 0 0 0 0))
          (fill (type none))
        )
        (polyline
          (pts
            (xy 2.54 2.54)
            (xy 2.54 1.778)
          )
          (stroke (width 0) (type default) (color 0 0 0 0))
          (fill (type none))
        )
        (polyline
          (pts
            (xy 2.54 -2.54)
            (xy 2.54 0)
            (xy 0.762 0)
          )
          (stroke (width 0) (type default) (color 0 0 0 0))
          (fill (type none))
        )
        (polyline
          (pts
            (xy 0.762 -1.778)
            (xy 3.302 -1.778)
            (xy 3.302 1.778)
            (xy 0.762 1.778)
          )
          (stroke (width 0) (type default) (color 0 0 0 0))
          (fill (type none))
        )
        (polyline
          (pts
            (xy 1.016 0)
            (xy 2.032 0.381)
            (xy 2.032 -0.381)
            (xy 1.016 0)
          )
          (stroke (width 0) (type default) (color 0 0 0 0))
          (fill (type outline))
        )
        (polyline
          (pts
            (xy 2.794 0.508)
            (xy 2.921 0.381)
            (xy 3.683 0.381)
            (xy 3.81 0.254)
          )
          (stroke (width 0) (type default) (color 0 0 0 0))
          (fill (type none))
        )
        (polyline
          (pts
            (xy 3.302 0.381)
            (xy 2.921 -0.254)
            (xy 3.683 -0.254)
            (xy 3.302 0.381)
          )
          (stroke (width 0) (type default) (color 0 0 0 0))
          (fill (type none))
        )
        (circle (center 1.651 0) (radius 2.794)
          (stroke (width 0.254) (type default) (color 0 0 0 0))
          (fill (type none))
        )
        (circle (center 2.54 -1.778) (radius 0.254)
          (stroke (width 0) (type default) (color 0 0 0 0))
          (fill (type outline))
        )
        (circle (center 2.54 1.778) (radius 0.254)
          (stroke (width 0) (type default) (color 0 0 0 0))
          (fill (type outline))
        )
      )
      (symbol "BSS138_1_1"
        (pin input line (at -5.08 0 0) (length 2.54)
          (name "G" (effects (font (size 1.27 1.27))))
          (number "1" (effects (font (size 1.27 1.27))))
        )
        (pin passive line (at 2.54 -5.08 90) (length 2.54)
          (name "S" (effects (font (size 1.27 1.27))))
          (number "2" (effects (font (size 1.27 1.27))))
        )
        (pin passive line (at 2.54 5.08 270) (length 2.54)
          (name "D" (effects (font (size 1.27 1.27))))
          (number "3" (effects (font (size 1.27 1.27))))
        )
      )
    )
    (symbol "Transistor_FET:BSS84" (pin_names hide) (in_bom yes) (on_board yes)
      (property "Reference" "Q" (id 0) (at 5.08 1.905 0)
        (effects (font (size 1.27 1.27)) (justify left))
      )
      (property "Value" "BSS84" (id 1) (at 5.08 0 0)
        (effects (font (size 1.27 1.27)) (justify left))
      )
      (property "Footprint" "Package_TO_SOT_SMD:SOT-23" (id 2) (at 5.08 -1.905 0)
        (effects (font (size 1.27 1.27) italic) (justify left) hide)
      )
      (property "Datasheet" "http://assets.nexperia.com/documents/data-sheet/BSS84.pdf" (id 3) (at 0 0 0)
        (effects (font (size 1.27 1.27)) (justify left) hide)
      )
      (property "ki_keywords" "P-Channel MOSFET" (id 4) (at 0 0 0)
        (effects (font (size 1.27 1.27)) hide)
      )
      (property "ki_description" "-0.13A Id, -50V Vds, P-Channel MOSFET, SOT-23" (id 5) (at 0 0 0)
        (effects (font (size 1.27 1.27)) hide)
      )
      (property "ki_fp_filters" "SOT?23*" (id 6) (at 0 0 0)
        (effects (font (size 1.27 1.27)) hide)
      )
      (symbol "BSS84_0_1"
        (polyline
          (pts
            (xy 0.254 0)
            (xy -2.54 0)
          )
          (stroke (width 0) (type default) (color 0 0 0 0))
          (fill (type none))
        )
        (polyline
          (pts
            (xy 0.254 1.905)
            (xy 0.254 -1.905)
          )
          (stroke (width 0.254) (type default) (color 0 0 0 0))
          (fill (type none))
        )
        (polyline
          (pts
            (xy 0.762 -1.27)
            (xy 0.762 -2.286)
          )
          (stroke (width 0.254) (type default) (color 0 0 0 0))
          (fill (type none))
        )
        (polyline
          (pts
            (xy 0.762 0.508)
            (xy 0.762 -0.508)
          )
          (stroke (width 0.254) (type default) (color 0 0 0 0))
          (fill (type none))
        )
        (polyline
          (pts
            (xy 0.762 2.286)
            (xy 0.762 1.27)
          )
          (stroke (width 0.254) (type default) (color 0 0 0 0))
          (fill (type none))
        )
        (polyline
          (pts
            (xy 2.54 2.54)
            (xy 2.54 1.778)
          )
          (stroke (width 0) (type default) (color 0 0 0 0))
          (fill (type none))
        )
        (polyline
          (pts
            (xy 2.54 -2.54)
            (xy 2.54 0)
            (xy 0.762 0)
          )
          (stroke (width 0) (type default) (color 0 0 0 0))
          (fill (type none))
        )
        (polyline
          (pts
            (xy 0.762 1.778)
            (xy 3.302 1.778)
            (xy 3.302 -1.778)
            (xy 0.762 -1.778)
          )
          (stroke (width 0) (type default) (color 0 0 0 0))
          (fill (type none))
        )
        (polyline
          (pts
            (xy 2.286 0)
            (xy 1.27 0.381)
            (xy 1.27 -0.381)
            (xy 2.286 0)
          )
          (stroke (width 0) (type default) (color 0 0 0 0))
          (fill (type outline))
        )
        (polyline
          (pts
            (xy 2.794 -0.508)
            (xy 2.921 -0.381)
            (xy 3.683 -0.381)
            (xy 3.81 -0.254)
          )
          (stroke (width 0) (type default) (color 0 0 0 0))
          (fill (type none))
        )
        (polyline
          (pts
            (xy 3.302 -0.381)
            (xy 2.921 0.254)
            (xy 3.683 0.254)
            (xy 3.302 -0.381)
          )
          (stroke (width 0) (type default) (color 0 0 0 0))
          (fill (type none))
        )
        (circle (center 1.651 0) (radius 2.794)
          (stroke (width 0.254) (type default) (color 0 0 0 0))
          (fill (type none))
        )
        (circle (center 2.54 -1.778) (radius 0.254)
          (stroke (width 0) (type default) (color 0 0 0 0))
          (fill (type outline))
        )
        (circle (center 2.54 1.778) (radius 0.254)
          (stroke (width 0) (type default) (color 0 0 0 0))
          (fill (type outline))
        )
      )
      (symbol "BSS84_1_1"
        (pin input line (at -5.08 0 0) (length 2.54)
          (name "G" (effects (font (size 1.27 1.27))))
          (number "1" (effects (font (size 1.27 1.27))))
        )
        (pin passive line (at 2.54 -5.08 90) (length 2.54)
          (name "S" (effects (font (size 1.27 1.27))))
          (number "2" (effects (font (size 1.27 1.27))))
        )
        (pin passive line (at 2.54 5.08 270) (length 2.54)
          (name "D" (effects (font (size 1.27 1.27))))
          (number "3" (effects (font (size 1.27 1.27))))
        )
      )
    )
  )


  (wire (pts (xy 78.74 85.09) (xy 78.74 87.63))
    (stroke (width 0) (type default) (color 0 0 0 0))
    (uuid 023ed51b-1c8d-4dcc-957f-194abcda38ea)
  )
  (wire (pts (xy 175.26 73.66) (xy 175.26 74.93))
    (stroke (width 0) (type default) (color 0 0 0 0))
    (uuid 096b0721-59af-4069-b366-cbe5ada38e92)
  )
  (wire (pts (xy 207.01 113.03) (xy 207.01 114.3))
    (stroke (width 0) (type default) (color 0 0 0 0))
    (uuid 1ce2ffb7-ffc4-4e47-b214-2d2cac3c163f)
  )
  (wire (pts (xy 198.12 80.01) (xy 199.39 80.01))
    (stroke (width 0) (type default) (color 0 0 0 0))
    (uuid 289e3255-e2d6-47c4-ba4e-25319d97ffb0)
  )
  (wire (pts (xy 175.26 101.6) (xy 175.26 102.87))
    (stroke (width 0) (type default) (color 0 0 0 0))
    (uuid 384ce8ab-f5e8-49f6-bf2a-f881ceb75534)
  )
  (wire (pts (xy 175.26 113.03) (xy 175.26 114.3))
    (stroke (width 0) (type default) (color 0 0 0 0))
    (uuid 4906c747-58e0-41d6-ad3c-04467e0e8b1e)
  )
  (wire (pts (xy 127 95.25) (xy 127 97.79))
    (stroke (width 0) (type default) (color 0 0 0 0))
    (uuid 559b2bc8-7e47-413d-a2f8-58f918eec634)
  )
  (wire (pts (xy 207.01 85.09) (xy 207.01 86.36))
    (stroke (width 0) (type default) (color 0 0 0 0))
    (uuid 827e5418-97f5-4533-a4ae-c96ca8b3ef28)
  )
  (wire (pts (xy 111.76 95.25) (xy 111.76 97.79))
    (stroke (width 0) (type default) (color 0 0 0 0))
    (uuid 84576f40-3759-4d36-aeab-97c68f21d216)
  )
  (wire (pts (xy 78.74 95.25) (xy 78.74 97.79))
    (stroke (width 0) (type default) (color 0 0 0 0))
    (uuid 84992e8c-7393-4e9a-be98-d42179b14689)
  )
  (wire (pts (xy 95.25 95.25) (xy 95.25 97.79))
    (stroke (width 0) (type default) (color 0 0 0 0))
    (uuid 924e1f3f-56c3-4da2-8bd1-601316490e8f)
  )
  (wire (pts (xy 175.26 85.09) (xy 175.26 86.36))
    (stroke (width 0) (type default) (color 0 0 0 0))
    (uuid 93c695b0-8e39-423c-9291-3fe17156aad7)
  )
  (wire (pts (xy 166.37 107.95) (xy 167.64 107.95))
    (stroke (width 0) (type default) (color 0 0 0 0))
    (uuid a0604770-6f98-42c7-8894-5b645f35a659)
  )
  (wire (pts (xy 207.01 73.66) (xy 207.01 74.93))
    (stroke (width 0) (type default) (color 0 0 0 0))
    (uuid b5a58647-dce3-46d2-b5d2-0588156ec00e)
  )
  (wire (pts (xy 207.01 101.6) (xy 207.01 102.87))
    (stroke (width 0) (type default) (color 0 0 0 0))
    (uuid d00bad81-ca35-47b8-9c95-63e0e31e860f)
  )
  (wire (pts (xy 111.76 85.09) (xy 111.76 87.63))
    (stroke (width 0) (type default) (color 0 0 0 0))
    (uuid d9a1aef6-affc-43b3-847e-57acf222f384)
  )
  (wire (pts (xy 198.12 107.95) (xy 199.39 107.95))
    (stroke (width 0) (type default) (color 0 0 0 0))
    (uuid db90b8b4-6c04-4b9f-90b7-b3270be9d762)
  )
  (wire (pts (xy 95.25 85.09) (xy 95.25 87.63))
    (stroke (width 0) (type default) (color 0 0 0 0))
    (uuid e317a8c8-e884-4569-8352-3ed19b3c0dc8)
  )
  (wire (pts (xy 127 85.09) (xy 127 87.63))
    (stroke (width 0) (type default) (color 0 0 0 0))
    (uuid e669f50f-c0c7-47dc-bb2a-e91d60de4d9c)
  )
  (wire (pts (xy 166.37 80.01) (xy 167.64 80.01))
    (stroke (width 0) (type default) (color 0 0 0 0))
    (uuid f4a69755-57ed-49f1-944f-ad82ca6adee5)
  )

  (symbol (lib_id "Connector:TestPoint") (at 207.01 86.36 180) (unit 1)
    (in_bom yes) (on_board yes) (fields_autoplaced)
    (uuid 141897e3-91d5-4c10-bc07-9822f1d0bd79)
    (property "Reference" "TP18" (id 0) (at 209.55 88.3919 0)
      (effects (font (size 1.27 1.27)) (justify right) hide)
    )
    (property "Value" "TestPoint" (id 1) (at 209.55 90.9319 0)
      (effects (font (size 1.27 1.27)) (justify right) hide)
    )
    (property "Footprint" "TestPoint:TestPoint_THTPad_2.0x2.0mm_Drill1.0mm" (id 2) (at 201.93 86.36 0)
      (effects (font (size 1.27 1.27)) hide)
    )
    (property "Datasheet" "~" (id 3) (at 201.93 86.36 0)
      (effects (font (size 1.27 1.27)) hide)
    )
    (pin "1" (uuid 237e2d63-111c-4eac-85f3-5ea4e2dbb14c))
  )

  (symbol (lib_id "Connector:TestPoint") (at 78.74 97.79 180) (unit 1)
    (in_bom yes) (on_board yes) (fields_autoplaced)
    (uuid 2219df43-461f-4afc-a217-72b01fc74215)
    (property "Reference" "TP2" (id 0) (at 81.28 99.8219 0)
      (effects (font (size 1.27 1.27)) (justify right) hide)
    )
    (property "Value" "TestPoint" (id 1) (at 81.28 102.3619 0)
      (effects (font (size 1.27 1.27)) (justify right) hide)
    )
    (property "Footprint" "TestPoint:TestPoint_THTPad_2.0x2.0mm_Drill1.0mm" (id 2) (at 73.66 97.79 0)
      (effects (font (size 1.27 1.27)) hide)
    )
    (property "Datasheet" "~" (id 3) (at 73.66 97.79 0)
      (effects (font (size 1.27 1.27)) hide)
    )
    (pin "1" (uuid c767df34-174c-4650-b7c3-54d87eeafd3c))
  )

  (symbol (lib_id "Connector:TestPoint") (at 111.76 85.09 0) (unit 1)
    (in_bom yes) (on_board yes) (fields_autoplaced)
    (uuid 23b2db49-71d0-4ff9-bf48-92e1f62077e3)
    (property "Reference" "TP5" (id 0) (at 114.3 80.5179 0)
      (effects (font (size 1.27 1.27)) (justify left) hide)
    )
    (property "Value" "TestPoint" (id 1) (at 114.3 83.0579 0)
      (effects (font (size 1.27 1.27)) (justify left) hide)
    )
    (property "Footprint" "TestPoint:TestPoint_THTPad_2.0x2.0mm_Drill1.0mm" (id 2) (at 116.84 85.09 0)
      (effects (font (size 1.27 1.27)) hide)
    )
    (property "Datasheet" "~" (id 3) (at 116.84 85.09 0)
      (effects (font (size 1.27 1.27)) hide)
    )
    (pin "1" (uuid d326c186-7d1d-46bf-8a8f-6fd019590807))
  )

  (symbol (lib_id "Diode:1N4148W") (at 95.25 91.44 90) (unit 1)
    (in_bom yes) (on_board yes) (fields_autoplaced)
    (uuid 2fa49b9e-3486-4549-b714-8125135af764)
    (property "Reference" "D1" (id 0) (at 97.79 90.1699 90)
      (effects (font (size 1.27 1.27)) (justify right))
    )
    (property "Value" "1N4148" (id 1) (at 97.79 92.7099 90)
      (effects (font (size 1.27 1.27)) (justify right))
    )
    (property "Footprint" "Diode_SMD:D_SOD-123" (id 2) (at 99.695 91.44 0)
      (effects (font (size 1.27 1.27)) hide)
    )
    (property "Datasheet" "https://www.vishay.com/docs/85748/1n4148w.pdf" (id 3) (at 95.25 91.44 0)
      (effects (font (size 1.27 1.27)) hide)
    )
    (pin "1" (uuid 9fa62067-9674-40a5-9d87-b8c3cf5498d7))
    (pin "2" (uuid 953ef033-ab3f-4754-8d92-d2509551b9a5))
  )

  (symbol (lib_id "Transistor_BJT:BC846") (at 204.47 80.01 0) (unit 1)
    (in_bom yes) (on_board yes) (fields_autoplaced)
    (uuid 39cc8ef5-d8dd-44aa-b9d9-32d81db2ef2a)
    (property "Reference" "Q3" (id 0) (at 209.55 78.7399 0)
      (effects (font (size 1.27 1.27)) (justify left))
    )
    (property "Value" "BC846" (id 1) (at 209.55 81.2799 0)
      (effects (font (size 1.27 1.27)) (justify left))
    )
    (property "Footprint" "Package_TO_SOT_SMD:SOT-23" (id 2) (at 209.55 81.915 0)
      (effects (font (size 1.27 1.27) italic) (justify left) hide)
    )
    (property "Datasheet" "https://assets.nexperia.com/documents/data-sheet/BC846_SER.pdf" (id 3) (at 204.47 80.01 0)
      (effects (font (size 1.27 1.27)) (justify left) hide)
    )
    (pin "1" (uuid c040fca7-83ca-4963-98a1-edcfa0a6d8d9))
    (pin "2" (uuid f2c4bfc6-de7b-44b0-8929-ec4bd5cebfe1))
    (pin "3" (uuid 4205242e-b1c9-487a-b0b5-87d7b7c82d79))
  )

  (symbol (lib_id "Device:R") (at 78.74 91.44 0) (unit 1)
    (in_bom yes) (on_board yes) (fields_autoplaced)
    (uuid 44646447-0a8e-4aec-a74e-22bf765d0f33)
    (property "Reference" "R1" (id 0) (at 81.28 90.1699 0)
      (effects (font (size 1.27 1.27)) (justify left))
    )
    (property "Value" "R" (id 1) (at 81.28 92.7099 0)
      (effects (font (size 1.27 1.27)) (justify left))
    )
    (property "Footprint" "Resistor_SMD:R_1206_3216Metric_Pad1.30x1.75mm_HandSolder" (id 2) (at 76.962 91.44 90)
      (effects (font (size 1.27 1.27)) hide)
    )
    (property "Datasheet" "~" (id 3) (at 78.74 91.44 0)
      (effects (font (size 1.27 1.27)) hide)
    )
    (pin "1" (uuid 8b290a17-6328-4178-9131-29524d345539))
    (pin "2" (uuid 27b2eb82-662b-42d8-90e6-830fec4bb8d2))
  )

  (symbol (lib_id "Transistor_FET:BSS138") (at 172.72 80.01 0) (unit 1)
    (in_bom yes) (on_board yes) (fields_autoplaced)
    (uuid 45d251bd-4b8c-43e0-a1a3-865b3e4a5a83)
    (property "Reference" "Q1" (id 0) (at 179.07 78.7399 0)
      (effects (font (size 1.27 1.27)) (justify left))
    )
    (property "Value" "BSS138" (id 1) (at 179.07 81.2799 0)
      (effects (font (size 1.27 1.27)) (justify left))
    )
    (property "Footprint" "Package_TO_SOT_SMD:SOT-23" (id 2) (at 177.8 81.915 0)
      (effects (font (size 1.27 1.27) italic) (justify left) hide)
    )
    (property "Datasheet" "https://www.onsemi.com/pub/Collateral/BSS138-D.PDF" (id 3) (at 172.72 80.01 0)
      (effects (font (size 1.27 1.27)) (justify left) hide)
    )
    (pin "1" (uuid 4b325ae5-e73e-4571-bbb6-af750e7a58b8))
    (pin "2" (uuid 8e99653b-c67d-4ba5-a650-293257580275))
    (pin "3" (uuid 3b8985d9-c9ce-4e5c-9b0f-dabde5c52713))
  )

  (symbol (lib_id "Connector:TestPoint") (at 207.01 114.3 180) (unit 1)
    (in_bom yes) (on_board yes) (fields_autoplaced)
    (uuid 4faa3bb4-9ee4-4f21-8b77-3ee28553fca4)
    (property "Reference" "TP20" (id 0) (at 209.55 116.3319 0)
      (effects (font (size 1.27 1.27)) (justify right) hide)
    )
    (property "Value" "TestPoint" (id 1) (at 209.55 118.8719 0)
      (effects (font (size 1.27 1.27)) (justify right) hide)
    )
    (property "Footprint" "TestPoint:TestPoint_THTPad_2.0x2.0mm_Drill1.0mm" (id 2) (at 201.93 114.3 0)
      (effects (font (size 1.27 1.27)) hide)
    )
    (property "Datasheet" "~" (id 3) (at 201.93 114.3 0)
      (effects (font (size 1.27 1.27)) hide)
    )
    (pin "1" (uuid e98a29d2-7df7-4908-aca8-34615ea4c184))
  )

  (symbol (lib_id "Connector:TestPoint") (at 207.01 101.6 0) (unit 1)
    (in_bom yes) (on_board yes) (fields_autoplaced)
    (uuid 54cd6eb8-cad4-4b44-900b-f468aa52b0bf)
    (property "Reference" "TP19" (id 0) (at 209.55 97.0279 0)
      (effects (font (size 1.27 1.27)) (justify left) hide)
    )
    (property "Value" "TestPoint" (id 1) (at 209.55 99.5679 0)
      (effects (font (size 1.27 1.27)) (justify left) hide)
    )
    (property "Footprint" "TestPoint:TestPoint_THTPad_2.0x2.0mm_Drill1.0mm" (id 2) (at 212.09 101.6 0)
      (effects (font (size 1.27 1.27)) hide)
    )
    (property "Datasheet" "~" (id 3) (at 212.09 101.6 0)
      (effects (font (size 1.27 1.27)) hide)
    )
    (pin "1" (uuid 07bdb19f-be0a-422f-bcf1-6a148c5e146b))
  )

  (symbol (lib_id "Connector:TestPoint") (at 166.37 80.01 90) (unit 1)
    (in_bom yes) (on_board yes) (fields_autoplaced)
    (uuid 555ff161-0ae6-4c22-8a0f-7553453862c5)
    (property "Reference" "TP9" (id 0) (at 163.068 73.66 90)
      (effects (font (size 1.27 1.27)) hide)
    )
    (property "Value" "TestPoint" (id 1) (at 163.068 76.2 90)
      (effects (font (size 1.27 1.27)) hide)
    )
    (property "Footprint" "TestPoint:TestPoint_THTPad_2.0x2.0mm_Drill1.0mm" (id 2) (at 166.37 74.93 0)
      (effects (font (size 1.27 1.27)) hide)
    )
    (property "Datasheet" "~" (id 3) (at 166.37 74.93 0)
      (effects (font (size 1.27 1.27)) hide)
    )
    (pin "1" (uuid c92a0d2e-9a0b-4896-833d-795750b03fbe))
  )

  (symbol (lib_id "Connector:TestPoint") (at 127 97.79 180) (unit 1)
    (in_bom yes) (on_board yes) (fields_autoplaced)
    (uuid 627cbb2e-54e7-495a-938f-ed4222e06102)
    (property "Reference" "TP8" (id 0) (at 129.54 99.8219 0)
      (effects (font (size 1.27 1.27)) (justify right) hide)
    )
    (property "Value" "TestPoint" (id 1) (at 129.54 102.3619 0)
      (effects (font (size 1.27 1.27)) (justify right) hide)
    )
    (property "Footprint" "TestPoint:TestPoint_THTPad_2.0x2.0mm_Drill1.0mm" (id 2) (at 121.92 97.79 0)
      (effects (font (size 1.27 1.27)) hide)
    )
    (property "Datasheet" "~" (id 3) (at 121.92 97.79 0)
      (effects (font (size 1.27 1.27)) hide)
    )
    (pin "1" (uuid 4c746c30-8982-493b-839c-beda8973c326))
  )

  (symbol (lib_id "Connector:TestPoint") (at 175.26 73.66 0) (unit 1)
    (in_bom yes) (on_board yes) (fields_autoplaced)
    (uuid 64dd8184-5b44-4903-9c47-10dc816b7fd4)
    (property "Reference" "TP11" (id 0) (at 177.8 69.0879 0)
      (effects (font (size 1.27 1.27)) (justify left) hide)
    )
    (property "Value" "TestPoint" (id 1) (at 177.8 71.6279 0)
      (effects (font (size 1.27 1.27)) (justify left) hide)
    )
    (property "Footprint" "TestPoint:TestPoint_THTPad_2.0x2.0mm_Drill1.0mm" (id 2) (at 180.34 73.66 0)
      (effects (font (size 1.27 1.27)) hide)
    )
    (property "Datasheet" "~" (id 3) (at 180.34 73.66 0)
      (effects (font (size 1.27 1.27)) hide)
    )
    (pin "1" (uuid 46fe266f-7f28-4bf5-9c26-12e52ae77552))
  )

  (symbol (lib_id "Connector:TestPoint") (at 198.12 107.95 90) (unit 1)
    (in_bom yes) (on_board yes) (fields_autoplaced)
    (uuid 71d2a5e0-8be7-46a3-bafe-da4205d98bb6)
    (property "Reference" "TP16" (id 0) (at 194.818 101.6 90)
      (effects (font (size 1.27 1.27)) hide)
    )
    (property "Value" "TestPoint" (id 1) (at 194.818 104.14 90)
      (effects (font (size 1.27 1.27)) hide)
    )
    (property "Footprint" "TestPoint:TestPoint_THTPad_2.0x2.0mm_Drill1.0mm" (id 2) (at 198.12 102.87 0)
      (effects (font (size 1.27 1.27)) hide)
    )
    (property "Datasheet" "~" (id 3) (at 198.12 102.87 0)
      (effects (font (size 1.27 1.27)) hide)
    )
    (pin "1" (uuid d959015d-a03e-4e5c-b9b1-a3208a83ff12))
  )

  (symbol (lib_id "Connector:TestPoint") (at 78.74 85.09 0) (unit 1)
    (in_bom yes) (on_board yes) (fields_autoplaced)
    (uuid 721eb4df-7ef2-4132-86da-1fadc7f5b1fe)
    (property "Reference" "TP1" (id 0) (at 81.28 80.5179 0)
      (effects (font (size 1.27 1.27)) (justify left) hide)
    )
    (property "Value" "TestPoint" (id 1) (at 81.28 83.0579 0)
      (effects (font (size 1.27 1.27)) (justify left) hide)
    )
    (property "Footprint" "TestPoint:TestPoint_THTPad_2.0x2.0mm_Drill1.0mm" (id 2) (at 83.82 85.09 0)
      (effects (font (size 1.27 1.27)) hide)
    )
    (property "Datasheet" "~" (id 3) (at 83.82 85.09 0)
      (effects (font (size 1.27 1.27)) hide)
    )
    (pin "1" (uuid 05860c18-becd-43c2-bf0c-03e2e21dcf3d))
  )

  (symbol (lib_id "Connector:TestPoint") (at 95.25 85.09 0) (unit 1)
    (in_bom yes) (on_board yes) (fields_autoplaced)
    (uuid 8239896e-1d9d-42d6-8ebc-cd5c25c9ad34)
    (property "Reference" "TP3" (id 0) (at 97.79 80.5179 0)
      (effects (font (size 1.27 1.27)) (justify left) hide)
    )
    (property "Value" "TestPoint" (id 1) (at 97.79 83.0579 0)
      (effects (font (size 1.27 1.27)) (justify left) hide)
    )
    (property "Footprint" "TestPoint:TestPoint_THTPad_2.0x2.0mm_Drill1.0mm" (id 2) (at 100.33 85.09 0)
      (effects (font (size 1.27 1.27)) hide)
    )
    (property "Datasheet" "~" (id 3) (at 100.33 85.09 0)
      (effects (font (size 1.27 1.27)) hide)
    )
    (pin "1" (uuid 643589b2-64d5-4900-b964-2ea0de4355f7))
  )

  (symbol (lib_id "Device:LED") (at 111.76 91.44 90) (unit 1)
    (in_bom yes) (on_board yes) (fields_autoplaced)
    (uuid 9ae16952-129d-4bb2-9748-c24f17164dd9)
    (property "Reference" "D2" (id 0) (at 115.57 91.7574 90)
      (effects (font (size 1.27 1.27)) (justify right))
    )
    (property "Value" "LED" (id 1) (at 115.57 94.2974 90)
      (effects (font (size 1.27 1.27)) (justify right))
    )
    (property "Footprint" "LED_SMD:LED_1206_3216Metric_Pad1.42x1.75mm_HandSolder" (id 2) (at 111.76 91.44 0)
      (effects (font (size 1.27 1.27)) hide)
    )
    (property "Datasheet" "~" (id 3) (at 111.76 91.44 0)
      (effects (font (size 1.27 1.27)) hide)
    )
    (pin "1" (uuid 65dae48a-34fa-4bd6-b343-f8503ac9160e))
    (pin "2" (uuid 54512f8e-811e-44cc-9ad2-108e238a2ad5))
  )

  (symbol (lib_id "Connector:TestPoint") (at 175.26 114.3 180) (unit 1)
    (in_bom yes) (on_board yes) (fields_autoplaced)
    (uuid 9ae73102-6b6e-4e59-a396-ec3f7bc4c700)
    (property "Reference" "TP14" (id 0) (at 177.8 116.3319 0)
      (effects (font (size 1.27 1.27)) (justify right) hide)
    )
    (property "Value" "TestPoint" (id 1) (at 177.8 118.8719 0)
      (effects (font (size 1.27 1.27)) (justify right) hide)
    )
    (property "Footprint" "TestPoint:TestPoint_THTPad_2.0x2.0mm_Drill1.0mm" (id 2) (at 170.18 114.3 0)
      (effects (font (size 1.27 1.27)) hide)
    )
    (property "Datasheet" "~" (id 3) (at 170.18 114.3 0)
      (effects (font (size 1.27 1.27)) hide)
    )
    (pin "1" (uuid e8b60d17-0e5a-4a2e-969c-fe8e5073c25a))
  )

  (symbol (lib_id "Connector:TestPoint") (at 207.01 73.66 0) (unit 1)
    (in_bom yes) (on_board yes) (fields_autoplaced)
    (uuid a5a29b07-c413-4e2c-a169-417885f3ba54)
    (property "Reference" "TP17" (id 0) (at 209.55 69.0879 0)
      (effects (font (size 1.27 1.27)) (justify left) hide)
    )
    (property "Value" "TestPoint" (id 1) (at 209.55 71.6279 0)
      (effects (font (size 1.27 1.27)) (justify left) hide)
    )
    (property "Footprint" "TestPoint:TestPoint_THTPad_2.0x2.0mm_Drill1.0mm" (id 2) (at 212.09 73.66 0)
      (effects (font (size 1.27 1.27)) hide)
    )
    (property "Datasheet" "~" (id 3) (at 212.09 73.66 0)
      (effects (font (size 1.27 1.27)) hide)
    )
    (pin "1" (uuid 988fb53d-5c3b-40a1-8a62-0994c8d6cd57))
  )

  (symbol (lib_id "Connector:TestPoint") (at 175.26 86.36 180) (unit 1)
    (in_bom yes) (on_board yes) (fields_autoplaced)
    (uuid b536e96e-333a-4039-bd86-3704f00fbc11)
    (property "Reference" "TP12" (id 0) (at 177.8 88.3919 0)
      (effects (font (size 1.27 1.27)) (justify right) hide)
    )
    (property "Value" "TestPoint" (id 1) (at 177.8 90.9319 0)
      (effects (font (size 1.27 1.27)) (justify right) hide)
    )
    (property "Footprint" "TestPoint:TestPoint_THTPad_2.0x2.0mm_Drill1.0mm" (id 2) (at 170.18 86.36 0)
      (effects (font (size 1.27 1.27)) hide)
    )
    (property "Datasheet" "~" (id 3) (at 170.18 86.36 0)
      (effects (font (size 1.27 1.27)) hide)
    )
    (pin "1" (uuid bc62718f-e5d9-4d07-bcd0-7d7f0936dd4d))
  )

  (symbol (lib_id "Connector:TestPoint") (at 166.37 107.95 90) (unit 1)
    (in_bom yes) (on_board yes) (fields_autoplaced)
    (uuid c2520ffe-31db-4e25-af9e-2f888e9ad905)
    (property "Reference" "TP10" (id 0) (at 163.068 101.6 90)
      (effects (font (size 1.27 1.27)) hide)
    )
    (property "Value" "TestPoint" (id 1) (at 163.068 104.14 90)
      (effects (font (size 1.27 1.27)) hide)
    )
    (property "Footprint" "TestPoint:TestPoint_THTPad_2.0x2.0mm_Drill1.0mm" (id 2) (at 166.37 102.87 0)
      (effects (font (size 1.27 1.27)) hide)
    )
    (property "Datasheet" "~" (id 3) (at 166.37 102.87 0)
      (effects (font (size 1.27 1.27)) hide)
    )
    (pin "1" (uuid 339beb77-cf27-4299-ad24-50006bb56d59))
  )

  (symbol (lib_id "Connector:TestPoint") (at 111.76 97.79 180) (unit 1)
    (in_bom yes) (on_board yes) (fields_autoplaced)
    (uuid c57f6a70-42f5-459f-8ae0-8600524da64f)
    (property "Reference" "TP6" (id 0) (at 114.3 99.8219 0)
      (effects (font (size 1.27 1.27)) (justify right) hide)
    )
    (property "Value" "TestPoint" (id 1) (at 114.3 102.3619 0)
      (effects (font (size 1.27 1.27)) (justify right) hide)
    )
    (property "Footprint" "TestPoint:TestPoint_THTPad_2.0x2.0mm_Drill1.0mm" (id 2) (at 106.68 97.79 0)
      (effects (font (size 1.27 1.27)) hide)
    )
    (property "Datasheet" "~" (id 3) (at 106.68 97.79 0)
      (effects (font (size 1.27 1.27)) hide)
    )
    (pin "1" (uuid e44df168-56b6-46f5-a334-6291f631d5a5))
  )

  (symbol (lib_id "Connector:TestPoint") (at 127 85.09 0) (unit 1)
    (in_bom yes) (on_board yes) (fields_autoplaced)
    (uuid c61d62ac-d3de-400f-ad05-740a0d1b1106)
    (property "Reference" "TP7" (id 0) (at 129.54 80.5179 0)
      (effects (font (size 1.27 1.27)) (justify left) hide)
    )
    (property "Value" "TestPoint" (id 1) (at 129.54 83.0579 0)
      (effects (font (size 1.27 1.27)) (justify left) hide)
    )
    (property "Footprint" "TestPoint:TestPoint_THTPad_2.0x2.0mm_Drill1.0mm" (id 2) (at 132.08 85.09 0)
      (effects (font (size 1.27 1.27)) hide)
    )
    (property "Datasheet" "~" (id 3) (at 132.08 85.09 0)
      (effects (font (size 1.27 1.27)) hide)
    )
    (pin "1" (uuid 20e2f440-26e1-4784-b9e0-3fc780de4107))
  )

  (symbol (lib_id "Device:C") (at 127 91.44 0) (unit 1)
    (in_bom yes) (on_board yes) (fields_autoplaced)
    (uuid c6e8924b-3698-49bc-af6d-d7a327eada39)
    (property "Reference" "C1" (id 0) (at 130.81 90.1699 0)
      (effects (font (size 1.27 1.27)) (justify left))
    )
    (property "Value" "C" (id 1) (at 130.81 92.7099 0)
      (effects (font (size 1.27 1.27)) (justify left))
    )
    (property "Footprint" "Capacitor_SMD:C_1206_3216Metric_Pad1.33x1.80mm_HandSolder" (id 2) (at 127.9652 95.25 0)
      (effects (font (size 1.27 1.27)) hide)
    )
    (property "Datasheet" "~" (id 3) (at 127 91.44 0)
      (effects (font (size 1.27 1.27)) hide)
    )
    (pin "1" (uuid 9e39ed40-271f-40f8-b1c9-20b888c10512))
    (pin "2" (uuid fe0a8ab1-7b25-4d9a-9a3b-f8c5e10b289a))
  )

  (symbol (lib_id "Transistor_BJT:BC856") (at 204.47 107.95 0) (mirror x) (unit 1)
    (in_bom yes) (on_board yes) (fields_autoplaced)
    (uuid ca14d0b0-2600-4ed2-a021-167444e07bec)
    (property "Reference" "Q4" (id 0) (at 209.55 106.6799 0)
      (effects (font (size 1.27 1.27)) (justify left))
    )
    (property "Value" "BC856" (id 1) (at 209.55 109.2199 0)
      (effects (font (size 1.27 1.27)) (justify left))
    )
    (property "Footprint" "Package_TO_SOT_SMD:SOT-23" (id 2) (at 209.55 106.045 0)
      (effects (font (size 1.27 1.27) italic) (justify left) hide)
    )
    (property "Datasheet" "https://www.onsemi.com/pub/Collateral/BC860-D.pdf" (id 3) (at 204.47 107.95 0)
      (effects (font (size 1.27 1.27)) (justify left) hide)
    )
    (pin "1" (uuid cd446b8a-c08c-42cd-a9a3-cf412885f2b4))
    (pin "2" (uuid b168ed7f-2c63-4dbc-90bf-bf3adb3795ed))
    (pin "3" (uuid 281cba2a-9a0d-4ba9-ae02-4851a4d5ef54))
  )

  (symbol (lib_id "Connector:TestPoint") (at 198.12 80.01 90) (unit 1)
    (in_bom yes) (on_board yes) (fields_autoplaced)
    (uuid d0facb29-4faf-4b03-b2ea-7fc9ec96aba8)
    (property "Reference" "TP15" (id 0) (at 194.818 73.66 90)
      (effects (font (size 1.27 1.27)) hide)
    )
    (property "Value" "TestPoint" (id 1) (at 194.818 76.2 90)
      (effects (font (size 1.27 1.27)) hide)
    )
    (property "Footprint" "TestPoint:TestPoint_THTPad_2.0x2.0mm_Drill1.0mm" (id 2) (at 198.12 74.93 0)
      (effects (font (size 1.27 1.27)) hide)
    )
    (property "Datasheet" "~" (id 3) (at 198.12 74.93 0)
      (effects (font (size 1.27 1.27)) hide)
    )
    (pin "1" (uuid 3e7ed32b-e8f4-4000-8e19-9b7e6a9897e0))
  )

  (symbol (lib_id "Connector:TestPoint") (at 175.26 101.6 0) (unit 1)
    (in_bom yes) (on_board yes) (fields_autoplaced)
    (uuid db69868f-bcf1-4c29-a415-eee401b9f54d)
    (property "Reference" "TP13" (id 0) (at 177.8 97.0279 0)
      (effects (font (size 1.27 1.27)) (justify left) hide)
    )
    (property "Value" "TestPoint" (id 1) (at 177.8 99.5679 0)
      (effects (font (size 1.27 1.27)) (justify left) hide)
    )
    (property "Footprint" "TestPoint:TestPoint_THTPad_2.0x2.0mm_Drill1.0mm" (id 2) (at 180.34 101.6 0)
      (effects (font (size 1.27 1.27)) hide)
    )
    (property "Datasheet" "~" (id 3) (at 180.34 101.6 0)
      (effects (font (size 1.27 1.27)) hide)
    )
    (pin "1" (uuid 8f72f6ae-8d0e-4eff-b2e7-1f4412f86fca))
  )

  (symbol (lib_id "Connector:TestPoint") (at 95.25 97.79 180) (unit 1)
    (in_bom yes) (on_board yes) (fields_autoplaced)
    (uuid e0e2e8b9-8f81-4609-ace8-6c1a4406ee5e)
    (property "Reference" "TP4" (id 0) (at 97.79 99.8219 0)
      (effects (font (size 1.27 1.27)) (justify right) hide)
    )
    (property "Value" "TestPoint" (id 1) (at 97.79 102.3619 0)
      (effects (font (size 1.27 1.27)) (justify right) hide)
    )
    (property "Footprint" "TestPoint:TestPoint_THTPad_2.0x2.0mm_Drill1.0mm" (id 2) (at 90.17 97.79 0)
      (effects (font (size 1.27 1.27)) hide)
    )
    (property "Datasheet" "~" (id 3) (at 90.17 97.79 0)
      (effects (font (size 1.27 1.27)) hide)
    )
    (pin "1" (uuid 373a42eb-a5ab-4f7d-993a-7d344f7bde79))
  )

  (symbol (lib_id "Transistor_FET:BSS84") (at 172.72 107.95 0) (mirror x) (unit 1)
    (in_bom yes) (on_board yes) (fields_autoplaced)
    (uuid fa7e5dc4-a142-4ee0-91f5-e79b80fca880)
    (property "Reference" "Q2" (id 0) (at 179.07 106.6799 0)
      (effects (font (size 1.27 1.27)) (justify left))
    )
    (property "Value" "BSS84" (id 1) (at 179.07 109.2199 0)
      (effects (font (size 1.27 1.27)) (justify left))
    )
    (property "Footprint" "Package_TO_SOT_SMD:SOT-23" (id 2) (at 177.8 106.045 0)
      (effects (font (size 1.27 1.27) italic) (justify left) hide)
    )
    (property "Datasheet" "http://assets.nexperia.com/documents/data-sheet/BSS84.pdf" (id 3) (at 172.72 107.95 0)
      (effects (font (size 1.27 1.27)) (justify left) hide)
    )
    (pin "1" (uuid 449acd15-9361-48c2-a00c-17e59109a21f))
    (pin "2" (uuid db44d871-451d-45a4-8ac9-c1e4ae35d5cf))
    (pin "3" (uuid baf3f486-9645-4072-853a-f8734fc0ca74))
  )

  (sheet_instances
    (path "/" (page "1"))
  )

  (symbol_instances
    (path "/c6e8924b-3698-49bc-af6d-d7a327eada39"
      (reference "C1") (unit 1) (value "C") (footprint "Capacitor_SMD:C_1206_3216Metric_Pad1.33x1.80mm_HandSolder")
    )
    (path "/2fa49b9e-3486-4549-b714-8125135af764"
      (reference "D1") (unit 1) (value "1N4148") (footprint "Diode_SMD:D_SOD-123")
    )
    (path "/9ae16952-129d-4bb2-9748-c24f17164dd9"
      (reference "D2") (unit 1) (value "LED") (footprint "LED_SMD:LED_1206_3216Metric_Pad1.42x1.75mm_HandSolder")
    )
    (path "/45d251bd-4b8c-43e0-a1a3-865b3e4a5a83"
      (reference "Q1") (unit 1) (value "BSS138") (footprint "Package_TO_SOT_SMD:SOT-23")
    )
    (path "/fa7e5dc4-a142-4ee0-91f5-e79b80fca880"
      (reference "Q2") (unit 1) (value "BSS84") (footprint "Package_TO_SOT_SMD:SOT-23")
    )
    (path "/39cc8ef5-d8dd-44aa-b9d9-32d81db2ef2a"
      (reference "Q3") (unit 1) (value "BC846") (footprint "Package_TO_SOT_SMD:SOT-23")
    )
    (path "/ca14d0b0-2600-4ed2-a021-167444e07bec"
      (reference "Q4") (unit 1) (value "BC856") (footprint "Package_TO_SOT_SMD:SOT-23")
    )
    (path "/44646447-0a8e-4aec-a74e-22bf765d0f33"
      (reference "R1") (unit 1) (value "R") (footprint "Resistor_SMD:R_1206_3216Metric_Pad1.30x1.75mm_HandSolder")
    )
    (path "/721eb4df-7ef2-4132-86da-1fadc7f5b1fe"
      (reference "TP1") (unit 1) (value "TestPoint") (footprint "TestPoint:TestPoint_THTPad_2.0x2.0mm_Drill1.0mm")
    )
    (path "/2219df43-461f-4afc-a217-72b01fc74215"
      (reference "TP2") (unit 1) (value "TestPoint") (footprint "TestPoint:TestPoint_THTPad_2.0x2.0mm_Drill1.0mm")
    )
    (path "/8239896e-1d9d-42d6-8ebc-cd5c25c9ad34"
      (reference "TP3") (unit 1) (value "TestPoint") (footprint "TestPoint:TestPoint_THTPad_2.0x2.0mm_Drill1.0mm")
    )
    (path "/e0e2e8b9-8f81-4609-ace8-6c1a4406ee5e"
      (reference "TP4") (unit 1) (value "TestPoint") (footprint "TestPoint:TestPoint_THTPad_2.0x2.0mm_Drill1.0mm")
    )
    (path "/23b2db49-71d0-4ff9-bf48-92e1f62077e3"
      (reference "TP5") (unit 1) (value "TestPoint") (footprint "TestPoint:TestPoint_THTPad_2.0x2.0mm_Drill1.0mm")
    )
    (path "/c57f6a70-42f5-459f-8ae0-8600524da64f"
      (reference "TP6") (unit 1) (value "TestPoint") (footprint "TestPoint:TestPoint_THTPad_2.0x2.0mm_Drill1.0mm")
    )
    (path "/c61d62ac-d3de-400f-ad05-740a0d1b1106"
      (reference "TP7") (unit 1) (value "TestPoint") (footprint "TestPoint:TestPoint_THTPad_2.0x2.0mm_Drill1.0mm")
    )
    (path "/627cbb2e-54e7-495a-938f-ed4222e06102"
      (reference "TP8") (unit 1) (value "TestPoint") (footprint "TestPoint:TestPoint_THTPad_2.0x2.0mm_Drill1.0mm")
    )
    (path "/555ff161-0ae6-4c22-8a0f-7553453862c5"
      (reference "TP9") (unit 1) (value "TestPoint") (footprint "TestPoint:TestPoint_THTPad_2.0x2.0mm_Drill1.0mm")
    )
    (path "/c2520ffe-31db-4e25-af9e-2f888e9ad905"
      (reference "TP10") (unit 1) (value "TestPoint") (footprint "TestPoint:TestPoint_THTPad_2.0x2.0mm_Drill1.0mm")
    )
    (path "/64dd8184-5b44-4903-9c47-10dc816b7fd4"
      (reference "TP11") (unit 1) (value "TestPoint") (footprint "TestPoint:TestPoint_THTPad_2.0x2.0mm_Drill1.0mm")
    )
    (path "/b536e96e-333a-4039-bd86-3704f00fbc11"
      (reference "TP12") (unit 1) (value "TestPoint") (footprint "TestPoint:TestPoint_THTPad_2.0x2.0mm_Drill1.0mm")
    )
    (path "/db69868f-bcf1-4c29-a415-eee401b9f54d"
      (reference "TP13") (unit 1) (value "TestPoint") (footprint "TestPoint:TestPoint_THTPad_2.0x2.0mm_Drill1.0mm")
    )
    (path "/9ae73102-6b6e-4e59-a396-ec3f7bc4c700"
      (reference "TP14") (unit 1) (value "TestPoint") (footprint "TestPoint:TestPoint_THTPad_2.0x2.0mm_Drill1.0mm")
    )
    (path "/d0facb29-4faf-4b03-b2ea-7fc9ec96aba8"
      (reference "TP15") (unit 1) (value "TestPoint") (footprint "TestPoint:TestPoint_THTPad_2.0x2.0mm_Drill1.0mm")
    )
    (path "/71d2a5e0-8be7-46a3-bafe-da4205d98bb6"
      (reference "TP16") (unit 1) (value "TestPoint") (footprint "TestPoint:TestPoint_THTPad_2.0x2.0mm_Drill1.0mm")
    )
    (path "/a5a29b07-c413-4e2c-a169-417885f3ba54"
      (reference "TP17") (unit 1) (value "TestPoint") (footprint "TestPoint:TestPoint_THTPad_2.0x2.0mm_Drill1.0mm")
    )
    (path "/141897e3-91d5-4c10-bc07-9822f1d0bd79"
      (reference "TP18") (unit 1) (value "TestPoint") (footprint "TestPoint:TestPoint_THTPad_2.0x2.0mm_Drill1.0mm")
    )
    (path "/54cd6eb8-cad4-4b44-900b-f468aa52b0bf"
      (reference "TP19") (unit 1) (value "TestPoint") (footprint "TestPoint:TestPoint_THTPad_2.0x2.0mm_Drill1.0mm")
    )
    (path "/4faa3bb4-9ee4-4f21-8b77-3ee28553fca4"
      (reference "TP20") (unit 1) (value "TestPoint") (footprint "TestPoint:TestPoint_THTPad_2.0x2.0mm_Drill1.0mm")
    )
  )
)
