\relax 
\catcode `:\active 
\catcode `;\active 
\catcode `!\active 
\catcode `?\active 
\@input{sections/couverture.aux}
\providecommand\@newglossary[4]{}
\@newglossary{main}{glg}{gls}{glo}
\@newglossary{acronym}{alg}{acr}{acn}
\providecommand\@glsorder[1]{}
\providecommand\@istfilename[1]{}
\@istfilename{rapport.ist}
\@glsorder{word}
\select@language{french}
\@writefile{toc}{\select@language{french}}
\@writefile{lof}{\select@language{french}}
\@writefile{lot}{\select@language{french}}
\@input{sections/Remerciements.aux}
\@input{sections/Resume.aux}
\newlabel{sec:name}{{}{2}}
\@writefile{toc}{\contentsline {section}{Introduction}{2}}
\citation{OSU}
\citation{INSU}
\@writefile{toc}{\contentsline {section}{\numberline {1}Environnement professionnel}{3}}
\@writefile{toc}{\contentsline {subsection}{\numberline {1.1}Pr\'esentation de l'OSU-R\'eunion}{3}}
\@writefile{lof}{\contentsline {figure}{\numberline {1}{\ignorespaces Logo de l'Observatoire des Sciences de l'Univers de la R\'eunion}}{3}}
\providecommand*\caption@xref[2]{\@setref\relax\@undefined{#1}}
\newlabel{monlabel}{{1}{3}}
\@writefile{toc}{\contentsline {subsection}{\numberline {1.2}Missions de l'OSU-R\'eunion}{3}}
\@writefile{toc}{\contentsline {subsection}{\numberline {1.3}Structures}{4}}
\@writefile{toc}{\contentsline {subsection}{\numberline {1.4}Positionnement \'economique}{4}}
\@writefile{toc}{\contentsline {subsection}{\numberline {1.5}Service informatique}{4}}
\citation{PROMISE}
\citation{ARISE}
\@writefile{toc}{\contentsline {section}{\numberline {2}Le projet Licorne}{5}}
\@writefile{toc}{\contentsline {subsection}{\numberline {2.1}Pr\'esentation}{5}}
\@writefile{lof}{\contentsline {figure}{\numberline {2}{\ignorespaces Logo officiel du framework Licorne}}{5}}
\newlabel{monlabel}{{2}{5}}
\@writefile{lof}{\contentsline {figure}{\numberline {3}{\ignorespaces Logo d'Aeris}}{6}}
\newlabel{monlabel}{{3}{6}}
\@writefile{toc}{\contentsline {subsection}{\numberline {2.2}Objectifs}{6}}
\@writefile{lof}{\contentsline {figure}{\numberline {4}{\ignorespaces Logo de l'OPAR}}{6}}
\newlabel{monlabel}{{4}{6}}
\@writefile{toc}{\contentsline {subsection}{\numberline {2.3}Description du framework}{6}}
\@writefile{lof}{\contentsline {figure}{\numberline {5}{\ignorespaces Sch\'ema paquets Licorne}}{7}}
\newlabel{monlabel}{{5}{7}}
\@writefile{toc}{\contentsline {subsubsection}{\numberline {2.3.1}Librairie Miscbox}{7}}
\@writefile{toc}{\contentsline {subsubsection}{\numberline {2.3.2}Librairie Lidata}{7}}
\@writefile{toc}{\contentsline {subsubsection}{\numberline {2.3.3}Librairie Lidarcommons}{8}}
\@writefile{lof}{\contentsline {figure}{\numberline {6}{\ignorespaces Sch\'ema algorithme \'evolutif}}{8}}
\newlabel{monlabel}{{6}{8}}
\citation{Licorne}
\@writefile{toc}{\contentsline {subsubsection}{\numberline {2.3.4}Application Lisipro}{9}}
\@writefile{toc}{\contentsline {subsection}{\numberline {2.4}\'Equipe projet}{9}}
\@writefile{toc}{\contentsline {subsection}{\numberline {2.5}Objectifs du stage}{10}}
\citation{mooc}
\@writefile{toc}{\contentsline {section}{\numberline {3}Premi\`ere mission : Chef de projet}{11}}
\@writefile{toc}{\contentsline {subsection}{\numberline {3.1}\'Etat de l'art}{11}}
\@writefile{toc}{\contentsline {subsubsection}{\numberline {3.1.1}Gestion de projet}{12}}
\newlabel{my-label}{{\caption@xref {my-label}{ on input line 393}}{12}}
\@writefile{lot}{\contentsline {table}{\numberline {1}{\ignorespaces Comparaison approche traditionnelle et approche agile\relax }}{12}}
\@writefile{toc}{\contentsline {paragraph}{R\'epartition des r\^oles avec Scrum}{12}}
\citation{genie_logiciel}
\@writefile{lof}{\contentsline {figure}{\numberline {7}{\ignorespaces Sch\'ema des r\^oles avec Scrum}}{13}}
\newlabel{monlabel}{{7}{13}}
\@writefile{toc}{\contentsline {paragraph}{Organisation du d\'eveloppement avec Scrum}{13}}
\@writefile{toc}{\contentsline {subsubsection}{\numberline {3.1.2}G\'enie logiciel python}{13}}
\@writefile{lof}{\contentsline {figure}{\numberline {8}{\ignorespaces Sch\'ema d'organisation avec Scrum}}{14}}
\newlabel{monlabel}{{8}{14}}
\@writefile{toc}{\contentsline {paragraph}{Structuration}{14}}
\@writefile{toc}{\contentsline {paragraph}{Respect des r\`egles de codage}{14}}
\@writefile{toc}{\contentsline {paragraph}{Robustesse}{15}}
\@writefile{toc}{\contentsline {subsection}{\numberline {3.2}Chef de projet}{15}}
\@writefile{toc}{\contentsline {subsubsection}{\numberline {3.2.1}Mon R\^ole}{15}}
\@writefile{lof}{\contentsline {figure}{\numberline {9}{\ignorespaces R\^ole et responsabilit\'es du chef de projet}}{16}}
\newlabel{monlabel}{{9}{16}}
\@writefile{toc}{\contentsline {subsubsection}{\numberline {3.2.2}Documents r\'ealis\'es}{16}}
\@writefile{toc}{\contentsline {subsection}{\numberline {3.3}Outils}{16}}
\@writefile{toc}{\contentsline {subsubsection}{\numberline {3.3.1}Planning}{16}}
\@writefile{toc}{\contentsline {subsubsection}{\numberline {3.3.2}Kanboard}{17}}
\@writefile{lof}{\contentsline {figure}{\numberline {10}{\ignorespaces Logo de Kanboard}}{17}}
\newlabel{monlabel}{{10}{17}}
\@writefile{toc}{\contentsline {subsection}{\numberline {3.4}Analyse Qualit\'e}{17}}
\@writefile{toc}{\contentsline {subsubsection}{\numberline {3.4.1}Tests et int\'egration continue}{17}}
\@writefile{toc}{\contentsline {paragraph}{nose}{18}}
\@writefile{toc}{\contentsline {paragraph}{tox}{18}}
\@writefile{toc}{\contentsline {paragraph}{Jenkins}{18}}
\@writefile{toc}{\contentsline {subsubsection}{\numberline {3.4.2}Qualit\'e structurelle}{18}}
\@writefile{toc}{\contentsline {paragraph}{flake8}{19}}
\@writefile{lof}{\contentsline {figure}{\numberline {11}{\ignorespaces Exemple de sortie en HTML avec flake8}}{19}}
\newlabel{monlabel}{{11}{19}}
\@writefile{toc}{\contentsline {paragraph}{coverage}{19}}
\@writefile{lof}{\contentsline {figure}{\numberline {12}{\ignorespaces Exemple de sortie en HTML du plugin coverage}}{19}}
\newlabel{monlabel}{{12}{19}}
\newlabel{my-label}{{\caption@xref {my-label}{ on input line 772}}{20}}
\@writefile{lot}{\contentsline {table}{\numberline {2}{\ignorespaces Couverture de code pour chacune des librairies\relax }}{20}}
\@writefile{toc}{\contentsline {paragraph}{pylint}{20}}
\newlabel{my-label}{{\caption@xref {my-label}{ on input line 791}}{20}}
\@writefile{lot}{\contentsline {table}{\numberline {3}{\ignorespaces Score de couverture de code par librairie\relax }}{20}}
\@writefile{toc}{\contentsline {paragraph}{radon}{20}}
\@writefile{toc}{\contentsline {paragraph}{memory\_profiler}{20}}
\@writefile{lof}{\contentsline {figure}{\numberline {13}{\ignorespaces Sortie graphique pour une ann\'ee de jeu de donn\'ee}}{21}}
\newlabel{monlabel}{{13}{21}}
\@writefile{toc}{\contentsline {subsection}{\numberline {3.5}Recommandations}{21}}
\@writefile{toc}{\contentsline {subsection}{\numberline {3.6}Site web}{21}}
\@writefile{toc}{\contentsline {subsection}{\numberline {3.7}Analyse finale}{22}}
\@writefile{toc}{\contentsline {section}{\numberline {4}Seconde mission : D\'eveloppeur Web-Python}{23}}
\@writefile{lof}{\contentsline {figure}{\numberline {14}{\ignorespaces Sch\'ema de fonctionnement de Lisipro}}{23}}
\newlabel{monlabel}{{14}{23}}
\@writefile{lof}{\contentsline {figure}{\numberline {15}{\ignorespaces Diagramme de cas d'utilisation de Lisipro}}{24}}
\newlabel{monlabel}{{15}{24}}
\@writefile{toc}{\contentsline {subsection}{\numberline {4.1}Application Chain Editor}{24}}
\@writefile{lof}{\contentsline {figure}{\numberline {16}{\ignorespaces Maquette de l'interface graphique de "Chain Editor"}}{25}}
\newlabel{monlabel}{{16}{25}}
\@writefile{toc}{\contentsline {subsubsection}{\numberline {4.1.1}Description des fen\^etres}{25}}
\@writefile{toc}{\contentsline {paragraph}{Fen\^etre "Controls"}{25}}
\@writefile{toc}{\contentsline {paragraph}{Fen\^etre "Toolbox"}{25}}
\@writefile{toc}{\contentsline {paragraph}{Fen\^etre "Viewer"}{25}}
\@writefile{toc}{\contentsline {paragraph}{Fen\^etre "Configuration"}{25}}
\@writefile{toc}{\contentsline {subsubsection}{\numberline {4.1.2}Description des technologies}{25}}
\@writefile{toc}{\contentsline {paragraph}{Bootstrap}{26}}
\@writefile{lof}{\contentsline {figure}{\numberline {17}{\ignorespaces Exemple de grille Bootstrap}}{26}}
\newlabel{monlabel}{{17}{26}}
\newlabel{my-label}{{\caption@xref {my-label}{ on input line 1055}}{26}}
\@writefile{lot}{\contentsline {table}{\numberline {4}{\ignorespaces Avantages et inconv\'enients de l'utilisation de Bootstrap\relax }}{26}}
\@writefile{toc}{\contentsline {paragraph}{Flask}{27}}
\@writefile{lol}{\contentsline {listing}{\numberline {1}{\ignorespaces Hello world avec Flask\relax }}{27}}
\newlabel{my-label}{{\caption@xref {my-label}{ on input line 1124}}{27}}
\@writefile{lot}{\contentsline {table}{\numberline {5}{\ignorespaces Avantages et inconv\'enients de l'utilisation de Flask\relax }}{27}}
\@writefile{toc}{\contentsline {subsection}{\numberline {4.2}D\'emarche appliqu\'ee}{28}}
\@writefile{toc}{\contentsline {subsubsection}{\numberline {4.2.1}L'interface graphique}{28}}
\@writefile{lol}{\contentsline {listing}{\numberline {2}{\ignorespaces Exemple de code de la fen\^etre "Control"\relax }}{28}}
\@writefile{toc}{\contentsline {subsubsection}{\numberline {4.2.2}Toolbox}{29}}
\@writefile{lol}{\contentsline {listing}{\numberline {3}{\ignorespaces Exemple de code de la fen\^etre "Control"\relax }}{29}}
\@writefile{toc}{\contentsline {subsubsection}{\numberline {4.2.3}Control}{29}}
\@writefile{lof}{\contentsline {figure}{\numberline {18}{\ignorespaces Logigramme de r\'ecup\'eration du chemin absolu via un interface web }}{30}}
\newlabel{monlabel}{{18}{30}}
\@writefile{toc}{\contentsline {subsubsection}{\numberline {4.2.4}Viewer}{31}}
\@writefile{toc}{\contentsline {paragraph}{Jstree}{31}}
\@writefile{toc}{\contentsline {paragraph}{CodeMirror}{31}}
\@writefile{toc}{\contentsline {paragraph}{XMLTree}{31}}
\@writefile{toc}{\contentsline {paragraph}{JsonEditor}{31}}
\@writefile{toc}{\contentsline {subsection}{\numberline {4.3}R\'esultats}{32}}
\@writefile{toc}{\contentsline {subsection}{\numberline {4.4}Perspectives}{32}}
\@writefile{toc}{\contentsline {section}{Conclusion}{33}}
\@input{sections/Bibliographie.aux}
\@input{sections/Annexe.aux}
\gdef\minted@oldcachelist{,
  default.pygstyle,
  default-pyg-prefix.pygstyle,
  C2CEB008333FCA7646E9D603FFC618A775B2134E4F6BDD184983599320D740CD.pygtex,
  A9EB3DB59C9304CE37FD5A6F0E691AD3A878BCD4E381F0F38828EA6D8E61BFFB.pygtex,
  F737EEA85D912F575D97CB392B57C7DB75B2134E4F6BDD184983599320D740CD.pygtex,
  F7E877B7F77707E544EA8AE8758DBE51A878BCD4E381F0F38828EA6D8E61BFFB.pygtex,
  67673E81A9640286C78C43947D8EAE4AF23179FB176FC5E1E872188B622045AE.pygtex,
  26F2F374E0E1998FBA81468C1E994485F23179FB176FC5E1E872188B622045AE.pygtex,
  6DF0A03F8BE1CB387858905D11C87317F23179FB176FC5E1E872188B622045AE.pygtex,
  8ED7DE4619D6778E3A56B881A1F8976CF23179FB176FC5E1E872188B622045AE.pygtex}
