\relax 
\citation{*}
\bibstyle{unsrt}
\bibdata{Bibliographie.bib}
\bibcite{OSU}{1}
\bibcite{INSU}{2}
\bibcite{PROMISE}{3}
\bibcite{ARISE}{4}
\bibcite{Licorne}{5}
\bibcite{mooc}{6}
\bibcite{genie_logiciel}{7}
\bibcite{Livre2}{8}
\bibcite{Livre}{9}
\bibcite{Livre_Python}{10}
\bibcite{livre_bootstrap}{11}
\bibcite{livre_blanc}{12}
\bibcite{hacker}{13}
\bibcite{Composantes}{14}
\bibcite{OPAR}{15}
\bibcite{cours_anil}{16}
\bibcite{c_vs_a}{17}
\bibcite{maintainable}{18}
\bibcite{cycle}{19}
\bibcite{programmer}{20}
\@writefile{toc}{\contentsline {section}{R\'ef\'erences}{34}}
\@setckpt{sections/Bibliographie}{
\setcounter{page}{35}
\setcounter{equation}{0}
\setcounter{enumi}{4}
\setcounter{enumii}{0}
\setcounter{enumiii}{0}
\setcounter{enumiv}{20}
\setcounter{footnote}{0}
\setcounter{mpfootnote}{0}
\setcounter{part}{0}
\setcounter{section}{4}
\setcounter{subsection}{4}
\setcounter{subsubsection}{0}
\setcounter{paragraph}{0}
\setcounter{subparagraph}{0}
\setcounter{figure}{18}
\setcounter{table}{5}
\setcounter{parentequation}{0}
\setcounter{ContinuedFloat}{0}
\setcounter{KVtest}{0}
\setcounter{subfigure}{0}
\setcounter{subfigure@save}{0}
\setcounter{lofdepth}{1}
\setcounter{subtable}{0}
\setcounter{subtable@save}{0}
\setcounter{lotdepth}{1}
\setcounter{lstnumber}{1}
\setcounter{FancyVerbLine}{1}
\setcounter{float@type}{16}
\setcounter{linenumber}{1}
\setcounter{LN@truepage}{41}
\setcounter{FancyVerbLineBreakLast}{0}
\setcounter{minted@FancyVerbLineTemp}{19}
\setcounter{listing}{3}
\setcounter{@pps}{0}
\setcounter{@ppsavesec}{0}
\setcounter{@ppsaveapp}{0}
\setcounter{su@anzahl}{0}
\setcounter{LT@tables}{0}
\setcounter{LT@chunks}{0}
\setcounter{nlinenum}{0}
\setcounter{lstlisting}{0}
}
