\relax 
\@writefile{toc}{\contentsline {section}{Acronymes}{35}}
\@writefile{toc}{\contentsline {section}{Glossaire}{36}}
\@writefile{toc}{\contentsline {section}{\numberline {A}Annexes}{37}}
\@writefile{toc}{\contentsline {subsection}{\numberline {A.1}Plus d'informations sur OSU-Reunion}{37}}
\@writefile{lof}{\contentsline {figure}{\numberline {19}{\ignorespaces Organigramme de l'OSU}}{37}}
\newlabel{organigramme_osu}{{19}{37}}
\@writefile{lof}{\contentsline {figure}{\numberline {20}{\ignorespaces Organigramme de l'UMS}}{37}}
\newlabel{monlabel}{{20}{37}}
\@writefile{toc}{\contentsline {subsection}{\numberline {A.2}Planning \'Equipe}{38}}
\@writefile{lof}{\contentsline {figure}{\numberline {21}{\ignorespaces Planning g\'en\'erale de l'\'equipe Janvier-Juin 2017 }}{38}}
\newlabel{organigramme_osu}{{21}{38}}
\@writefile{toc}{\contentsline {subsection}{\numberline {A.3}Planning personnel}{39}}
\@writefile{toc}{\contentsline {paragraph}{Janvier}{39}}
\@writefile{toc}{\contentsline {paragraph}{F\'evrier}{39}}
\@writefile{toc}{\contentsline {paragraph}{Mars}{39}}
\@writefile{toc}{\contentsline {paragraph}{Avril}{39}}
\@writefile{toc}{\contentsline {paragraph}{Mai}{39}}
\@writefile{toc}{\contentsline {paragraph}{Juin}{39}}
\@writefile{toc}{\contentsline {subsection}{\numberline {A.4}Tutoriel d'installation de Licorne}{40}}
\@writefile{toc}{\contentsline {subsubsection}{\numberline {A.4.1}Pr\'erequis}{40}}
\@writefile{toc}{\contentsline {subsubsection}{\numberline {A.4.2}Installation}{40}}
\@writefile{toc}{\contentsline {subsubsection}{\numberline {A.4.3}Utilisation}{40}}
\@writefile{toc}{\contentsline {paragraph}{\'Ex\'ecuter une ch\IeC {\^\i }ne de traitement \\ \\}{40}}
\@writefile{toc}{\contentsline {paragraph}{G\'en\'erer le fichier de configuration \\ \\}{40}}
\@writefile{toc}{\contentsline {paragraph}{Lancer l'interface graphique \\ \\}{40}}
\@writefile{toc}{\contentsline {subsection}{\numberline {A.5}Interface de Lisipro}{41}}
\@writefile{lof}{\contentsline {figure}{\numberline {22}{\ignorespaces Interface de l'application "Chain Editor" de Lisipro avant mon d\'eveloppement}}{41}}
\newlabel{organigramme_osu}{{22}{41}}
\@writefile{lof}{\contentsline {figure}{\numberline {23}{\ignorespaces Interface de l'application "Chain Editor" de Lisipro apr\`es mon d\'eveloppement}}{41}}
\newlabel{lisipro_interface}{{23}{41}}
\@writefile{lof}{\contentsline {figure}{\numberline {24}{\ignorespaces Interface de l'application Lisipro avec CodeMirror}}{42}}
\newlabel{organigramme_osu}{{24}{42}}
\@writefile{lof}{\contentsline {figure}{\numberline {25}{\ignorespaces Interface de l'application Lisipro avec XMLTree}}{42}}
\newlabel{organigramme_osu}{{25}{42}}
\@writefile{lof}{\contentsline {figure}{\numberline {26}{\ignorespaces Interface de l'application Lisipro avec JSONEditor}}{43}}
\newlabel{organigramme_osu}{{26}{43}}
\@writefile{toc}{\contentsline {subsection}{\numberline {A.6}Site web}{43}}
\@writefile{lof}{\contentsline {figure}{\numberline {27}{\ignorespaces Aper\c cu du site web de Licorne}}{43}}
\newlabel{organigramme_osu}{{27}{43}}
\@setckpt{sections/Annexe}{
\setcounter{page}{44}
\setcounter{equation}{0}
\setcounter{enumi}{4}
\setcounter{enumii}{0}
\setcounter{enumiii}{0}
\setcounter{enumiv}{20}
\setcounter{footnote}{0}
\setcounter{mpfootnote}{0}
\setcounter{part}{0}
\setcounter{section}{1}
\setcounter{subsection}{6}
\setcounter{subsubsection}{0}
\setcounter{paragraph}{0}
\setcounter{subparagraph}{0}
\setcounter{figure}{27}
\setcounter{table}{5}
\setcounter{parentequation}{0}
\setcounter{ContinuedFloat}{0}
\setcounter{KVtest}{0}
\setcounter{subfigure}{0}
\setcounter{subfigure@save}{0}
\setcounter{lofdepth}{1}
\setcounter{subtable}{0}
\setcounter{subtable@save}{0}
\setcounter{lotdepth}{1}
\setcounter{lstnumber}{1}
\setcounter{FancyVerbLine}{3}
\setcounter{float@type}{16}
\setcounter{linenumber}{1}
\setcounter{LN@truepage}{50}
\setcounter{FancyVerbLineBreakLast}{0}
\setcounter{minted@FancyVerbLineTemp}{1}
\setcounter{listing}{3}
\setcounter{@pps}{0}
\setcounter{@ppsavesec}{0}
\setcounter{@ppsaveapp}{0}
\setcounter{su@anzahl}{0}
\setcounter{LT@tables}{0}
\setcounter{LT@chunks}{0}
\setcounter{nlinenum}{0}
\setcounter{lstlisting}{0}
}
