838426 115046 525
361595 797060 509
114421 779573 509
194408 312025 443
84961 909869 525
889394 683649 525
556096 174481 470
904477 182956 525
462614 628462 509
693576 579009 509
165999 701402 509
959999 83490 525
503375 721688 509
312741 659935 509
639463 538793 509
744168 510344 509
846071 371147 525
817376 718432 468
970320 101828 525
684433 65641 509
786674 675653 504
27629 310710 443
639202 758928 504
932506 458607 525
521224 965558 525
515346 718757 509
401353 138333 443
518217 278559 470
362442 994928 525
467237 837968 525
782008 829597 468
570935 58546 470
408603 974629 525
313376 863835 525
70543 906198 525
204522 811914 509
425950 311281 449
427692 883717 525
496839 567170 470
118164 872723 525
969420 18614 525
387012 521995 470
195238 510996 449
784710 919876 525
870537 909556 445
116842 49518 354
664539 529935 509
591115 916335 525
114521 59498 354
35088 118099 354
182652 351732 443
640722 482765 509
587626 185419 470
891832 743032 525
568328 727054 509
550148 870004 525
286440 558040 470
874903 293643 525
3734 709789 509
83601 497284 449
205985 722631 509
149988 682887 509
751693 740899 393
346277 551388 470
379513 411676 449
623115 851899 525
988251 384444 525
657873 753119 504
910452 45124 525
70944 581212 470
949834 844718 507
829671 644307 504
859884 941728 507
13561 617937 470
491374 397157 449
816090 413461 509
962695 534131 525
378201 590307 470
466382 51353 449
591008 97134 470
26924 981357 525
592734 115850 470
730408 978420 525
561034 363176 470
843354 577387 525
473666 19945 449
342929 689721 509
187670 290973 443
706345 939127 525
201755 193798 360
635680 346001 509
348652 153357 443
32251 80890 351
323354 608511 470
802624 847181 525
280526 259389 407
48262 63962 340
631122 365023 509
243138 628383 509
823413 452647 509
256318 167099 443
880946 655692 525
473582 223654 449
282776 736770 509
453146 186246 449
606982 617742 447
526591 202410 470
322996 443317 449
184114 352783 443
782554 193981 509
373007 117877 443
952985 791678 525
380738 76800 443
878938 597908 525
855978 381181 525
762109 663166 504
439883 462154 444
329406 658528 509
607561 585358 403
970233 755068 525
639546 856787 525
291062 631070 509
770428 348042 509
56792 706514 509
596720 580815 434
417474 659463 509
917925 455734 525
281360 72566 443
436283 823069 509
474188 359853 449
470779 82898 449
962716 403375 525
110534 282482 443
761702 633762 504
759873 663176 504
672058 142839 509
637254 141218 509
954097 808509 525
179529 894100 525
517093 172689 470
446850 105756 449
376155 103248 443
754540 558412 509
628170 343420 509
918710 45536 525
270560 775123 509
412875 597692 470
957991 445394 525
160552 132538 383
410006 573882 470
969465 535922 525
194523 131877 383
777961 965118 525
980965 625687 525
706213 847431 525
691485 560158 509
226343 893438 525
512506 636255 509
298321 44434 443
633175 277452 509
53196 155516 375
363180 378734 423
829386 311905 509
841260 296686 525
930892 721521 525
9162 549973 470
967701 915282 507
818885 762195 468
204779 554158 470
936638 777978 525
797772 491012 509
351833 90092 443
123610 999158 525
799124 278628 509
220441 910150 525
305474 305329 265
219434 390439 443
278462 702311 509
893968 397455 525
107184 782724 509
514790 942611 525
756462 623631 509
694125 646450 442
902744 738088 525
914365 994051 507
224877 318626 443
741177 134148 509
818978 19519 509
643054 278904 509
709452 168337 509
603363 471520 470
646269 116840 509
605019 620506 447
69183 17990 340
15810 988948 525
293680 100435 443
623536 504186 470
584179 274839 470
318629 925023 525
111005 111757 323
564845 55523 470
609129 278708 470
748617 602018 509
352322 362970 410
868205 663915 525
597650 330570 470
749389 610001 509
273140 149172 443
538041 387732 470
527585 312104 470
678894 6837 509
935675 500045 525
75924 601652 470
857121 762007 525
65657 817241 509
473709 536170 470
741374 59355 509
144135 660194 509
840657 881484 432
938941 552218 525
821607 11685 509
875438 864312 432
947903 969848 414
835027 18706 509
354849 415178 449
599497 372215 470
230074 51184 386
494932 590669 470
607642 616244 447
200259 128601 383
425621 446178 400
423059 815197 509
556350 186347 470
931699 467242 525
812448 264465 509
450188 613560 470
400325 259141 441
104683 619083 470
431146 130207 449
689076 111947 509
993127 375002 525
975417 988528 427
117197 527050 470
404197 483578 449
979605 593196 525
788280 582584 509
345737 787580 509
905578 83667 525
449039 310596 449
472956 831780 509
379276 367402 423
72683 969444 525
611903 183481 470
565697 395610 470
940891 711952 525
189238 863900 525
120640 22466 354
804974 50416 509
704980 897540 525
36617 557333 470
762788 558114 509
303166 375655 441
502306 815860 509
679753 926021 525
502389 744280 509
932737 612184 525
637271 555293 509
311982 561317 470
674616 846502 525
400705 902074 525
35757 916857 525
634964 324722 509
246839 649850 509
458278 258479 449
268232 398108 441
328315 19982 443
937960 211181 525
632234 65934 509
428934 208432 449
839386 142381 525
881113 881735 326
53888 749631 509
731756 793165 468
81195 853411 525
550784 750629 509
71091 672943 509
345599 681059 509
862029 433206 525
528999 861166 525
3796 548424 470
153851 342625 443
288824 301040 371
556342 830109 509
567504 888554 525
979238 343494 525
652758 948415 525
213548 485914 449
648079 647677 341
994335 951568 458
211513 861017 525
690656 695605 442
302944 548112 470
375509 44757 443
825238 281385 509
412776 270139 449
602608 222398 470
660316 644075 429
102431 202123 383
290530 180973 443
700906 900155 525
628130 952863 525
300977 315185 384
175656 146125 383
263110 1067 443
895444 734292 525
477305 867527 525
449589 458646 387
830966 887967 525
737418 92269 509
544484 386884 470
76263 503513 449
474650 521334 470
852281 394115 525
871236 639338 525
982697 141782 525
927633 222366 525
522101 650016 509
112702 460954 449
615936 783397 509
134976 752841 509
490082 188373 449
82809 11069 351
304467 681952 509
223719 562201 470
566763 146294 470
115150 716385 509
200442 253314 443
881444 548581 525
893745 165461 525
247137 979726 525
887363 35636 525
934532 263533 525
953123 954219 414
552362 687446 509
229670 705982 509
115717 983560 525
895086 527189 525
304882 704122 509
776818 645247 504
973900 562510 525
3546 185730 383
15883 917669 525
470458 135518 449
294336 664668 509
270343 41460 443
843788 823986 525
658530 119464 509
266155 347137 441
912859 345166 525
829105 66345 509
260664 536762 470
361401 399973 436
409666 728291 509
809363 628338 504
281721 752198 509
885310 69165 525
856103 858204 375
157366 387681 443
654357 925941 525
583802 831611 509
128191 413776 449
919024 731487 525
723705 530384 509
314676 203967 443
604988 122489 470
860029 48016 525
440531 518959 470
983765 559262 525
534678 671664 509
670050 125447 509
13477 167355 383
561553 120932 470
396677 310638 441
111622 501969 449
218986 484865 449
86189 792512 509
815684 342920 509
590662 901641 525
974963 568055 525
321974 623477 470
723085 946066 525
981436 643304 525
793849 12042 509
78669 422313 449
307833 188137 443
852538 119451 525
741076 790770 468
84777 223958 386
105930 229678 386
513475 350911 470
550447 818111 509
77709 10182 351
395982 652183 509
385568 977050 525
909740 464325 525
197187 769012 509
504358 385870 449
710391 50000 509
3716 577980 470
644880 860176 525
113489 601900 470
427130 211103 449
319690 943099 525
688021 40872 509
206128 149926 383
93617 888198 525
405722 813388 509
35767 645183 509
460257 630252 509
619051 958682 525
221267 819110 509
473172 774482 509
82856 356709 443
502403 299742 449
18635 730503 509
986836 545159 525
566717 754756 509
440617 572185 470
11289 770320 509
848632 566559 525
328940 385554 441
139143 313090 443
43672 313384 443
77720 675356 509
595920 862870 525
685423 656726 442
328830 183220 443
88693 40092 351
180773 257728 443
588152 969383 525
275895 791668 509
289432 729164 509
954931 786937 525
17998 892384 525
961473 285717 525
818073 48208 509
185377 698052 509
6845 425576 449
805410 231598 509
354598 880224 525
805268 818728 406
165531 660922 509
594615 770049 509
750717 455174 509
695441 893498 525
730626 48978 509
697970 154557 509
138714 192396 383
441046 449500 369
217489 633665 509
546249 651326 509
245512 349350 441
622075 963937 525
266225 803630 509
859253 794839 525
258636 159719 443
936297 471575 525
186499 421329 449
329344 291631 384
351944 964047 525
585589 916862 525
455985 521638 470
102957 588109 470
338565 419641 449
651466 132876 509
26196 391655 443
201874 521609 470
656065 446866 509
9962 343797 443
396984 371471 436
433065 676273 509
695823 257837 509
247128 554004 470
834215 574542 509
398437 32190 443
291838 672907 509
418596 711782 509
576073 460344 470
288793 191856 443
990866 748172 525
410571 240381 449
958027 98128 525
861532 569060 525
157821 755877 509
923504 808430 525
593231 35418 470
401351 914353 525
707621 970907 525
698587 533518 509
128340 846854 525
697262 122651 509
276289 406894 441
82246 367355 443
170326 271902 443
409425 174984 443
206860 588056 470
294583 496149 449
910384 440527 525
449208 567337 470
552818 406784 470
700863 715343 504
373410 890259 525
358089 831007 509
580709 283857 470
90268 29376 351
934548 594979 525
534139 551729 452
483831 195076 449
807509 792183 468
251612 648858 509
373077 441486 449
978115 663289 525
940487 862718 507
256456 981173 525
202107 132142 383
652519 315145 509
473506 329047 449
323378 886681 525
308822 146075 443
833211 267215 509
597461 487974 470
131489 162698 383
161292 904149 525
45939 713931 509
404629 938285 525
425870 613451 470
287033 233262 407
91532 108374 354
242760 584911 470
862381 172817 525
505771 736307 509
294261 588928 470
509505 696359 509
903275 747744 525
975949 564725 525
620856 818847 509
652319 26920 509
257238 966023 525
550339 252619 470
784484 649595 504
316688 350519 441
529525 977820 525
396659 292908 441
721363 607755 509
204691 980359 525
778003 741268 468
228231 395429 443
575381 966926 525
53052 117954 354
170322 368290 443
657735 136059 509
3873 540303 470
593682 956311 525
853787 466034 525
913836 661154 525
846831 564500 525
305884 431166 449
101093 188379 383
242577 472242 449
479071 836574 509
991721 306361 525
741682 843375 525
339604 347800 441
298090 202301 443
154174 341074 443
379444 278474 441
355244 559417 470
428384 431551 325
540680 274859 470
45454 932242 525
394300 802582 509
728503 198767 509
57653 486972 449
640113 336783 509
644083 188947 509
438896 163599 449
592999 901308 525
841833 357813 525
890336 986703 507
987647 615330 525
528929 64081 470
229891 464237 449
52086 706663 509
905403 248055 525
746688 430879 509
608134 572049 434
529456 650883 509
485775 386336 449
729645 767509 424
193738 495590 449
817877 305100 509
566139 241224 470
905952 18454 525
619120 751929 509
127342 442322 449
499800 238000 449
369437 744516 509
189117 885017 525
704144 853480 525
476413 321892 449
545049 769565 509
525501 456700 470
984364 105555 525
346478 223970 443
742897 454375 509
390074 463171 449
287108 318106 389
429116 589757 470
821175 96866 509
869484 330662 525
594937 785236 509
105878 264776 443
382580 614747 470
69990 10425 340
418892 70981 449
582175 695883 509
407623 536621 470
266432 880907 525
464419 136901 449
875645 562295 525
333946 166387 443
615518 942896 525
457357 816244 509
600383 115090 470
492073 479353 413
126109 71073 354
641683 45983 509
750260 595428 509
951940 656766 525
551211 10067 470
832304 269723 509
247666 830806 509
113479 73001 354
84344 12866 351
529798 449901 470
723175 428850 509
239134 662408 509
474040 543030 470
502246 834793 509
497507 724896 509
17609 781193 509
696465 442511 509
216066 764786 509
680223 731570 504
529828 239953 470
631664 434884 509
982590 565209 525
100049 544834 470
585284 230791 470
813640 995912 525
703871 242506 509
350302 693835 509
60077 360468 443
933712 266508 525
264455 813620 509
629102 352280 509
567167 394628 470
375545 436558 449
741432 572874 509
713751 947867 525
582636 672860 509
162724 985948 525
850058 25105 525
704895 401216 509
477993 507333 426
819687 378178 509
299584 252479 407
21509 362841 443
143644 480045 449
719566 66378 509
221070 748009 509
538484 696271 509
538167 740338 509
904685 33838 525
415282 858843 525
882005 636275 525
471580 239122 449
415466 373109 449
889168 187626 525
146641 19512 375
925435 498506 525
352830 990252 525
122342 947841 525
984891 366752 525
931700 720970 525
225469 9159 386
437762 760591 509
740571 16497 509
882118 226756 525
294098 628879 509
956200 932109 507
888605 664927 525
816174 572246 509
363084 442418 449
804751 52696 509
131114 224597 386
957117 155238 525
910653 411120 525
91246 412643 449
185145 401143 443
676051 727175 504
560677 596855 434
503820 47441 449
498506 912502 525
475957 903087 525
26810 943751 525
39887 649233 509
342808 351885 441
309482 955836 525
477039 348424 449
676538 819880 504
62291 409407 443
285065 719975 509
288081 867341 525
387727 327687 441
776505 237065 509
832215 931280 525
345337 276910 389
985218 885206 507
150308 626815 509
217952 582906 470
448468 37704 449
93700 842192 525
24417 751480 509
199693 413446 449
892119 954960 507
638568 201896 509
471847 999281 525
149065 287908 443
441037 817673 509
741132 968830 525
256741 275239 407
926383 581972 525
611130 97218 470
691333 305493 509
455875 180863 449
626310 712487 509
109525 457413 449
244122 850599 525
166145 103427 383
230471 426883 449
377156 360828 423
702011 824761 504
605966 266736 470
618468 352908 470
408538 617343 470
959205 423421 525
559539 591643 434
240253 464206 449
116673 660025 509
240133 571825 470
258456 931526 525
716710 805245 468
873609 258100 525
445240 49981 449
618148 859194 525
139385 347207 443
699128 17815 509
39840 308999 443
189410 628972 509
408970 44344 443
563685 862461 525
767736 550813 509
677167 80990 509
409271 783159 509
523777 534135 408
34287 879002 525
139625 358502 443
564999 613541 434
114813 291357 443
700872 490064 509
234245 888231 525
421390 499202 444
97182 165779 383
712520 342506 509
243101 860464 525
911190 266611 525
366052 464450 449
354456 173542 443
690673 139958 509
971917 826952 525
231519 220606 443
619024 918134 525
647929 123480 509
538168 910055 525
200318 871164 525
752980 498134 509
127531 537914 470
956281 462851 525
49911 66392 340
270727 91028 443
570979 47509 470
863877 501073 525
541380 193778 470
284775 924344 525
543089 793651 509
686546 631405 442
61357 689941 509
153194 963447 525
448841 864752 525
995520 790328 525
282219 363054 441
462944 968300 525
408705 223463 443
82734 903577 525
553982 856754 525
809522 954996 525
797143 354028 509
471606 914794 525
889875 660391 525
369094 502073 449
567231 592781 434
751000 472977 509
53076 311554 443
843192 108456 525
104951 425395 449
873480 188577 525
774204 219946 509
950085 507954 525
335657 372862 441
931887 365578 525
709284 739110 424
151063 595535 470
877632 179325 525
21584 945214 525
621345 673274 509
196967 935631 525
598027 29078 470
419286 498266 444
377832 159578 443
51977 364021 443
249638 585588 470
384156 679085 509
99771 454776 449
891067 66246 525
60043 240392 443
127626 457676 449
895459 942036 507
867725 694847 525
741103 699870 504
524609 616894 452
751443 608931 509
574562 685801 509
283086 416867 449
805824 464220 509
530339 719036 509
854365 462056 525
287922 243813 407
607864 811325 509
399818 246822 441
342774 930097 525
785573 314948 509
597372 502797 470
187976 237894 443
205544 130425 383
415461 823199 509
71092 52039 340
161142 458169 449
449501 797432 509
361757 611203 470
201854 318300 443
63130 995042 525
370080 725187 509
261584 876320 525
626932 832304 504
440964 40208 449
281415 666225 509
344912 21727 443
167240 498115 449
866718 450353 525
899283 233749 525
155880 711609 509
521355 520008 364
201860 424754 449
86352 729564 509
315157 969842 525
276332 550012 470
8396 652802 509
607021 975266 525
877619 138184 525
30844 547867 470
840644 417573 525
941381 343313 525
198564 549252 470
165336 984907 525
983543 950644 458
169762 348887 443
641330 71696 509
362319 601926 470
355792 976400 525
