169 901
306 963
223 877
177 643
8 853
153 754
359 602
430 750
182 717
62 506
201 931
458 735
319 676
305 582
397 622
500 976
450 703
338 697
141 984
168 540
250 699
107 870
186 537
490 849
164 752
406 832
370 952
493 745
237 944
482 524
201 666
216 671
191 701
400 510
96 759
351 934
385 850
432 651
81 749
153 881
487 708
33 766
306 987
174 621
172 598
48 740
325 747
462 753
309 774
339 929
166 854
8 897
177 524
361 899
352 861
315 685
121 988
202 999
482 856
429 857
279 718
174 764
137 708
73 896
498 904
311 631
199 747
227 764
171 875
268 896
282 943
300 819
338 638
490 822
199 710
371 605
480 870
109 834
444 792
297 602
226 884
458 694
387 848
483 795
498 573
17 590
451 611
135 588
263 769
381 616
231 751
320 901
443 973
492 761
375 747
57 957
336 506
46 862
382 982
115 763
461 746
205 675
264 969
454 775
258 857
220 867
493 973
199 695
242 585
3 590
10 907
27 765
424 901
297 833
232 768
360 930
499 594
208 530
341 845
291 962
220 540
287 727
273 870
482 622
119 548
193 773
440 801
422 953
329 803
457 583
123 865
306 699
319 803
478 617
273 845
365 670
310 513
225 646
55 829
495 617
97 815
83 566
257 694
455 884
232 750
142 941
425 559
4 621
401 555
151 963
368 897
194 633
82 844
146 952
73 641
38 688
391 711
106 819
319 548
429 634
233 979
167 817
331 501
342 678
125 677
295 671
408 952
339 880
62 845
252 634
256 798
475 868
356 889
225 779
217 598
417 619
333 905
159 957
37 983
329 552
123 862
321 971
23 872
147 858
387 627
281 879
251 895
127 753
234 863
42 991
475 897
493 508
48 812
89 971
219 814
239 733
485 518
414 918
33 644
186 946
442 768
377 763
422 699
388 595
403 635
272 885
285 628
254 737
353 528
484 891
373 756
84 580
260 732
349 705
341 598
217 538
260 874
391 533
72 922
142 756
428 895
235 508
113 657
178 516
342 937
216 572
57 525
106 768
440 679
434 940
290 859
489 921
59 946
68 734
128 877
253 521
463 580
465 795
468 725
175 697
100 982
202 718
259 544
257 564
244 752
114 731
398 841
413 667
378 504
11 737
