362122 417700 449
673181 551853 509
231025 269458 407
237118 525748 470
45967 649742 509
610616 375480 470
233396 242011 381
162286 806842 509
705284 133252 509
829768 179100 509
55227 142755 375
600915 758215 509
48359 140025 354
933139 661860 525
531280 737573 509
231234 181780 443
689779 770681 504
82726 524016 470
149802 804970 509
949158 294624 525
632882 140419 509
225123 234156 443
519434 32191 470
497564 408910 449
717100 453080 509
677569 586832 509
359294 42433 443
319417 730875 509
369064 371169 392
23131 375888 443
651894 396327 509
720143 996852 525
228584 812705 509
499624 520114 470
840538 726488 525
567174 718200 509
771057 745910 468
545667 862027 525
169229 278213 443
322107 851496 525
483315 228810 449
338933 681287 509
817494 524135 509
78826 800142 509
293404 984072 525
53524 466781 449
956236 629104 525
39482 115100 354
267437 246134 407
305386 929477 525
110168 826103 509
742185 761866 424
34331 8020 311
531084 507341 470
588399 785600 509
805544 978970 525
283095 531739 470
134637 752727 509
303650 896655 525
717367 252138 509
90078 450265 449
177623 799061 509
440879 462788 444
816119 373602 509
158016 512057 470
339807 467321 449
985421 185145 525
809054 630678 504
185810 329742 443
844448 964006 507
152677 102126 375
631948 881060 525
275310 749373 509
8311 451884 449
293049 591297 470
62161 95187 351
353180 989385 525
678431 912966 525
224075 982203 525
765510 295376 509
126637 83764 354
99472 350276 443
816215 612591 509
538372 208379 470
98844 302955 443
138325 158017 383
104675 736139 509
926753 599020 525
765800 917872 525
344493 759897 509
9383 453208 449
573338 834610 509
71280 183637 383
827140 211152 509
263237 586340 470
977125 999209 440
280523 307074 389
218175 271783 443
254686 41280 443
433603 810753 509
956758 500975 525
899208 257390 525
684424 297877 509
4023 156838 383
849843 749185 525
661303 178220 509
743458 267305 509
910127 968929 507
522224 361936 470
486746 568661 470
630576 923009 525
622614 395958 470
956519 264750 525
915344 431002 525
755739 307812 509
415700 226964 449
328352 792715 509
655559 441302 509
529652 236533 470
104984 527328 470
342516 627658 509
931842 316498 525
760511 361365 509
109029 328107 443
874442 749968 525
711892 546623 509
904057 86990 525
941880 906867 507
216834 433153 449
656157 180125 509
423859 730497 509
482182 696555 509
852139 61328 525
477705 485837 413
909539 906700 370
464848 396758 449
969293 207545 525
70166 628474 509
951576 827335 525
937666 59347 525
662558 730011 504
983018 701845 525
513941 240914 470
595304 547302 434
504465 65931 449
828505 45492 509
724212 567681 509
228232 451714 449
520947 618746 452
6427 385556 443
414279 999681 525
781998 983377 525
316279 69592 443
831490 269838 509
655627 186745 509
344547 30290 443
174198 618577 470
306957 934623 525
755770 484059 509
309094 23594 443
784508 984929 525
770731 99620 509
805731 212316 509
932463 608286 525
848582 129644 525
323359 562983 470
627298 386787 509
979771 646252 525
442012 800330 509
497815 834682 509
211608 293391 443
576857 661808 509
168664 678076 509
401108 761565 509
940841 1032 525
989400 327504 525
772578 188120 509
705481 335672 509
124770 452554 449
801479 952553 525
347819 212845 443
678213 957897 525
339406 374971 441
380457 646506 509
208371 548818 470
220469 635334 509
94279 234398 443
759233 242613 509
510333 472694 426
118133 476350 449
884319 668840 525
170991 515355 470
558680 246565 470
124741 370166 443
616694 817800 509
955441 41020 525
334989 512476 470
222898 593678 470
857974 712629 525
792041 918416 525
355730 769728 509
508239 642155 509
552486 973146 525
283546 93034 443
39492 262348 443
8439 566593 470
