<svg aria-hidden="true" style="position: absolute; width: 0; height: 0; overflow: hidden;" version="1.1" xmlns="http://www.w3.org/2000/svg" xmlns:xlink="http://www.w3.org/1999/xlink">
    <defs>
        <symbol id="icon-cart" viewBox="0 0 32 32">
            <path d="M29.227 9.667v0.173l-1.947 7.2c-0.23 0.855-0.737 1.609-1.442 2.144s-1.567 0.822-2.452 0.816h-10.2c-1.001 0.004-1.968-0.368-2.708-1.042s-1.202-1.601-1.292-2.598l-0.867-9.813c-0.030-0.332-0.184-0.641-0.431-0.866s-0.569-0.349-0.903-0.347h-2.893c-0.354 0-0.693-0.14-0.943-0.391s-0.391-0.589-0.391-0.943c0-0.354 0.14-0.693 0.391-0.943s0.589-0.391 0.943-0.391h2.893c1.001-0.004 1.968 0.368 2.708 1.042s1.201 1.601 1.292 2.598v0.36h15.587c0.38-0.003 0.756 0.075 1.104 0.23s0.658 0.381 0.91 0.665c0.253 0.284 0.441 0.619 0.554 0.982s0.146 0.746 0.099 1.123h-0.013z"></path>
            <path d="M12.093 29.333c1.841 0 3.333-1.492 3.333-3.333s-1.492-3.333-3.333-3.333-3.333 1.492-3.333 3.333c0 1.841 1.492 3.333 3.333 3.333z"></path>
            <path d="M22.76 29.333c1.841 0 3.333-1.492 3.333-3.333s-1.492-3.333-3.333-3.333-3.333 1.492-3.333 3.333c0 1.841 1.492 3.333 3.333 3.333z"></path>
            <path d="M18.55 16.934c-0.592 0-1.099-0.152-1.522-0.456s-0.747-0.723-0.974-1.258c-0.224-0.534-0.336-1.147-0.336-1.838s0.12-1.294 0.36-1.81c0.24-0.515 0.573-0.915 0.998-1.2s0.917-0.427 1.474-0.427c0.57 0 1.066 0.142 1.488 0.427 0.426 0.285 0.755 0.685 0.989 1.2 0.237 0.515 0.355 1.118 0.355 1.81s-0.112 1.304-0.336 1.838c-0.224 0.534-0.547 0.954-0.97 1.258s-0.931 0.456-1.526 0.456zM18.55 16.109c0.397 0 0.733-0.106 1.008-0.317 0.278-0.211 0.49-0.52 0.634-0.926 0.147-0.406 0.221-0.901 0.221-1.483 0-0.874-0.17-1.526-0.509-1.958-0.336-0.435-0.787-0.653-1.354-0.653-0.538 0-0.982 0.218-1.334 0.653-0.352 0.432-0.528 1.085-0.528 1.958 0 0.582 0.072 1.077 0.216 1.483 0.147 0.406 0.358 0.715 0.634 0.926 0.278 0.211 0.616 0.317 1.013 0.317z"></path>
        </symbol>
        <symbol id="icon-chat" viewBox="0 0 32 32">
            <path d="M23.227 27.596c-0.132 0-0.262-0.028-0.381-0.082s-0.227-0.134-0.313-0.233l-2.95-3.37c-1.188 0.306-2.409 0.46-3.636 0.458-3.27 0-6.356-1.065-8.685-2.994-2.377-1.969-3.687-4.606-3.687-7.421s1.312-5.45 3.687-7.42c2.329-1.929 5.415-2.992 8.685-2.992s6.356 1.063 8.683 2.992c2.377 1.969 3.686 4.606 3.686 7.42 0 3.004-1.512 5.822-4.166 7.798v4.923c0 0.245-0.097 0.48-0.27 0.653s-0.408 0.27-0.653 0.27v-0.002zM19.893 21.942c0.132 0 0.262 0.028 0.381 0.082s0.227 0.134 0.313 0.233l1.716 1.96v-2.939c0-0.15 0.037-0.298 0.108-0.431s0.172-0.247 0.297-0.331c2.393-1.636 3.764-4.028 3.764-6.561 0-4.723-4.721-8.566-10.523-8.566s-10.523 3.843-10.523 8.566c0 4.723 4.718 8.569 10.521 8.569 1.246 0.003 2.485-0.179 3.678-0.539 0.087-0.027 0.178-0.041 0.269-0.042z"></path>
            <path d="M12.646 16.492c-0.030 0-0.062 0-0.090-0.004s-0.062-0.008-0.090-0.014c-0.028-0.006-0.062-0.014-0.087-0.022s-0.058-0.019-0.086-0.031c-0.028-0.012-0.055-0.025-0.081-0.039s-0.053-0.029-0.078-0.046c-0.025-0.017-0.049-0.034-0.073-0.054s-0.046-0.040-0.068-0.062c-0.022-0.022-0.042-0.044-0.062-0.068s-0.037-0.048-0.054-0.073c-0.017-0.025-0.032-0.051-0.046-0.078s-0.027-0.054-0.039-0.081c-0.011-0.028-0.022-0.056-0.030-0.085s-0.017-0.058-0.022-0.088c-0.006-0.029-0.011-0.059-0.014-0.089s-0.005-0.061-0.005-0.091c0-0.030 0.002-0.060 0.005-0.090 0.006-0.060 0.018-0.12 0.036-0.178 0.009-0.029 0.019-0.057 0.030-0.085s0.025-0.055 0.039-0.081c0.014-0.027 0.029-0.053 0.046-0.078s0.034-0.049 0.054-0.073 0.040-0.046 0.062-0.068c0.022-0.022 0.044-0.042 0.068-0.062s0.048-0.037 0.073-0.054c0.025-0.017 0.051-0.032 0.078-0.046s0.054-0.027 0.081-0.039c0.028-0.012 0.056-0.022 0.086-0.031s0.058-0.016 0.087-0.022 0.062-0.010 0.090-0.014c0.060-0.006 0.121-0.006 0.182 0 0.030 0.003 0.062 0.008 0.089 0.014s0.062 0.014 0.088 0.022c0.029 0.009 0.057 0.019 0.085 0.031s0.055 0.025 0.082 0.039c0.027 0.014 0.053 0.029 0.078 0.046s0.049 0.035 0.073 0.054c0.023 0.019 0.046 0.040 0.068 0.062s0.042 0.044 0.062 0.068c0.020 0.023 0.037 0.048 0.054 0.073s0.032 0.051 0.046 0.078c0.014 0.027 0.027 0.054 0.039 0.081s0.022 0.057 0.031 0.085 0.016 0.062 0.022 0.088c0.012 0.059 0.018 0.12 0.018 0.18 0 0.030-0.001 0.061-0.004 0.091s-0.008 0.060-0.014 0.089c-0.006 0.030-0.014 0.062-0.022 0.088s-0.019 0.057-0.031 0.085c-0.012 0.028-0.025 0.055-0.039 0.081s-0.029 0.053-0.046 0.078c-0.017 0.025-0.034 0.049-0.054 0.073s-0.040 0.046-0.062 0.068c-0.022 0.022-0.044 0.042-0.068 0.062s-0.047 0.037-0.073 0.054c-0.025 0.016-0.051 0.032-0.078 0.046s-0.054 0.027-0.082 0.039-0.057 0.022-0.085 0.031c-0.028 0.009-0.058 0.016-0.088 0.022s-0.062 0.010-0.089 0.014c-0.028 0.003-0.060 0.004-0.091 0.004z"></path>
            <path d="M19.477 16.492c-0.030 0-0.060-0.001-0.090-0.004s-0.062-0.008-0.090-0.014-0.062-0.014-0.087-0.022c-0.026-0.009-0.057-0.019-0.085-0.031s-0.055-0.025-0.082-0.039c-0.053-0.028-0.103-0.062-0.15-0.1-0.023-0.019-0.046-0.040-0.067-0.062s-0.042-0.044-0.062-0.068c-0.019-0.023-0.038-0.048-0.054-0.073s-0.032-0.051-0.046-0.078c-0.014-0.027-0.027-0.054-0.039-0.081s-0.022-0.057-0.030-0.085c-0.009-0.029-0.017-0.058-0.022-0.088-0.012-0.059-0.018-0.12-0.018-0.18 0-0.030 0.002-0.061 0.005-0.091s0.008-0.060 0.014-0.089c0.006-0.030 0.013-0.059 0.022-0.088s0.019-0.057 0.030-0.085 0.025-0.055 0.039-0.081c0.014-0.027 0.029-0.053 0.046-0.078s0.035-0.049 0.054-0.073c0.019-0.024 0.040-0.046 0.062-0.068s0.044-0.042 0.067-0.062c0.047-0.038 0.097-0.071 0.151-0.1 0.026-0.014 0.054-0.027 0.082-0.039s0.056-0.022 0.085-0.031c0.029-0.009 0.058-0.016 0.087-0.022s0.062-0.010 0.090-0.014c0.061-0.006 0.123-0.006 0.185 0 0.030 0.003 0.062 0.008 0.089 0.014s0.062 0.014 0.088 0.022c0.026 0.009 0.057 0.019 0.085 0.031s0.055 0.025 0.082 0.039c0.026 0.014 0.052 0.030 0.078 0.046s0.049 0.034 0.073 0.054c0.023 0.019 0.046 0.040 0.068 0.062s0.042 0.044 0.062 0.068c0.020 0.023 0.037 0.048 0.054 0.073s0.032 0.051 0.047 0.078c0.014 0.026 0.027 0.054 0.038 0.081s0.022 0.056 0.031 0.085c0.009 0.029 0.016 0.062 0.022 0.088s0.010 0.062 0.014 0.089c0.003 0.030 0.004 0.061 0.004 0.091s-0.001 0.060-0.004 0.090c-0.003 0.030-0.008 0.062-0.014 0.090s-0.014 0.062-0.022 0.088c-0.009 0.029-0.019 0.057-0.031 0.085s-0.025 0.055-0.038 0.081c-0.014 0.027-0.030 0.053-0.047 0.078s-0.034 0.049-0.054 0.073-0.040 0.046-0.062 0.068c-0.022 0.022-0.044 0.042-0.068 0.062s-0.047 0.037-0.073 0.054c-0.025 0.016-0.051 0.032-0.078 0.046s-0.054 0.027-0.082 0.039-0.057 0.022-0.085 0.031c-0.028 0.009-0.058 0.016-0.088 0.022s-0.062 0.010-0.089 0.014c-0.031 0.003-0.063 0.005-0.095 0.004z"></path>
            <path d="M16.062 16.492c-0.245-0.001-0.479-0.098-0.653-0.27-0.022-0.021-0.042-0.044-0.062-0.068s-0.037-0.048-0.054-0.073-0.032-0.051-0.046-0.078c-0.014-0.026-0.027-0.053-0.038-0.081s-0.022-0.056-0.031-0.085c-0.009-0.029-0.016-0.062-0.022-0.088-0.006-0.029-0.011-0.059-0.014-0.089-0.006-0.061-0.006-0.123 0-0.185 0.003-0.030 0.008-0.060 0.014-0.089s0.014-0.062 0.022-0.088c0.009-0.029 0.019-0.057 0.031-0.085s0.024-0.055 0.038-0.081c0.014-0.027 0.030-0.053 0.046-0.078s0.035-0.049 0.054-0.073c0.019-0.024 0.040-0.046 0.062-0.068 0.097-0.096 0.214-0.17 0.342-0.216s0.265-0.063 0.401-0.050c0.030 0.003 0.062 0.008 0.090 0.014s0.058 0.014 0.087 0.022c0.029 0.009 0.057 0.019 0.085 0.031s0.055 0.025 0.082 0.039c0.053 0.028 0.104 0.062 0.151 0.1 0.023 0.019 0.046 0.040 0.067 0.062s0.042 0.044 0.062 0.068c0.019 0.023 0.038 0.048 0.054 0.073s0.032 0.051 0.046 0.078c0.014 0.027 0.027 0.054 0.039 0.081s0.022 0.057 0.030 0.085c0.009 0.029 0.017 0.058 0.022 0.088s0.011 0.059 0.014 0.089c0.007 0.061 0.007 0.123 0 0.185-0.003 0.030-0.008 0.060-0.014 0.089s-0.013 0.059-0.022 0.088c-0.009 0.028-0.019 0.057-0.030 0.085s-0.025 0.055-0.039 0.081c-0.014 0.027-0.029 0.053-0.046 0.078s-0.035 0.049-0.054 0.073c-0.019 0.024-0.040 0.046-0.062 0.068s-0.044 0.041-0.067 0.062c-0.047 0.038-0.097 0.071-0.151 0.1-0.026 0.014-0.054 0.027-0.082 0.039s-0.056 0.022-0.085 0.031c-0.029 0.009-0.062 0.016-0.087 0.022s-0.062 0.010-0.090 0.014c-0.030 0.003-0.060 0.004-0.090 0.003z"></path>
        </symbol>
    </defs>
</svg>
