
./tezos-client --wait none originate sc rollup from bootstrap1 of kind arith of type string booting with  --burn-cap 9999999
Node is bootstrapped.
Estimated gas: 3110.449 units (will add 100 for safety)
Estimated storage: 6655 bytes added (will add 20 for safety)
Operation successfully injected in the node.
Operation hash is '[OPERATION_HASH]'
NOT waiting for the operation to be included.
Use command
  tezos-client wait for [OPERATION_HASH] to be included --confirmations 1 --branch [BLOCK_HASH]
and/or an external block explorer to make sure that it has been included.
This sequence of operations was run:
  Manager signed operations:
    From: [PUBLIC_KEY_HASH]
    Fee to the baker: ꜩ0.000674
    Expected counter: 1
    Gas limit: 3211
    Storage limit: 6675 bytes
    Balance updates:
      [PUBLIC_KEY_HASH] ... -ꜩ0.000674
      payload fees(the block proposer) ....... +ꜩ0.000674
    Smart contract rollup origination:
      Kind: arith
      Parameter type: string
      Boot sector: ''
      This smart contract rollup origination was successfully applied
      Consumed gas: 3110.449
      Storage size: 6655 bytes
      Address: [SC_ROLLUP_HASH]
      Genesis commitment hash: [SC_ROLLUP_COMMITMENT_HASH]
      Balance updates:
        [PUBLIC_KEY_HASH] ... -ꜩ1.66375
        storage fees ........................... +ꜩ1.66375


./tezos-client --wait none publish commitment from '[PUBLIC_KEY_HASH]' for sc rollup '[SC_ROLLUP_HASH]' with compressed state scs11VNjWyZw4Tgbvsom8epQbox86S2CKkE1UAZkXMM7Pj8MQMLzMf at inbox level 32 and predecessor '[SC_ROLLUP_COMMITMENT_HASH]' and number of ticks 1
Node is bootstrapped.
Estimated gas: 5781.719 units (will add 100 for safety)
Estimated storage: no bytes added
Operation successfully injected in the node.
Operation hash is '[OPERATION_HASH]'
NOT waiting for the operation to be included.
Use command
  tezos-client wait for [OPERATION_HASH] to be included --confirmations 1 --branch [BLOCK_HASH]
and/or an external block explorer to make sure that it has been included.
This sequence of operations was run:
  Manager signed operations:
    From: [PUBLIC_KEY_HASH]
    Fee to the baker: ꜩ0.00093
    Expected counter: 2
    Gas limit: 5882
    Storage limit: 0 bytes
    Balance updates:
      [PUBLIC_KEY_HASH] ... -ꜩ0.00093
      payload fees(the block proposer) ....... +ꜩ0.00093
    Smart contract rollup commitment publishing:
      Address: [SC_ROLLUP_HASH]
      Commitment:
        compressed_state: scs11VNjWyZw4Tgbvsom8epQbox86S2CKkE1UAZkXMM7Pj8MQMLzMf
        inbox_level: 32
        predecessor: [SC_ROLLUP_COMMITMENT_HASH]
        number_of_ticks: 1
      This smart contract rollup commitment publishing was successfully applied
      Consumed gas: 5781.719
      Hash of commit: [SC_ROLLUP_COMMITMENT_HASH]
      Commitment published at level: 3
      Balance updates:
        [PUBLIC_KEY_HASH] ....................................................... -ꜩ10000
        Frozen_bonds([PUBLIC_KEY_HASH],[SC_ROLLUP_HASH]) ... +ꜩ10000


./tezos-client --wait none publish commitment from '[PUBLIC_KEY_HASH]' for sc rollup '[SC_ROLLUP_HASH]' with compressed state scs11VNjWyZw4Tgbvsom8epQbox86S2CKkE1UAZkXMM7Pj8MQMLzMf at inbox level 62 and predecessor '[SC_ROLLUP_COMMITMENT_HASH]' and number of ticks 1
Node is bootstrapped.
Estimated gas: 4245.547 units (will add 100 for safety)
Estimated storage: no bytes added
Operation successfully injected in the node.
Operation hash is '[OPERATION_HASH]'
NOT waiting for the operation to be included.
Use command
  tezos-client wait for [OPERATION_HASH] to be included --confirmations 1 --branch [BLOCK_HASH]
and/or an external block explorer to make sure that it has been included.
This sequence of operations was run:
  Manager signed operations:
    From: [PUBLIC_KEY_HASH]
    Fee to the baker: ꜩ0.000776
    Expected counter: 3
    Gas limit: 4346
    Storage limit: 0 bytes
    Balance updates:
      [PUBLIC_KEY_HASH] ... -ꜩ0.000776
      payload fees(the block proposer) ....... +ꜩ0.000776
    Smart contract rollup commitment publishing:
      Address: [SC_ROLLUP_HASH]
      Commitment:
        compressed_state: scs11VNjWyZw4Tgbvsom8epQbox86S2CKkE1UAZkXMM7Pj8MQMLzMf
        inbox_level: 62
        predecessor: [SC_ROLLUP_COMMITMENT_HASH]
        number_of_ticks: 1
      This smart contract rollup commitment publishing was successfully applied
      Consumed gas: 4245.547
      Hash of commit: [SC_ROLLUP_COMMITMENT_HASH]
      Commitment published at level: 4

