[
  {
    "file": "test_logging.ml",
    "title": "alpha: conditionals",
    "tags": [
      "regression",
      "protocol",
      "regression",
      "logging"
    ],
    "successful_runs": {
      "total_time": "28103",
      "count": "1"
    },
    "failed_runs": {
      "total_time": "0",
      "count": "0"
    }
  },
  {
    "file": "test_logging.ml",
    "title": "alpha: insertion_sort",
    "tags": [
      "regression",
      "protocol",
      "regression",
      "logging"
    ],
    "successful_runs": {
      "total_time": "177932",
      "count": "1"
    },
    "failed_runs": {
      "total_time": "0",
      "count": "0"
    }
  },
  {
    "file": "test_logging.ml",
    "title": "alpha: spawn_identities",
    "tags": [
      "regression",
      "protocol",
      "regression",
      "logging"
    ],
    "successful_runs": {
      "total_time": "113729",
      "count": "1"
    },
    "failed_runs": {
      "total_time": "0",
      "count": "0"
    }
  },
  {
    "file": "test_logging.ml",
    "title": "014_PtKathma: comb-set",
    "tags": [
      "regression",
      "protocol",
      "regression",
      "logging"
    ],
    "successful_runs": {
      "total_time": "30038",
      "count": "1"
    },
    "failed_runs": {
      "total_time": "0",
      "count": "0"
    }
  },
  {
    "file": "test_logging.ml",
    "title": "014_PtKathma: get_and_update_map",
    "tags": [
      "regression",
      "protocol",
      "regression",
      "logging"
    ],
    "successful_runs": {
      "total_time": "22198",
      "count": "1"
    },
    "failed_runs": {
      "total_time": "0",
      "count": "0"
    }
  },
  {
    "file": "test_logging.ml",
    "title": "014_PtKathma: set_delegate",
    "tags": [
      "regression",
      "protocol",
      "regression",
      "logging"
    ],
    "successful_runs": {
      "total_time": "19936",
      "count": "1"
    },
    "failed_runs": {
      "total_time": "0",
      "count": "0"
    }
  },
  {
    "file": "vdf_test.ml",
    "title": "Alpha: VDF daemon",
    "tags": [
      "alpha",
      "vdf"
    ],
    "successful_runs": {
      "total_time": "196851197",
      "count": "1"
    },
    "failed_runs": {
      "total_time": "0",
      "count": "0"
    }
  },
  {
    "file": "client_commands.ml",
    "title": "Kathmandu: Transfer from public key hash alias",
    "tags": [
      "kathmandu",
      "client",
      "alias",
      "transfer"
    ],
    "successful_runs": {
      "total_time": "22111247",
      "count": "1"
    },
    "failed_runs": {
      "total_time": "0",
      "count": "0"
    }
  },
  {
    "file": "bootstrap.ml",
    "title": "Alpha: node synchronization (archive / rolling)",
    "tags": [
      "alpha",
      "bootstrap",
      "node",
      "sync",
      "activate",
      "bake",
      "primary_archive",
      "secondary_rolling"
    ],
    "successful_runs": {
      "total_time": "53735307",
      "count": "1"
    },
    "failed_runs": {
      "total_time": "0",
      "count": "0"
    }
  },
  {
    "file": "bootstrap.ml",
    "title": "Alpha: node synchronization (rolling_0 / archive)",
    "tags": [
      "alpha",
      "bootstrap",
      "node",
      "sync",
      "activate",
      "bake",
      "primary_rolling_0",
      "secondary_archive"
    ],
    "successful_runs": {
      "total_time": "55387721",
      "count": "1"
    },
    "failed_runs": {
      "total_time": "0",
      "count": "0"
    }
  },
  {
    "file": "hash_data.ml",
    "title": "Alpha: hash data ... of type ... (bad)",
    "tags": [
      "regression",
      "alpha",
      "hash",
      "data",
      "mockup"
    ],
    "successful_runs": {
      "total_time": "8248131",
      "count": "1"
    },
    "failed_runs": {
      "total_time": "0",
      "count": "0"
    }
  },
  {
    "file": "light.ml",
    "title": "Alpha: (Light) Wrong proto",
    "tags": [
      "alpha",
      "light",
      "proto"
    ],
    "successful_runs": {
      "total_time": "13231753",
      "count": "1"
    },
    "failed_runs": {
      "total_time": "0",
      "count": "0"
    }
  },
  {
    "file": "mockup.ml",
    "title": "Ithaca: (Mockup) RPC list",
    "tags": [
      "ithaca",
      "mockup",
      "client",
      "rpc"
    ],
    "successful_runs": {
      "total_time": "29807693",
      "count": "1"
    },
    "failed_runs": {
      "total_time": "0",
      "count": "0"
    }
  },
  {
    "file": "mockup.ml",
    "title": "Kathmandu: (Mockup) Same transfer twice (asynchronous)",
    "tags": [
      "kathmandu",
      "mockup",
      "client",
      "transfer",
      "asynchronous"
    ],
    "successful_runs": {
      "total_time": "3816952",
      "count": "1"
    },
    "failed_runs": {
      "total_time": "0",
      "count": "0"
    }
  },
  {
    "file": "mockup.ml",
    "title": "Ithaca: (Mockup) Transfer",
    "tags": [
      "ithaca",
      "mockup",
      "client",
      "transfer"
    ],
    "successful_runs": {
      "total_time": "7435889",
      "count": "1"
    },
    "failed_runs": {
      "total_time": "0",
      "count": "0"
    }
  },
  {
    "file": "mockup.ml",
    "title": "Alpha: (Mockup) Transfer (asynchronous)",
    "tags": [
      "alpha",
      "mockup",
      "client",
      "transfer",
      "asynchronous"
    ],
    "successful_runs": {
      "total_time": "3748339",
      "count": "1"
    },
    "failed_runs": {
      "total_time": "0",
      "count": "0"
    }
  },
  {
    "file": "mockup.ml",
    "title": "Alpha: (Mockup) Register Global Constant success",
    "tags": [
      "alpha",
      "mockup",
      "client",
      "global_constant"
    ],
    "successful_runs": {
      "total_time": "2571700",
      "count": "1"
    },
    "failed_runs": {
      "total_time": "0",
      "count": "0"
    }
  },
  {
    "file": "mockup.ml",
    "title": "Alpha: (Mockup) Register Global Constant failure",
    "tags": [
      "alpha",
      "mockup",
      "client",
      "global_constant"
    ],
    "successful_runs": {
      "total_time": "2398245",
      "count": "1"
    },
    "failed_runs": {
      "total_time": "0",
      "count": "0"
    }
  },
  {
    "file": "mockup.ml",
    "title": "Alpha: (Mockup) Originate Contract with Global Constant success",
    "tags": [
      "alpha",
      "mockup",
      "client",
      "global_constant"
    ],
    "successful_runs": {
      "total_time": "3676805",
      "count": "1"
    },
    "failed_runs": {
      "total_time": "0",
      "count": "0"
    }
  },
  {
    "file": "proxy.ml",
    "title": "Jakarta: (Proxy) Transfer",
    "tags": [
      "jakarta",
      "proxy",
      "transfer"
    ],
    "successful_runs": {
      "total_time": "12327533",
      "count": "1"
    },
    "failed_runs": {
      "total_time": "0",
      "count": "0"
    }
  },
  {
    "file": "proxy.ml",
    "title": "Ithaca: (Proxy) Transfer",
    "tags": [
      "ithaca",
      "proxy",
      "transfer"
    ],
    "successful_runs": {
      "total_time": "12514796",
      "count": "1"
    },
    "failed_runs": {
      "total_time": "0",
      "count": "0"
    }
  },
  {
    "file": "proxy.ml",
    "title": "Alpha: (Proxy) (/chains/main/blocks/head/votes/listings) No useless RPC call",
    "tags": [
      "alpha",
      "proxy",
      "rpc",
      "get"
    ],
    "successful_runs": {
      "total_time": "8663447",
      "count": "1"
    },
    "failed_runs": {
      "total_time": "0",
      "count": "0"
    }
  },
  {
    "file": "proxy.ml",
    "title": "Kathmandu: (Proxy) (/chains/main/blocks/head/context/contracts) No useless RPC call",
    "tags": [
      "kathmandu",
      "proxy",
      "rpc",
      "get"
    ],
    "successful_runs": {
      "total_time": "8278789",
      "count": "1"
    },
    "failed_runs": {
      "total_time": "0",
      "count": "0"
    }
  },
  {
    "file": "proxy.ml",
    "title": "Kathmandu: (Proxy) (/chains/main/blocks/head/votes/current_period) No useless RPC call",
    "tags": [
      "kathmandu",
      "proxy",
      "rpc",
      "get"
    ],
    "successful_runs": {
      "total_time": "8363394",
      "count": "1"
    },
    "failed_runs": {
      "total_time": "0",
      "count": "0"
    }
  },
  {
    "file": "proxy.ml",
    "title": "Jakarta: (Proxy) (/chains/main/blocks/head/context/delegates) No useless RPC call",
    "tags": [
      "jakarta",
      "proxy",
      "rpc",
      "get"
    ],
    "successful_runs": {
      "total_time": "8382605",
      "count": "1"
    },
    "failed_runs": {
      "total_time": "0",
      "count": "0"
    }
  },
  {
    "file": "proxy.ml",
    "title": "Jakarta: (Proxy) (/chains/main/blocks/head/votes/total_voting_power) No useless RPC call",
    "tags": [
      "jakarta",
      "proxy",
      "rpc",
      "get"
    ],
    "successful_runs": {
      "total_time": "8720309",
      "count": "1"
    },
    "failed_runs": {
      "total_time": "0",
      "count": "0"
    }
  },
  {
    "file": "proxy.ml",
    "title": "Jakarta: (Proxy) (/chains/main/blocks/head/votes/listings) No useless RPC call",
    "tags": [
      "jakarta",
      "proxy",
      "rpc",
      "get"
    ],
    "successful_runs": {
      "total_time": "8405591",
      "count": "1"
    },
    "failed_runs": {
      "total_time": "0",
      "count": "0"
    }
  },
  {
    "file": "proxy.ml",
    "title": "Ithaca: (Proxy) (/chains/main/blocks/head/helpers/baking_rights?all=true) No useless RPC call",
    "tags": [
      "ithaca",
      "proxy",
      "rpc",
      "get"
    ],
    "successful_runs": {
      "total_time": "8803442",
      "count": "1"
    },
    "failed_runs": {
      "total_time": "0",
      "count": "0"
    }
  },
  {
    "file": "proxy.ml",
    "title": "Ithaca: (Proxy) (/chains/main/blocks/head/votes/successor_period) No useless RPC call",
    "tags": [
      "ithaca",
      "proxy",
      "rpc",
      "get"
    ],
    "successful_runs": {
      "total_time": "8318506",
      "count": "1"
    },
    "failed_runs": {
      "total_time": "0",
      "count": "0"
    }
  },
  {
    "file": "proxy.ml",
    "title": "Kathmandu: (Proxy) (/chains/main/blocks/head/helpers/current_level) Cache at most once",
    "tags": [
      "kathmandu",
      "proxy",
      "rpc",
      "get"
    ],
    "successful_runs": {
      "total_time": "8311158",
      "count": "1"
    },
    "failed_runs": {
      "total_time": "0",
      "count": "0"
    }
  },
  {
    "file": "proxy.ml",
    "title": "Jakarta: (Proxy) (/chains/main/blocks/head/context/constants/errors) Cache at most once",
    "tags": [
      "jakarta",
      "proxy",
      "rpc",
      "get"
    ],
    "successful_runs": {
      "total_time": "8577681",
      "count": "1"
    },
    "failed_runs": {
      "total_time": "0",
      "count": "0"
    }
  },
  {
    "file": "proxy.ml",
    "title": "Alpha: (Proxy) (/chains/main/blocks/head/context/delegates) Cache at most once",
    "tags": [
      "alpha",
      "proxy",
      "rpc",
      "get"
    ],
    "successful_runs": {
      "total_time": "8272838",
      "count": "1"
    },
    "failed_runs": {
      "total_time": "0",
      "count": "0"
    }
  },
  {
    "file": "proxy.ml",
    "title": "Ithaca: (Proxy) (/chains/main/blocks/head/context/nonces/3) Cache at most once",
    "tags": [
      "ithaca",
      "proxy",
      "rpc",
      "get"
    ],
    "successful_runs": {
      "total_time": "8329826",
      "count": "1"
    },
    "failed_runs": {
      "total_time": "0",
      "count": "0"
    }
  },
  {
    "file": "proxy.ml",
    "title": "Kathmandu: (Proxy) (/chains/main/blocks/head/votes/successor_period) Cache at most once",
    "tags": [
      "kathmandu",
      "proxy",
      "rpc",
      "get"
    ],
    "successful_runs": {
      "total_time": "8383343",
      "count": "1"
    },
    "failed_runs": {
      "total_time": "0",
      "count": "0"
    }
  },
  {
    "file": "proxy.ml",
    "title": "Ithaca: (Proxy) (/chains/main/blocks/head/votes/ballot_list) Cache at most once",
    "tags": [
      "ithaca",
      "proxy",
      "rpc",
      "get"
    ],
    "successful_runs": {
      "total_time": "8359148",
      "count": "1"
    },
    "failed_runs": {
      "total_time": "0",
      "count": "0"
    }
  },
  {
    "file": "proxy.ml",
    "title": "Alpha: (Proxy) (/chains/main/blocks/head/votes/listings) Cache at most once",
    "tags": [
      "alpha",
      "proxy",
      "rpc",
      "get"
    ],
    "successful_runs": {
      "total_time": "8388591",
      "count": "1"
    },
    "failed_runs": {
      "total_time": "0",
      "count": "0"
    }
  },
  {
    "file": "proxy.ml",
    "title": "Kathmandu: (Proxy) split_key heuristic",
    "tags": [
      "kathmandu",
      "proxy",
      "rpc",
      "get"
    ],
    "successful_runs": {
      "total_time": "25265111",
      "count": "1"
    },
    "failed_runs": {
      "total_time": "0",
      "count": "0"
    }
  },
  {
    "file": "protocol_migration.ml",
    "title": "protocol migration at level 11",
    "tags": [
      "protocol",
      "migration",
      "sandbox"
    ],
    "successful_runs": {
      "total_time": "15941637",
      "count": "1"
    },
    "failed_runs": {
      "total_time": "0",
      "count": "0"
    }
  },
  {
    "file": "protocol_migration.ml",
    "title": "protocol migration at level 12",
    "tags": [
      "protocol",
      "migration",
      "sandbox"
    ],
    "successful_runs": {
      "total_time": "16172666",
      "count": "1"
    },
    "failed_runs": {
      "total_time": "0",
      "count": "0"
    }
  },
  {
    "file": "cache_cache.ml",
    "title": "Ithaca: cache cache",
    "tags": [
      "ithaca",
      "cache",
      "node",
      "baker"
    ],
    "successful_runs": {
      "total_time": "22942862",
      "count": "1"
    },
    "failed_runs": {
      "total_time": "0",
      "count": "0"
    }
  },
  {
    "file": "baking.ml",
    "title": "Alpha: baking ordering",
    "tags": [
      "alpha",
      "baking",
      "ordering"
    ],
    "successful_runs": {
      "total_time": "22944864",
      "count": "1"
    },
    "failed_runs": {
      "total_time": "0",
      "count": "0"
    }
  },
  {
    "file": "baking.ml",
    "title": "Alpha: ensure we can still bake with a faulty operation",
    "tags": [
      "alpha",
      "baking",
      "exception"
    ],
    "successful_runs": {
      "total_time": "19571671",
      "count": "1"
    },
    "failed_runs": {
      "total_time": "0",
      "count": "0"
    }
  },
  {
    "file": "prevalidator.ml",
    "title": "Ithaca: Manager_restriction_injection",
    "tags": [
      "ithaca",
      "mempool",
      "manager_restriction",
      "injection"
    ],
    "successful_runs": {
      "total_time": "28032781",
      "count": "1"
    },
    "failed_runs": {
      "total_time": "0",
      "count": "0"
    }
  },
  {
    "file": "prevalidator.ml",
    "title": "Jakarta: Manager_restriction_injection",
    "tags": [
      "jakarta",
      "mempool",
      "manager_restriction",
      "injection"
    ],
    "successful_runs": {
      "total_time": "28733691",
      "count": "1"
    },
    "failed_runs": {
      "total_time": "0",
      "count": "0"
    }
  },
  {
    "file": "prevalidator.ml",
    "title": "Alpha: Manager_restriction_injection",
    "tags": [
      "alpha",
      "mempool",
      "manager_restriction",
      "injection"
    ],
    "successful_runs": {
      "total_time": "28858542",
      "count": "1"
    },
    "failed_runs": {
      "total_time": "0",
      "count": "0"
    }
  },
  {
    "file": "prevalidator.ml",
    "title": "Kathmandu: Manager_restriction_propagation",
    "tags": [
      "kathmandu",
      "mempool",
      "manager_restriction",
      "propagation"
    ],
    "successful_runs": {
      "total_time": "36320466",
      "count": "1"
    },
    "failed_runs": {
      "total_time": "0",
      "count": "0"
    }
  },
  {
    "file": "prevalidator.ml",
    "title": "Alpha: Manager_restriction_flush",
    "tags": [
      "alpha",
      "mempool",
      "manager_restriction",
      "flush"
    ],
    "successful_runs": {
      "total_time": "23785781",
      "count": "1"
    },
    "failed_runs": {
      "total_time": "0",
      "count": "0"
    }
  },
  {
    "file": "prevalidator.ml",
    "title": "Alpha: Manager_restriction_flush_on_ban",
    "tags": [
      "alpha",
      "mempool",
      "manager_restriction",
      "flush",
      "ban"
    ],
    "successful_runs": {
      "total_time": "23801563",
      "count": "1"
    },
    "failed_runs": {
      "total_time": "0",
      "count": "0"
    }
  },
  {
    "file": "prevalidator.ml",
    "title": "Jakarta: Max refused operations refused",
    "tags": [
      "jakarta",
      "mempool",
      "refused",
      "max"
    ],
    "successful_runs": {
      "total_time": "38297527",
      "count": "1"
    },
    "failed_runs": {
      "total_time": "0",
      "count": "0"
    }
  },
  {
    "file": "prevalidator.ml",
    "title": "Ithaca: Max refused operations outdated",
    "tags": [
      "ithaca",
      "mempool",
      "refused",
      "max",
      "outdated"
    ],
    "successful_runs": {
      "total_time": "18963806",
      "count": "1"
    },
    "failed_runs": {
      "total_time": "0",
      "count": "0"
    }
  },
  {
    "file": "prevalidator.ml",
    "title": "Kathmandu: mempool unban all operations",
    "tags": [
      "kathmandu",
      "mempool",
      "node",
      "ban"
    ],
    "successful_runs": {
      "total_time": "44842550",
      "count": "1"
    },
    "failed_runs": {
      "total_time": "0",
      "count": "0"
    }
  },
  {
    "file": "prevalidator.ml",
    "title": "Kathmandu: Reclassify branch_delayed operation with wrong signature",
    "tags": [
      "kathmandu",
      "mempool",
      "wrong",
      "signature"
    ],
    "successful_runs": {
      "total_time": "28560075",
      "count": "1"
    },
    "failed_runs": {
      "total_time": "0",
      "count": "0"
    }
  },
  {
    "file": "prevalidator.ml",
    "title": "Alpha: Forge pre-filtered operation and check mempool",
    "tags": [
      "alpha",
      "forge",
      "mempool",
      "pre_filtered"
    ],
    "successful_runs": {
      "total_time": "18476710",
      "count": "1"
    },
    "failed_runs": {
      "total_time": "0",
      "count": "0"
    }
  },
  {
    "file": "prevalidator.ml",
    "title": "Alpha: Test request_operations rpc",
    "tags": [
      "alpha",
      "mempool",
      "request_operations"
    ],
    "successful_runs": {
      "total_time": "16347037",
      "count": "1"
    },
    "failed_runs": {
      "total_time": "0",
      "count": "0"
    }
  },
  {
    "file": "encoding.ml",
    "title": "Alpha: protocol encoding regression test: block_header.raw",
    "tags": [
      "regression",
      "alpha",
      "encoding",
      "protocol"
    ],
    "successful_runs": {
      "total_time": "2239531",
      "count": "1"
    },
    "failed_runs": {
      "total_time": "0",
      "count": "0"
    }
  },
  {
    "file": "encoding.ml",
    "title": "Ithaca: protocol encoding regression test: block_header.raw",
    "tags": [
      "regression",
      "ithaca",
      "encoding",
      "protocol"
    ],
    "successful_runs": {
      "total_time": "1885205",
      "count": "1"
    },
    "failed_runs": {
      "total_time": "0",
      "count": "0"
    }
  },
  {
    "file": "encoding.ml",
    "title": "Kathmandu: protocol encoding regression test: fitness",
    "tags": [
      "regression",
      "kathmandu",
      "encoding",
      "protocol"
    ],
    "successful_runs": {
      "total_time": "1951678",
      "count": "1"
    },
    "failed_runs": {
      "total_time": "0",
      "count": "0"
    }
  },
  {
    "file": "encoding.ml",
    "title": "Jakarta: protocol encoding regression test: fitness",
    "tags": [
      "regression",
      "jakarta",
      "encoding",
      "protocol"
    ],
    "successful_runs": {
      "total_time": "1937077",
      "count": "1"
    },
    "failed_runs": {
      "total_time": "0",
      "count": "0"
    }
  },
  {
    "file": "encoding.ml",
    "title": "Alpha: protocol encoding regression test: operation",
    "tags": [
      "regression",
      "alpha",
      "encoding",
      "protocol"
    ],
    "successful_runs": {
      "total_time": "26980149",
      "count": "1"
    },
    "failed_runs": {
      "total_time": "0",
      "count": "0"
    }
  },
  {
    "file": "encoding.ml",
    "title": "Ithaca: protocol encoding regression test: operation",
    "tags": [
      "regression",
      "ithaca",
      "encoding",
      "protocol"
    ],
    "successful_runs": {
      "total_time": "26989782",
      "count": "1"
    },
    "failed_runs": {
      "total_time": "0",
      "count": "0"
    }
  },
  {
    "file": "encoding.ml",
    "title": "Kathmandu: protocol encoding regression test: period",
    "tags": [
      "regression",
      "kathmandu",
      "encoding",
      "protocol"
    ],
    "successful_runs": {
      "total_time": "4118746",
      "count": "1"
    },
    "failed_runs": {
      "total_time": "0",
      "count": "0"
    }
  },
  {
    "file": "encoding.ml",
    "title": "Jakarta: protocol encoding regression test: period",
    "tags": [
      "regression",
      "jakarta",
      "encoding",
      "protocol"
    ],
    "successful_runs": {
      "total_time": "3797822",
      "count": "1"
    },
    "failed_runs": {
      "total_time": "0",
      "count": "0"
    }
  },
  {
    "file": "encoding.ml",
    "title": "Alpha: protocol encoding regression test: vote.ballot",
    "tags": [
      "regression",
      "alpha",
      "encoding",
      "protocol"
    ],
    "successful_runs": {
      "total_time": "5656512",
      "count": "1"
    },
    "failed_runs": {
      "total_time": "0",
      "count": "0"
    }
  },
  {
    "file": "encoding.ml",
    "title": "Ithaca: protocol encoding regression test: vote.ballot",
    "tags": [
      "regression",
      "ithaca",
      "encoding",
      "protocol"
    ],
    "successful_runs": {
      "total_time": "5688158",
      "count": "1"
    },
    "failed_runs": {
      "total_time": "0",
      "count": "0"
    }
  },
  {
    "file": "encoding.ml",
    "title": "Kathmandu: protocol encoding regression test: voting_period.kind",
    "tags": [
      "regression",
      "kathmandu",
      "encoding",
      "protocol"
    ],
    "successful_runs": {
      "total_time": "7648388",
      "count": "1"
    },
    "failed_runs": {
      "total_time": "0",
      "count": "0"
    }
  },
  {
    "file": "encoding.ml",
    "title": "Jakarta: protocol encoding regression test: voting_period.kind",
    "tags": [
      "regression",
      "jakarta",
      "encoding",
      "protocol"
    ],
    "successful_runs": {
      "total_time": "7669858",
      "count": "1"
    },
    "failed_runs": {
      "total_time": "0",
      "count": "0"
    }
  },
  {
    "file": "p2p.ml",
    "title": "check preservation of trusted known points and peers",
    "tags": [
      "p2p",
      "pool",
      "gc"
    ],
    "successful_runs": {
      "total_time": "11818187",
      "count": "1"
    },
    "failed_runs": {
      "total_time": "0",
      "count": "0"
    }
  },
  {
    "file": "cli_tezos.ml",
    "title": "CLI --net-addr collision message",
    "tags": [
      "cli",
      "address"
    ],
    "successful_runs": {
      "total_time": "7922553",
      "count": "1"
    },
    "failed_runs": {
      "total_time": "0",
      "count": "0"
    }
  },
  {
    "file": "client_keys.ml",
    "title": "Shows the address of a registered BLS account",
    "tags": [
      "client",
      "keys"
    ],
    "successful_runs": {
      "total_time": "2367504",
      "count": "1"
    },
    "failed_runs": {
      "total_time": "0",
      "count": "0"
    }
  },
  {
    "file": "client_keys.ml",
    "title": "Generates new tz4 keys",
    "tags": [
      "client",
      "keys"
    ],
    "successful_runs": {
      "total_time": "2358699",
      "count": "1"
    },
    "failed_runs": {
      "total_time": "0",
      "count": "0"
    }
  },
  {
    "file": "RPC_test.ml",
    "title": "Alpha: (mode client) RPC regression tests: delegates",
    "tags": [
      "regression",
      "alpha",
      "rpc",
      "client",
      "delegates"
    ],
    "successful_runs": {
      "total_time": "31181045",
      "count": "1"
    },
    "failed_runs": {
      "total_time": "0",
      "count": "0"
    }
  },
  {
    "file": "RPC_test.ml",
    "title": "Jakarta: (mode client) RPC tests: workers",
    "tags": [
      "jakarta",
      "rpc",
      "client",
      "workers"
    ],
    "successful_runs": {
      "total_time": "14335196",
      "count": "1"
    },
    "failed_runs": {
      "total_time": "0",
      "count": "0"
    }
  },
  {
    "file": "RPC_test.ml",
    "title": "Kathmandu: (mode client) RPC tests: workers",
    "tags": [
      "kathmandu",
      "rpc",
      "client",
      "workers"
    ],
    "successful_runs": {
      "total_time": "14229236",
      "count": "1"
    },
    "failed_runs": {
      "total_time": "0",
      "count": "0"
    }
  },
  {
    "file": "RPC_test.ml",
    "title": "Alpha: (mode client) RPC tests: misc_shell",
    "tags": [
      "alpha",
      "rpc",
      "client",
      "misc_shell"
    ],
    "successful_runs": {
      "total_time": "19910773",
      "count": "1"
    },
    "failed_runs": {
      "total_time": "0",
      "count": "0"
    }
  },
  {
    "file": "RPC_test.ml",
    "title": "Jakarta: (mode light) RPC regression tests: contracts",
    "tags": [
      "regression",
      "jakarta",
      "rpc",
      "light",
      "contracts"
    ],
    "successful_runs": {
      "total_time": "77122556",
      "count": "1"
    },
    "failed_runs": {
      "total_time": "0",
      "count": "0"
    }
  },
  {
    "file": "RPC_test.ml",
    "title": "Ithaca: (mode light) RPC tests: misc_shell",
    "tags": [
      "ithaca",
      "rpc",
      "light",
      "misc_shell"
    ],
    "successful_runs": {
      "total_time": "20791701",
      "count": "1"
    },
    "failed_runs": {
      "total_time": "0",
      "count": "0"
    }
  },
  {
    "file": "RPC_test.ml",
    "title": "Kathmandu: (mode proxy) RPC regression tests: contracts",
    "tags": [
      "regression",
      "kathmandu",
      "rpc",
      "proxy",
      "contracts"
    ],
    "successful_runs": {
      "total_time": "72582726",
      "count": "1"
    },
    "failed_runs": {
      "total_time": "0",
      "count": "0"
    }
  },
  {
    "file": "RPC_test.ml",
    "title": "Alpha: (mode proxy) RPC regression tests: contracts",
    "tags": [
      "regression",
      "alpha",
      "rpc",
      "proxy",
      "contracts"
    ],
    "successful_runs": {
      "total_time": "72228091",
      "count": "1"
    },
    "failed_runs": {
      "total_time": "0",
      "count": "0"
    }
  },
  {
    "file": "RPC_test.ml",
    "title": "Ithaca: (mode proxy) RPC regression tests: mempool",
    "tags": [
      "regression",
      "ithaca",
      "rpc",
      "proxy",
      "mempool"
    ],
    "successful_runs": {
      "total_time": "70278828",
      "count": "1"
    },
    "failed_runs": {
      "total_time": "0",
      "count": "0"
    }
  },
  {
    "file": "RPC_test.ml",
    "title": "Jakarta: (mode proxy) RPC tests: network",
    "tags": [
      "jakarta",
      "rpc",
      "proxy",
      "network"
    ],
    "successful_runs": {
      "total_time": "35452641",
      "count": "1"
    },
    "failed_runs": {
      "total_time": "0",
      "count": "0"
    }
  },
  {
    "file": "RPC_test.ml",
    "title": "Alpha: (mode proxy) RPC tests: chain",
    "tags": [
      "alpha",
      "rpc",
      "proxy",
      "chain"
    ],
    "successful_runs": {
      "total_time": "512072562",
      "count": "1"
    },
    "failed_runs": {
      "total_time": "0",
      "count": "0"
    }
  },
  {
    "file": "RPC_test.ml",
    "title": "Kathmandu: (mode proxy_server_data_dir) RPC regression tests: contracts",
    "tags": [
      "regression",
      "kathmandu",
      "rpc",
      "proxy_server_data_dir",
      "contracts"
    ],
    "successful_runs": {
      "total_time": "75697393",
      "count": "1"
    },
    "failed_runs": {
      "total_time": "0",
      "count": "0"
    }
  },
  {
    "file": "RPC_test.ml",
    "title": "Alpha: (mode proxy_server_data_dir) RPC regression tests: delegates",
    "tags": [
      "regression",
      "alpha",
      "rpc",
      "proxy_server_data_dir",
      "delegates"
    ],
    "successful_runs": {
      "total_time": "31123062",
      "count": "1"
    },
    "failed_runs": {
      "total_time": "0",
      "count": "0"
    }
  },
  {
    "file": "RPC_test.ml",
    "title": "Ithaca: (mode proxy_server_data_dir) RPC regression tests: votes",
    "tags": [
      "regression",
      "ithaca",
      "rpc",
      "proxy_server_data_dir",
      "votes"
    ],
    "successful_runs": {
      "total_time": "38563394",
      "count": "1"
    },
    "failed_runs": {
      "total_time": "0",
      "count": "0"
    }
  },
  {
    "file": "RPC_test.ml",
    "title": "Alpha: (mode proxy_server_data_dir) RPC regression tests: votes",
    "tags": [
      "regression",
      "alpha",
      "rpc",
      "proxy_server_data_dir",
      "votes"
    ],
    "successful_runs": {
      "total_time": "38730329",
      "count": "1"
    },
    "failed_runs": {
      "total_time": "0",
      "count": "0"
    }
  },
  {
    "file": "RPC_test.ml",
    "title": "Ithaca: (mode proxy_server_data_dir) RPC tests: network",
    "tags": [
      "ithaca",
      "rpc",
      "proxy_server_data_dir",
      "network"
    ],
    "successful_runs": {
      "total_time": "7345654",
      "count": "1"
    },
    "failed_runs": {
      "total_time": "0",
      "count": "0"
    }
  },
  {
    "file": "RPC_test.ml",
    "title": "Kathmandu: (mode proxy_server_rpc) RPC tests: network",
    "tags": [
      "kathmandu",
      "rpc",
      "proxy_server_rpc",
      "network"
    ],
    "successful_runs": {
      "total_time": "7805449",
      "count": "1"
    },
    "failed_runs": {
      "total_time": "0",
      "count": "0"
    }
  },
  {
    "file": "RPC_test.ml",
    "title": "Test RPC no_service_at_valid_prefix @ 127.0.0.1",
    "tags": [
      "rpc"
    ],
    "successful_runs": {
      "total_time": "6136083",
      "count": "1"
    },
    "failed_runs": {
      "total_time": "0",
      "count": "0"
    }
  },
  {
    "file": "tx_rollup.ml",
    "title": "Jakarta: RPC (tx_rollups, regression) - inbox message hash",
    "tags": [
      "regression",
      "jakarta",
      "tx_rollup",
      "rpc",
      "inbox",
      "message"
    ],
    "successful_runs": {
      "total_time": "7881045",
      "count": "1"
    },
    "failed_runs": {
      "total_time": "0",
      "count": "0"
    }
  },
  {
    "file": "tx_rollup.ml",
    "title": "Alpha: RPC (tx_rollups, regression) - inbox merkle tree path",
    "tags": [
      "regression",
      "alpha",
      "tx_rollup",
      "rpc",
      "inbox",
      "merkle_tree_path"
    ],
    "successful_runs": {
      "total_time": "11602578",
      "count": "1"
    },
    "failed_runs": {
      "total_time": "0",
      "count": "0"
    }
  },
  {
    "file": "tx_rollup.ml",
    "title": "Alpha: RPC (tx_rollups, regression) - commitment",
    "tags": [
      "regression",
      "alpha",
      "tx_rollup",
      "rpc",
      "commitment"
    ],
    "successful_runs": {
      "total_time": "19731430",
      "count": "1"
    },
    "failed_runs": {
      "total_time": "0",
      "count": "0"
    }
  },
  {
    "file": "tx_rollup.ml",
    "title": "Kathmandu: RPC (tx_rollups, regression) - batch encoding",
    "tags": [
      "regression",
      "kathmandu",
      "tx_rollup",
      "batch",
      "encoding"
    ],
    "successful_runs": {
      "total_time": "12104820",
      "count": "1"
    },
    "failed_runs": {
      "total_time": "0",
      "count": "0"
    }
  },
  {
    "file": "tx_rollup.ml",
    "title": "Jakarta: Submit a batch to an invalid rollup address should fail",
    "tags": [
      "regression",
      "jakarta",
      "tx_rollup",
      "client",
      "fail",
      "batch"
    ],
    "successful_runs": {
      "total_time": "7019114",
      "count": "1"
    },
    "failed_runs": {
      "total_time": "0",
      "count": "0"
    }
  },
  {
    "file": "tx_rollup.ml",
    "title": "Jakarta: Try to finalize a too recent commitment",
    "tags": [
      "regression",
      "jakarta",
      "tx_rollup",
      "client",
      "fail",
      "finalize"
    ],
    "successful_runs": {
      "total_time": "19257367",
      "count": "1"
    },
    "failed_runs": {
      "total_time": "0",
      "count": "0"
    }
  },
  {
    "file": "tx_rollup.ml",
    "title": "Kathmandu: Submit from an originated contract should fail",
    "tags": [
      "kathmandu",
      "tx_rollup",
      "client"
    ],
    "successful_runs": {
      "total_time": "11701413",
      "count": "1"
    },
    "failed_runs": {
      "total_time": "0",
      "count": "0"
    }
  },
  {
    "file": "tx_rollup.ml",
    "title": "Jakarta: RPC (tx_rollup, regression) - rejection",
    "tags": [
      "regression",
      "jakarta",
      "tx_rollup",
      "rejection"
    ],
    "successful_runs": {
      "total_time": "27271947",
      "count": "1"
    },
    "failed_runs": {
      "total_time": "0",
      "count": "0"
    }
  },
  {
    "file": "tx_rollup.ml",
    "title": "Kathmandu: deposit and withdraw big tickets",
    "tags": [
      "kathmandu",
      "tx_rollup",
      "withdraw",
      "deposit",
      "ticket"
    ],
    "successful_runs": {
      "total_time": "109559389",
      "count": "1"
    },
    "failed_runs": {
      "total_time": "0",
      "count": "0"
    }
  },
  {
    "file": "tx_rollup_node.ml",
    "title": "Kathmandu: TX_rollup: configuration",
    "tags": [
      "kathmandu",
      "tx_rollup",
      "configuration"
    ],
    "successful_runs": {
      "total_time": "7867613",
      "count": "1"
    },
    "failed_runs": {
      "total_time": "0",
      "count": "0"
    }
  },
  {
    "file": "tx_rollup_node.ml",
    "title": "Alpha: TX_rollup: test that the node starts if allowed to deposit",
    "tags": [
      "alpha",
      "tx_rollup",
      "node",
      "allow",
      "deposit"
    ],
    "successful_runs": {
      "total_time": "9031090",
      "count": "1"
    },
    "failed_runs": {
      "total_time": "0",
      "count": "0"
    }
  },
  {
    "file": "tx_rollup_node.ml",
    "title": "Jakarta: TX_rollup: test if the node is ready",
    "tags": [
      "jakarta",
      "tx_rollup",
      "ready",
      "originate"
    ],
    "successful_runs": {
      "total_time": "9040002",
      "count": "1"
    },
    "failed_runs": {
      "total_time": "0",
      "count": "0"
    }
  },
  {
    "file": "tx_rollup_node.ml",
    "title": "Alpha: TX_rollup: store inbox",
    "tags": [
      "alpha",
      "tx_rollup",
      "store",
      "inbox"
    ],
    "successful_runs": {
      "total_time": "24364585",
      "count": "1"
    },
    "failed_runs": {
      "total_time": "0",
      "count": "0"
    }
  },
  {
    "file": "tx_rollup_node.ml",
    "title": "Kathmandu: TX_rollup: test that the we recover when disconnecting from Tezos node",
    "tags": [
      "kathmandu",
      "tx_rollup",
      "node",
      "disconnect"
    ],
    "successful_runs": {
      "total_time": "16583027",
      "count": "1"
    },
    "failed_runs": {
      "total_time": "0",
      "count": "0"
    }
  },
  {
    "file": "tx_rollup_node.ml",
    "title": "Jakarta: TX_rollup: L2 batcher",
    "tags": [
      "jakarta",
      "tx_rollup",
      "node",
      "batcher",
      "transaction"
    ],
    "successful_runs": {
      "total_time": "181823302",
      "count": "1"
    },
    "failed_runs": {
      "total_time": "0",
      "count": "0"
    }
  },
  {
    "file": "tx_rollup_node.ml",
    "title": "Kathmandu: TX_rollup: reject bad commitment",
    "tags": [
      "kathmandu",
      "tx_rollup",
      "node",
      "proofs",
      "rejection",
      "slashed"
    ],
    "successful_runs": {
      "total_time": "29117595",
      "count": "1"
    },
    "failed_runs": {
      "total_time": "0",
      "count": "0"
    }
  },
  {
    "file": "tx_rollup_node.ml",
    "title": "Jakarta: TX_rollup: injecting commitments automatically",
    "tags": [
      "jakarta",
      "tx_rollup",
      "node",
      "commitments"
    ],
    "successful_runs": {
      "total_time": "40004950",
      "count": "1"
    },
    "failed_runs": {
      "total_time": "0",
      "count": "0"
    }
  },
  {
    "file": "tx_rollup_node.ml",
    "title": "Alpha: TX_rollup: inject transaction with withdraw command",
    "tags": [
      "alpha",
      "tx_rollup",
      "client",
      "withdraw"
    ],
    "successful_runs": {
      "total_time": "26090334",
      "count": "1"
    },
    "failed_runs": {
      "total_time": "0",
      "count": "0"
    }
  },
  {
    "file": "manager_operations.ml",
    "title": "Ithaca: Contract's body illtyped 1",
    "tags": [
      "ithaca",
      "precheck",
      "illtyped",
      "origination",
      "typing"
    ],
    "successful_runs": {
      "total_time": "20398607",
      "count": "1"
    },
    "failed_runs": {
      "total_time": "0",
      "count": "0"
    }
  },
  {
    "file": "manager_operations.ml",
    "title": "Alpha: Smart contract call that should succeeds with the provided gas limit",
    "tags": [
      "alpha",
      "precheck",
      "gas",
      "deserialization",
      "canary"
    ],
    "successful_runs": {
      "total_time": "24427989",
      "count": "1"
    },
    "failed_runs": {
      "total_time": "0",
      "count": "0"
    }
  },
  {
    "file": "manager_operations.ml",
    "title": "Alpha: Contract call with not enough gas to deserialize argument",
    "tags": [
      "alpha",
      "precheck",
      "gas",
      "deserialization"
    ],
    "successful_runs": {
      "total_time": "22187700",
      "count": "1"
    },
    "failed_runs": {
      "total_time": "0",
      "count": "0"
    }
  },
  {
    "file": "manager_operations.ml",
    "title": "Ithaca: Simple revelation with something that is not a public key",
    "tags": [
      "ithaca",
      "reveal",
      "revelation"
    ],
    "successful_runs": {
      "total_time": "24865666",
      "count": "1"
    },
    "failed_runs": {
      "total_time": "0",
      "count": "0"
    }
  },
  {
    "file": "manager_operations.ml",
    "title": "Alpha: Two reveals in a batch. First key is wrong",
    "tags": [
      "alpha",
      "reveal",
      "revelation",
      "batch"
    ],
    "successful_runs": {
      "total_time": "40410107",
      "count": "1"
    },
    "failed_runs": {
      "total_time": "0",
      "count": "0"
    }
  },
  {
    "file": "manager_operations.ml",
    "title": "Kathmandu: Simple transfer counter in the future",
    "tags": [
      "kathmandu",
      "transaction",
      "transfer"
    ],
    "successful_runs": {
      "total_time": "23682540",
      "count": "1"
    },
    "failed_runs": {
      "total_time": "0",
      "count": "0"
    }
  },
  {
    "file": "manager_operations.ml",
    "title": "Alpha: Test simple transfer with low balance to pay allocation (2)",
    "tags": [
      "alpha",
      "transaction",
      "transfer"
    ],
    "successful_runs": {
      "total_time": "43974145",
      "count": "1"
    },
    "failed_runs": {
      "total_time": "0",
      "count": "0"
    }
  },
  {
    "file": "manager_operations.ml",
    "title": "Jakarta: Test successive injections with same manager (no operation precheck)",
    "tags": [
      "jakarta",
      "transaction",
      "transfer",
      "counters",
      "no_operation_precheck"
    ],
    "successful_runs": {
      "total_time": "37230859",
      "count": "1"
    },
    "failed_runs": {
      "total_time": "0",
      "count": "0"
    }
  },
  {
    "file": "manager_operations.ml",
    "title": "Alpha: Smart contract call with illtyped argument",
    "tags": [
      "alpha",
      "simple_contract_calls",
      "smart",
      "contract",
      "call"
    ],
    "successful_runs": {
      "total_time": "36656223",
      "count": "1"
    },
    "failed_runs": {
      "total_time": "0",
      "count": "0"
    }
  },
  {
    "file": "manager_operations.ml",
    "title": "Kathmandu: Smart contract call that throws a failwith",
    "tags": [
      "kathmandu",
      "simple_contract_calls",
      "smart",
      "contract",
      "call"
    ],
    "successful_runs": {
      "total_time": "29850749",
      "count": "1"
    },
    "failed_runs": {
      "total_time": "0",
      "count": "0"
    }
  },
  {
    "file": "manager_operations.ml",
    "title": "Kathmandu: Deserialization of transfer ticket",
    "tags": [
      "kathmandu",
      "precheck",
      "deserialization",
      "gas",
      "transfer_ticket",
      "tx_rollup",
      "canary"
    ],
    "successful_runs": {
      "total_time": "24934967",
      "count": "1"
    },
    "failed_runs": {
      "total_time": "0",
      "count": "0"
    }
  },
  {
    "file": "replace_by_fees.ml",
    "title": "Alpha: Injecting the same operation twice",
    "tags": [
      "alpha",
      "replace",
      "fee",
      "manager"
    ],
    "successful_runs": {
      "total_time": "109809236",
      "count": "1"
    },
    "failed_runs": {
      "total_time": "0",
      "count": "0"
    }
  },
  {
    "file": "replace_by_fees.ml",
    "title": "Jakarta: Inject two different operations with same gas and fee",
    "tags": [
      "jakarta",
      "replace",
      "fee",
      "manager"
    ],
    "successful_runs": {
      "total_time": "27095912",
      "count": "1"
    },
    "failed_runs": {
      "total_time": "0",
      "count": "0"
    }
  },
  {
    "file": "replace_by_fees.ml",
    "title": "Kathmandu: Inject two different operations with same gas and fee",
    "tags": [
      "kathmandu",
      "replace",
      "fee",
      "manager"
    ],
    "successful_runs": {
      "total_time": "26220802",
      "count": "1"
    },
    "failed_runs": {
      "total_time": "0",
      "count": "0"
    }
  },
  {
    "file": "replace_by_fees.ml",
    "title": "Ithaca: Second op's fees are equal to replacement fees threshold",
    "tags": [
      "ithaca",
      "replace",
      "fee",
      "manager"
    ],
    "successful_runs": {
      "total_time": "27740767",
      "count": "1"
    },
    "failed_runs": {
      "total_time": "0",
      "count": "0"
    }
  },
  {
    "file": "replace_by_fees.ml",
    "title": "Jakarta: Replace a replacement requires bumping fees again",
    "tags": [
      "jakarta",
      "replace",
      "fee",
      "manager"
    ],
    "successful_runs": {
      "total_time": "29442732",
      "count": "1"
    },
    "failed_runs": {
      "total_time": "0",
      "count": "0"
    }
  },
  {
    "file": "replace_by_fees.ml",
    "title": "Alpha: Replace a replacement requires bumping fees again",
    "tags": [
      "alpha",
      "replace",
      "fee",
      "manager"
    ],
    "successful_runs": {
      "total_time": "35233135",
      "count": "1"
    },
    "failed_runs": {
      "total_time": "0",
      "count": "0"
    }
  },
  {
    "file": "replace_by_fees.ml",
    "title": "Jakarta: Much more fees in second op, but counter in the future",
    "tags": [
      "jakarta",
      "replace",
      "fee",
      "manager"
    ],
    "successful_runs": {
      "total_time": "22532308",
      "count": "1"
    },
    "failed_runs": {
      "total_time": "0",
      "count": "0"
    }
  },
  {
    "file": "replace_by_fees.ml",
    "title": "Ithaca: Gas limit doubled in batch. More fees needed",
    "tags": [
      "ithaca",
      "replace",
      "fee",
      "manager"
    ],
    "successful_runs": {
      "total_time": "24231690",
      "count": "1"
    },
    "failed_runs": {
      "total_time": "0",
      "count": "0"
    }
  },
  {
    "file": "replace_by_fees.ml",
    "title": "Ithaca: Replacing a batched operation not possible due to low fees",
    "tags": [
      "ithaca",
      "replace",
      "fee",
      "manager"
    ],
    "successful_runs": {
      "total_time": "26015429",
      "count": "1"
    },
    "failed_runs": {
      "total_time": "0",
      "count": "0"
    }
  },
  {
    "file": "replace_by_fees.ml",
    "title": "Jakarta: Sum of fees of the 2nd operation overflow on int64",
    "tags": [
      "jakarta",
      "replace",
      "fee",
      "manager"
    ],
    "successful_runs": {
      "total_time": "30703682",
      "count": "1"
    },
    "failed_runs": {
      "total_time": "0",
      "count": "0"
    }
  },
  {
    "file": "replace_by_fees.ml",
    "title": "Alpha: Sum of fees of the 2nd operation overflow on int64",
    "tags": [
      "alpha",
      "replace",
      "fee",
      "manager"
    ],
    "successful_runs": {
      "total_time": "26068678",
      "count": "1"
    },
    "failed_runs": {
      "total_time": "0",
      "count": "0"
    }
  },
  {
    "file": "sc_rollup.ml",
    "title": "Alpha: observing the correct maintenance of inbox in the rollup node (handles_chain_reorg)",
    "tags": [
      "regression",
      "alpha",
      "sc_rollup",
      "inbox",
      "node",
      "handles_chain_reorg"
    ],
    "successful_runs": {
      "total_time": "30653210",
      "count": "1"
    },
    "failed_runs": {
      "total_time": "0",
      "count": "0"
    }
  },
  {
    "file": "sc_rollup.ml",
    "title": "Alpha: observing the correct handling of commitments in the rollup node (commitment_is_stored)",
    "tags": [
      "regression",
      "alpha",
      "sc_rollup",
      "commitment",
      "node",
      "commitment_is_stored"
    ],
    "successful_runs": {
      "total_time": "86273780",
      "count": "1"
    },
    "failed_runs": {
      "total_time": "0",
      "count": "0"
    }
  },
  {
    "file": "runtime_script_failure.ml",
    "title": "Kathmandu: Runtime Script Failure: client force",
    "tags": [
      "kathmandu",
      "runtime_script_failure"
    ],
    "successful_runs": {
      "total_time": "11778750",
      "count": "1"
    },
    "failed_runs": {
      "total_time": "0",
      "count": "0"
    }
  },
  {
    "file": "large_metadata.ml",
    "title": "Alpha: Check recomputation and pruning of metadata",
    "tags": [
      "alpha",
      "large_metadata",
      "query"
    ],
    "successful_runs": {
      "total_time": "21454625",
      "count": "1"
    },
    "failed_runs": {
      "total_time": "0",
      "count": "0"
    }
  },
  {
    "file": "run_script.ml",
    "title": "Run script with balance and self address",
    "tags": [
      "client",
      "michelson"
    ],
    "successful_runs": {
      "total_time": "9561856",
      "count": "1"
    },
    "failed_runs": {
      "total_time": "0",
      "count": "0"
    }
  },
  {
    "file": "client_run_view.ml",
    "title": "Jakarta: Run view `value` without input",
    "tags": [
      "jakarta",
      "client",
      "michelson",
      "view"
    ],
    "successful_runs": {
      "total_time": "3543142",
      "count": "1"
    },
    "failed_runs": {
      "total_time": "0",
      "count": "0"
    }
  },
  {
    "file": "client_run_view.ml",
    "title": "Alpha: Run view `loop` with default gas limit",
    "tags": [
      "alpha",
      "client",
      "michelson",
      "view"
    ],
    "successful_runs": {
      "total_time": "3686538",
      "count": "1"
    },
    "failed_runs": {
      "total_time": "0",
      "count": "0"
    }
  },
  {
    "file": "client_run_view.ml",
    "title": "Kathmandu: Run view `loop` with unlimited gas",
    "tags": [
      "kathmandu",
      "client",
      "michelson",
      "view"
    ],
    "successful_runs": {
      "total_time": "3683002",
      "count": "1"
    },
    "failed_runs": {
      "total_time": "0",
      "count": "0"
    }
  },
  {
    "file": "governance_dictator.ml",
    "title": "Alpha: governance dictator (ghostnet, cooldown)",
    "tags": [
      "alpha",
      "amendment",
      "ghostnet",
      "cooldown"
    ],
    "successful_runs": {
      "total_time": "57166132",
      "count": "1"
    },
    "failed_runs": {
      "total_time": "0",
      "count": "0"
    }
  },
  {
    "file": "test_contract_bls12_381.ml",
    "title": "Alpha: Bls12_381 contract primitives, fr: mul",
    "tags": [
      "regression",
      "alpha",
      "michelson",
      "crypto",
      "contract",
      "bls12_381",
      "fr",
      "mul"
    ],
    "successful_runs": {
      "total_time": "124591545",
      "count": "1"
    },
    "failed_runs": {
      "total_time": "0",
      "count": "0"
    }
  },
  {
    "file": "test_contract_bls12_381.ml",
    "title": "Alpha: Bls12_381 contract primitives, g2: negate",
    "tags": [
      "regression",
      "alpha",
      "michelson",
      "crypto",
      "contract",
      "bls12_381",
      "g2",
      "negate"
    ],
    "successful_runs": {
      "total_time": "15142689",
      "count": "1"
    },
    "failed_runs": {
      "total_time": "0",
      "count": "0"
    }
  },
  {
    "file": "op_validation.ml",
    "title": "Alpha: Run_operation ill-formed batch",
    "tags": [
      "alpha",
      "rpc",
      "run_operation",
      "batch"
    ],
    "successful_runs": {
      "total_time": "13891217",
      "count": "1"
    },
    "failed_runs": {
      "total_time": "0",
      "count": "0"
    }
  }
]