<?xml version="1.0" encoding="UTF-8" standalone="no"?>
<!-- Created with Inkscape (http://www.inkscape.org/) -->

<svg
   width="940.67786"
   height="384.15109"
   viewBox="0 0 248.88768 101.63998"
   version="1.1"
   id="svg5"
   inkscape:version="1.1 (c68e22c387, 2021-05-23)"
   sodipodi:docname="tecnologia-analisis-y-datos-dat-logo-no-padding.svg"
   inkscape:export-filename="/home/chris/Pictures/dat/dat1-logo.png"
   inkscape:export-xdpi="96"
   inkscape:export-ydpi="96"
   xmlns:inkscape="http://www.inkscape.org/namespaces/inkscape"
   xmlns:sodipodi="http://sodipodi.sourceforge.net/DTD/sodipodi-0.dtd"
   xmlns:xlink="http://www.w3.org/1999/xlink"
   xmlns="http://www.w3.org/2000/svg"
   xmlns:svg="http://www.w3.org/2000/svg">
  <sodipodi:namedview
     id="namedview7"
     pagecolor="#ffffff"
     bordercolor="#666666"
     borderopacity="1.0"
     inkscape:pageshadow="2"
     inkscape:pageopacity="1"
     inkscape:pagecheckerboard="0"
     inkscape:document-units="px"
     showgrid="false"
     inkscape:zoom="0.68796296"
     inkscape:cx="470.95559"
     inkscape:cy="191.87079"
     inkscape:window-width="1920"
     inkscape:window-height="1007"
     inkscape:window-x="0"
     inkscape:window-y="0"
     inkscape:window-maximized="1"
     inkscape:current-layer="layer1" />
  <defs
     id="defs2" />
  <g
     inkscape:label="Layer 1"
     inkscape:groupmode="layer"
     id="layer1"
     transform="translate(-18.43116,-92.055008)">
    <image
       width="248.88768"
       height="101.63998"
       preserveAspectRatio="none"
       xlink:href="data:image/png;base64,iVBORw0KGgoAAAANSUhEUgAAAj0AAADqCAIAAADGV2PoAAAACXBIWXMAAA7EAAAOxAGVKw4bAAAg AElEQVR4Xu3dX2wb150v8NkVKYmjf9GIFESFFJPoD+3IiChbwFrytQtE6sOmkZG+xHmLE2Afmt2n NgZ6i03a2xbdBWLvW5O3xn2r9bAIrFynQKUCa29EB9epaCOMMxIVmxqF1BX/KBSloflH1/eBCX10 +G8okcM5w+/nSfoN4zhiNF+e3zlzzt89fvyYAwAAYMTf0wUAAAANQ24BAABLkFsAAMAS5BYAALAE uQUAACxBbgEAAEsMdAEAtEdOpVc2w1LkW/rC90b6zE6rha5Cw/inP/wnXSLYha4L//CCbv4PQW4B aF14V75842ZkV6YvEGbHj+vmrgRVJ0Vjlz+59e4r03ahi77GIPQJAbTu2u27pUMLQIlPVx7SJTYh twC0zrMepEsAlZOiMbrEJuQWAACwBLkFAAAsQW4BAABLkFsAAMAS5BYAALAEuQUAACxBbgEAAEuQ WwAAwBLkFgAAsAS5BQAALEFuAQAAS5BbAADAEuQWAACwBLkFAAAsQW4BAABLkFsAAMAS5FYB8n5m Mbgu7cXpCwAAUG8GutDwIsnEb+7eTuxnOI57fWh0ytJPvwIAAOoH460D5P3M+1/dzYYWx3F/9HmX QoGDLwEAgHpCbh3wwVeeDflAe3DugYiGIQCAdiC3nrj2UFzZ2aaKif3MFe8d+fsRGAAA1Bdy6zue 6NZfg+t0leM4jkvsZz74ykNXAQCgHpBbHMdxkWTiqs9LVl62PWdqerJoZWVne15aI64DAEB9ILc4 juOu+ry5tRgcxw13ds/aBy8OjRIv4T7e+BoTXQAAdYfc4haD6+S0lqnJ8NYxF8dxLqH3RevAk9dx HDUmAwAA9TV6bkWSCaoB+JNjLv77DuGFZ5w2vj13aUOOo1sIAFBfjZ5bVIfwZdtzzs5u4jr31jEX OdGFbiEAQH01dG55oltkhzA7rUVc5ziO62kxUcW5hyL5LQAAqKlxc0vez1AJdOEZJ/ltzrR1YJgY hK3sbHuiW8R1AABQT+Pm1mLAH0k+yn07abHa2zqI6wdQkTb3UMSTyAAAddGguZXd8T33ranJ8Oqz x4jrNHtbB7m2MJJ8tBjwE9cBAEAlDZpbiwE/uRxj1j6YW0NYzKx9kFygsRhcx5ALAEB9jZhbkWSC HGzZ+Pbpg89pFcQ3GcgFGon9DIZcAADqa8TcmpfWyMFW6Q4hado6ILS05r7FkAsAQH0Nl1vyfsYT DeW+He7sph7YKg1DLgCA+mq43KJmtmYUdAhJU5Z+csjlxqmSAADqarzcIma2hJZWl9BLXFSEHHJF ko9wIDIAgJoaK7eWQgFqGSFxUSmX0HtgYWHgSRACAECtNVZukRkjtLROWfqJi0rxTQZy/eGGHMeO hQAAqmmg3JL24hvyk4CZsTqIi5WZ7nccfJYLqzMAAFTSQLlFpoupyTDZe5jBVhZ/8B/3RENYEA8A oI4Gyi1y+btLsJTdIKM0sseY2M9gp10AAHU0Sm55olvkioxDLCOk2Ns6yAXxnghyCwBADQ2UW7mv D7f8PR85Q3Z3OxRJJoiLAABQEw2RW/J+xh0K5r6tSmhxHOcSLOS3ZB8SAABqpOgcj7QX/3hjTc7o YbkB9V9R6R4ZxfS0mIY7u1e/PzF5XlrTzSyXS+hVstcwAID6iubWB6KHPFZRN2x8e0+Lia4e1lRv fy63EvuZle+/Zt3KzvZIZ3eJgzQBAOqlaJ9Ql6HFcdxU79N06Qiq1XLUIN2MHQFAZ4rmll5Rk1JH xDcZhivZTh4AAI6oaJ+Q9NPRCbrEDvfWN7lFGUJLaxWbhFnjQm+uVcgx/rOae/DVhrxLVwEAtERR blV0QpXWzEtrua9r8R8ycvDP5JsM7E4LmQxGugQAoDH67xOSg6FaTEdRDyDrZmkGAIA26Ty3xIMp MtIlkN9WCzmME2NR4goAAFSZznNrhUgRG99+xD0JiyHjEOMtAICa0nlukeOtWjQJs8g/ObGfwXFc AAC1U5Pxh3aQk1tKmoTyfuZudCv37JqpyaDk8Vu+yWDj23Mr8SQ5XvYfAQCAw9FzblGTW6UXE0aS iXnpa3coQF/guJ6W1ln74GTJw5HtbR253FqJRQ93kjIAAJSl5z7hBtGvI5f85VsMrv/ib/9dMLQ4 joskH131eX9z93aJwyHtbZ25r6U9PAIFAFAres6tMHGwiJ0v2ri76vPOPRTpap4NOf7bu+5i0WUj GoMbMua3AABqRc+5Ra6PKDbhtBQKUMMsoaX1RevAy7bnXrY9R+3hFEk+uvLFnYLRRTUhsTQDAKBG 9Dy/RfYJCy7KiCQTcw+ejLRMTYZZ+yB5fscsx0WSife/8uTmrjbk+GLAP2sfzL0mR2hpjX6/oCOS TBRLSgAAOArdjrfk/UyCGBgVTJF5aS33GlOT4WejE/mHTvW0mN4ZmyQHXovB9YJDLrIVifEWAECN 6Da3yOQQWloLPnFMnlA8ax8smG1Zbx1zmb7/ExL7mYJnfJD/OHILAKBGdJtbZJOw4B7w4s42OdjK H2mR+CbDZO+Tpe2eSIHcIluRej29DACg7nSbW+RiwoJPbkWIF5CrAYshN8Uo2Cckh3RYUggAUCO6 za2ynbrII2KVvILcIpGDuRzqDyFzEQAAqqXArI/+FIwlnjhrqmzIUZSMz8LJRwX7k6Ca8K4c3ZXp qubZhC6+maWD0P50++5GNEZXNc/UbBzoeYr8mrmffMPSbW6ROxMWPA7xwJPCCnKL3Fq+mOHO7ty/ N5FJH7wINRfelVeCIXEzHInviZth+jI7nH3mqWHH1LCDvqBJUjS2wuZP27P+3UnoOaZmo7PP7LRa nFaLXeiiruqJGAwt+dalyLeSWp85RvrMl146R1cPRbe5RTIX2uSJHIQl9jNLoUCJTQXl/Qz5ePK4 gq3lpb147XagB5IUjS2t+pf9gQiDo6uCxM2wuBleWvW/NTOJEYCaEqm0Zz2YzbOedn5mdMjl6De3 8/TrWCan0u8vuJn+YKfP3KLmlgr26/gmw1i35e72d0vh5x6Izs7ugq/kOG7ugUguEXQJFuLiE/a2 DnKcB7W2tOpf8PpU+8CoMnEzfPnGzber9BEVKhXZla99du/aZ/ecfebZ8eNOa+HferbIqfTP5/6c SLHdDdJnboWJjMk9d5XvwrPOXG4l9jNXvHdeHzpBLT6U9zNzD0RysDVpsRaLN3JJYaVzZqCcnEpn E0s3A6xipGhsweujq6AucTMsfnLL2We+cHqM9ebh+wtu1kOL02tukUqsoehpMb1oHfhrcD37bST5 6D+8d0Y6u51dwkhndySZEGPbnugWue+Gqcnw6rPHct9SyN5jwbXycHRiMPThrc91n1g5S6t+ugT1 IG6Gf/3R4szo0Oz4cUabt1Lk20RaD/clfeaWkjUUWReecUp7cbK5t7KzvVKk15fdC6rg1htZ5AKQ REYP/39oipxKf3jzTv5cur41TkIzYcHr+3TV/8bZU+OOotPhmqWP0OJ0/PyWcm+PTkxarHQ1j9DS +rPRiYJL6gvCo8fVJQZDP5/7c6OFFmhQIpV+f/H2/PJ9+gKopejQQTcKbpZBuTh0YrL36au+L3Ib upOyu0BN9ztKjLSgpuaX71/HbQK05PryfTEYwoLPusCN+DvOzu5/O3lW2ot7olvi931Ce1uHva3D JfQiserow1ufY45Hyxr2xp1b8NmwP4GKVPGnhNvxAdmgmqXLSikZ20FFEFraNzXsaNj+rRSNIboU quKDBJjfAu1CaDFh3NE/O36crjaMbHTJ7C8ur6mRPvPM6BBdPSx9jrdyjT5g1xFDa6TP7LRaetp5 Rjc7EDfDC1+ssrIA7Pz48fPjx8XgkwPtGCKn0lI0JkW+FYOhw/3AWRl1CW38mZE6bB6W3TqLrh6B PnMLWLfg9R0utCaHBsYd/SyuUaY4rZaZ0aH3btxkaMva6t6b1JT7H0YMhj5d9Xv8gUoDTIrGrn12 742zp+gLWmLu4M/rYmSs/9zqaS28t4UKpL248nXzkJO9BdDVkkxGw8yJ4alhB6Ojq4L4ZuOll879 /Nonld5D4dCyO+rKqfSC11fpeHdp1W8XuqrYDYNi9D+/VWxPJhVgy4xDkFPp3y+46WpJI33md388 c378uJ5CK4tvNp4/+TxdhRrjm43nx4//+4V/nBwqdQx6vuvL9/W6W6am6D+3lO+dAVrwp9t3K9oh 4uLZU5deOqe/xMpht/nGOr7Z+Oa5ibemT5uMSvtSiVT62u27dBWqTf+5VUdYFl8pMRhy+77bLrIs k9Hw7ivTZxg5pOrQWN/IlXXjjv53fzxjU/wuiJvhTw81NQvK6S235P3M3ENRI4eJ/ObubaxsrIjy aS2T0XDpRz/APR1UYG7nL710Tnl0XfvsHpbF15SucssdCvzi81uL3+/vXncbcvw/vHeu+ryY6FLi 01W/wrkBhBaoLLtGRmhT1I5OpNI4faamdJJb0l78ivfOVZ+XPHNEfQXzSWtpqlnKNyr955lJhBao jG82/ssPJxXOdS14fRhy1Q7zuZVtDP723u1ih4+oqdhZkYn9zNxDEW3DEpb9AYXLMXRz8iwwxy50 XTg9RlcLwZCrptjOrWJDGaGlNfd1wTGQOqijltE2LEHhU8Y2oUsfD04Co84MO1wD5Y894hT/Lw2H wGpuFWsM2vj2n45OTFmebJdQbAxUa8Od3b87dfZFK/38R7GsbWThXVnhxqyv/cMLdAlAXRdOjynp FkZ2ZYXztVAp9nKrWGPQ1GR49RnnO2OTzs7ukS6BvFQvfJPhwjPOf33h9PDBBfFoG1I8/gBdKsQ1 YEWHEOrO3M67lG0k9pcvVukSVEP5Tw2a4g4Frj0Q8xdfTFqsrz57rO6nZG0UGtvZ2zreHp1YCgXm Dv7Ns23DSUv/q8866/43ry+FHRXsoAMacf7k80oeNFTYRYBKMXO7lPbicw/F/MUXNr791WePlXjC V81nueTMkxVE1F9pytLvEnrnpbW/HuwQukMBT3Rr1j44nddRbBDZ3bjpah6b0IXBFmiEuZ13DVjL xlIilZaiMax9rToGckvez3wsreVPCJmaDMVu9yVirKYiyQRdImTbhlOW/msHn4zOtg2XtgKvPuus 19+8jhQefqH7fTGALS5Hf9nc4jhODIaQW1Wn9fktaS9ecBXDpMX6u1NnC4ZWPtWmkcLJR7mveUPh k3iybcPXh0YLrjaceyiSxUagZLDFYZs+0BiFZ+Uo/FgGFdH6eOuK907+isHSjcEsG9++Ie/S1RqL EuMtW8kTTIq1DReD67a2DnI9pO4p+cU2GQ340AqawjcbbUJX2dPRFD6VCBXRem6RoVWiMZjPRAx3 NvbiZXOuKiLkeKvcUotibcPIo1LNRv1R8ott73mKLgHUm7PPXDa3FLYToCJa7xOSlDcGOY4jD2wk l0vUDvU0scITI7Ntw0mLoicZdUlJbqFJCBrEtzTTpULCCv4Ph4qwlFtlRzAk8sWll0tUC/mAM7lh hxJ1PNyyvvBpFNjl7DPTpUIi8T26BEfDUm5VhBzukMslaodMx4bNoUrJyRRdKqRHv8dCAkCldJtb ZHKo8wgXOd5S2CQEhXR8nDEAVEq3uUUlhwq7FJL/CjPGWwDAcRzHiZthugRHo9vc4jjOxrfnvpbk mucWOaorvQgeAAAOTc+5RQ65aj3eopZ+oE8IAFAjes4tcoqr1rlFLSasaOkjAAAop+fcIk8zKbhT exUdWJTBY7AFAFAres4tslmX2M/U9CkucgtENAkBAGpHz7nFNxnIpRk13V2XHM9p5NRKAABd0nNu cQcjZCUWJa5Uk7QXJ/dRVGcvRACAxqTz3CJbdvlnTlaLJ7qV+3oYoQUAUEs6zy1SJPmoRqsKyQ5k m8FAbbALAABVpM/l2vJ+xr0VWAz6yYNFOI5b2dmuxaIJ8oljTzQkfn7LJfROWwdq8e8CAGhwesst cWfbvRVwhwL0BY7jOE6MRZWfhKIQ2STMSuxn3KGAOxSw8R1Tvf2Tvf14nAsAoFp0cj8tNsCi1GKK q8QyxQ05PvdQnHsoTlr6J3v7sV4DAODomM8tTzTkDn3jiRY9632s23J3+7urif3MVZ/X3FrNTW/v HlyUEUkmonnZmR1+9bS0TlsdGH4BABwFqzfQSDLhDgWXtr4pNsASWlqnLP1Tvf09LabL3ju5Kahi LcSqeGNotKfF5IluLW0FcmGZE0k+wvALAOCI2MutsgOsSYvVJfS6hN5cZVzoVeEILqGlNbsjYvbf HkkmlrYCS6FA6eGXS7DgkEkAAOVYyq2PN74uPcCaKdKFcwmWeWmNfDS4FqYs/eS3PS2mWfvgrH2w 7PDLJVioSwAAUAx9i9eyeWmNLnEcx3GTFutk79Ml2m49LaafHHO5t74JF8m8oxsXeoutVCw7/Cox dgQAAApLuUUpMcDK5+zsLhFsKiCHX57oljsUpF8BAEwJ78p0CVRR/o6vQWUHWFqWHX69+uwx91Zg IejPH34BABMWvT66BKrQem7Z+PYNeTf39VTv0woHWBrHNxmmrQPT1gFxZ9u99Q05/MJ28gBaJqfS G9HY9b99KUVj9DVQhdYD4K1jruy01rTVocttk7INzOzwazm6NWMdYHQcCVCWnEqvbIalyLfrkW8T qbS4GaZfAaCA1nOrp8V0cegEXdWd3PCLvgDAvvCu7F71L/sDGKBAVWg9twCAXUur/gWvD3EF1YXc AoAqk1PpRa/vL15fIpWmrwEcGXILAKppadX/p8/uIbGgdpBbAFAdUjR27fZdrLaAWkNuAUAVfLrq v4ZhFqgCuQUARyKn0tc+u7e06qcvANQGcgsADk9OpS/fuIkVg6Cmv6cLAADKILSgLpBbAHAYCC2T Ef2q+sDPHQAqVq3QGukz0yUW8M1Gl6Pf3M5f/uQWfQ1qD7kFABV7f8F9uNAyGQ0uR7/TanFaLeZ2 nr7MFDGIk/PqA7kFAJW5vnz/EA9p2YSumdGhM8MO+gJAhZBbAFABMRiaX75PV0sS2vg3z51yWi30 BYBDQW4BgFJyKv37xdt0taTZ8eMzo0N8s5G+AHBYyC0AUOr6375UviOGyWh449zEuKOfvgBwNMgt AFBEisYWv1yjq0WYjIZLP/qBXeiiLwAcGZ7fAgBFrt2+S5eKQGhBTSG3AKA8KRpTuIYQoQW1htwC gPL+8sUqXSrijXMTCC2oKeQWAJQR3pXdvnW6WohrwIqFGFBryC0AKMPjD9ClQrILCOkqQLUhtwCg jAWvjy4Vcv7k83hOC1SA3AKAUqRoLLIr09U8JqNhCns4gSqQWwBQisLdY2dODGOwBepAbgFAKQpz C4MtUI2i/TKueO/QpQbg7BJetA7wTeV/RNJefDG4Hkkm6Aus2diL0yVoeEoe27IJXawfSgIMKX9T 5jhuZWebLjWAlZ3tx48fz9oH6Qt5PhA9keQjugrAPikaU7IhIda+g5rQJyxFVBbYugytnlYTXYLG IydTdKkQJ5vHFgOjiubWi9YBugRFTFqsdIlxpiaDS+ilq9B4lDQJOY7r6WijSwA1U7RPeOEZ55Sl X97P0Bf0bmMvPvdQpKslXRw6MW116OlnZW/rUDKxB7qncLyFyS1QU6l7k72tgy5BEfhZgS5J0Rhd ymMylrqNAFRd0T4hAIAS9p6n6BJALSG3AACAJcgtAABgCXILAABYgtwCAACWILcAAIAlyC0AAGAJ cgsAAFiC3AIAAJYgtwAAgCXILQAAYAlyCwAAWIINMZ+IJBOR5CPyzN9EJpM9M3Oks/vJ6wAAoH4a NLekvfiGHJf24tJePBtX9Cs4juO4DTl+xXuHrIx0dve0mMytppHObhsO+wAAUF0D3Xalvbg7FBBj 2xvykxFVpVZ2tjnuySHIPS2tI52Cs6t7TOhFhgEAqED/t9psVnmiW4kanOsYST5yhwLuUIDjvCOd 3S6h1yVYelpwwj0AQK3oNrciycRicH1pK1BRXA0Xmsfa2Isr+UNWdrZXdrbnHoouwTJpedolWOhX AADAkekwt8Sd7Y+ltex6ihKGO7udnd28wWhr6zC3tCoZJIk724lMOjsrJsnxaJFZMU805ImGelpa p3qfftE6gP4hAEAV6eqWWjaxslk10iU4C42rysr+Uy6hN/ttJJkQd7ZXYlFPNJQ/IIskH81LawsB /0y/42Xbc9RVAN2I7Mp0CVRnE7o2ojG6qlM6ya1IMjH3UPREQ/QFjuM4zsa3T/U+XfWZp54W05TF NGXp5zjOE93yRLfyAyyxn5mX1pa2vpm1D05a+slLoJy4GXZa0XfVKOSWFvDNRrqkX3rIrY83vp6X 1ugqx5maDC7BMmsfrG5cFeQSerPjsKVQYF5ao1qIkeSjqz7vQmD94tCova2DvNTgkEYaZxe6VjbD dBXYlEil6RKb2M4taS9+1efNX9duajJMWwem+x3qzy1NWfqnLP3izva8tLZ6sGOZfRps1j44bR0g 61BWOL5Hl0AVfEszXSpEDIbwEaS+lHzCkPTSSGR4n6fF4PoV75380HrZ9tzvTp2dtQ+qH1o5zs7u t0cnfjo6IbS0kvXEfmbuoXjFe0fOmw9rWCN9ZrqUp3Ea91rjVPDucDq6IbJL+ScMusQgVnPrqs87 91CkJpPGui2/O/k/6ptYJGdn97+dPPuy7TnTwb/Pys72Lz6/JREbSjWynnaeLuWRojFZLy0OtjTU 3ZBpDfUJg73ckvczH4gedyhAFk1Nhp84x9465lJhKqtSs/bBd8ZOU0+GJfYzV7x3EF0cxw30PEWX CsGdsS7sQpfJWP5ToLgZxgeL+lLYp9XH7xFjuSXvZ658cYdaN2jj298ZO51bnq5BPS2mt0cnqNXw if3Mb+/dXjoYwA1I4e/bsr/Rf1D1ouQNSqTSeIPqziZ00aU8nvVgmP31nyzlVja0qAmtSYv1nbFJ DQ6z8s3aB//1hdNUz/CPPm+DR5fCT/Ru3zo+0deFktziOM696qdLoC6FrUIP+58wWMqt/NB6fWj0 4tAJsqJx9raOn+Ut1ph7IDZ4w9DlUPRk24LXR5eg9hS+O+JmWB89KHadGXmGLhWig98jZnIrf737 60Oj2Wd+2WJv63hnbNLGt+cqmOsaV3ZnXPD6MORSn7mdV9KA4jju2mf36BKoyC50CW3lVzlFduXr y/fpKlPK92e0YF5aoxZicBz3R5/3jz4vVWRUYj9z1ef92YkJjayEVNm4o19o46N7ZdruiVT6+t++ fO30GH0BamxmdOjqrc/pah4pGlvw+mZGh+gLoJZxh3XxywKbMFCybxO7W2ywMd76eONruqQ7G3Lc vUVnc+M4M+KgS4Usfrmmj4W8bBl39CuZg+Q47vryfbxBdTRzYpguFZJIpZkeHLORW6B7yj+k/37B jW6hyvhmo8JZrkQq/eHNO3iD6sXczrsGrHS1kKVVP7sTXWzk1utDo9QyPP0Z7uye7FV0a9Alvtk4 OaRo+6vIrnz5xk26CjV2/uTzdKkIKRrDG1RHyj8CXvvsHqODYzbCILvpH10FfTl/8nm3b52uFiJF Yx/e+vyNs6foC1Az5nZ+cmhA+Rt0+cbNt2Ym2Z1BYZfTahnpM5fdqzDrvRs3L710zq5s3Y12sDHe gkZgbudnx4/T1SKWVv2Xb9xEP0pNr50eUzjLxXGcuBm+fOOmDh5xZdEb5yboUhGJVPq9GzeZG3Uh t0BDZkaHlCzkzcreGZn7lWMX32xU3i3kOE6Kxn790SL20VBfRR8BE6n0rz9anGdqZTxyCzSEbza+ dvoFulqcFI29d+Mmu9PLzJkZHVL4LFdWIpV+f/H27xfcGHiprKKPgBzHXV++z9D4GLkF2jLu6J9+ fpCuFpdd0fvrjxaxWYM6/nlmUnm3MMuzHvyfc3/+8NbnrNwWdYBvNv7LDyfpakniZjj7Nmm//d70 q1/9iq4B1NUJW9+yP7CTSNIXittJJJd860urfo7j+p7qMDY10a9gmZIejtNqUbiR4BHxzca+pzr+ z4MN+kI5UjS26PV5/IH0/v8zGpq6TAd2O2NRZFdeUrBQRbW3htJlauWbjd5v/i99oSQpGvuvrx5s xnbNHW2afY/+7vHjx3QNoN7kVPrn1z5JpA95uqazz+y0Wuw9T/W088ytlcr3T3/4T7qUZ3b8+HnF UxpH96fbd5Xsy1Cas89sajYqPMhGg8K7cvajUmkqvzWUP9y8o3AVaL6edt5ptTj7zOaONpvQpZ3V ocgt0CgpGnvvf//XoaOr0ah/czzKDbGhqP/WUP7XR4vaPDHc2We+cHrsEJ8sMb8FGmUXui796AeV TqWAat48N6HwUXGor0svnatoNY1qxM3we4d6mgW5BdqF6NI4RBcT+GajZqMrkUor6bVSkFugadno qmhFL6gJ0cUEvtn4y1emtflOYbwFOmQXun754+kRZWe5gvrePDdx8ewpDIu1781zE8qfR9Yy5BYw INvo0MevnC6dGXZc+tEPtNmJAtL58ePvvjLNegMDuQXMyP7KYeClTXah65evTM+OH8fAS+OyDYyK nu7XGuQWsMQudF166dzFs6dY/8CoV+fHj7/74xltzqNADt9sfO30GLufArFfBrBnoOepH54Y6mnn 1yOxRLriSV1dqtemDPn4ZuO4o39q2CEnU9p8bEhl2nlrKF2m1jPDDmefObwrR+q3Bdchfj4Y0QOr zgw7zgw7lv2BZX8AD8BqZy+DLHM7/+a5ifMnn/f4A3/5whfdq9ttse6c2h7TOK2WS1ZLeFde+GJ1 adXPxJP+2C8D9EBOpZf9ATEYEoPhBrxFmoyGf7/wj1qLLpIUjWXfIIXnGerGSJ/50kvn6KqGSdHY pysPpWhMtXfqEPuJILdAb8K7ciS+J0Vj4fheI5zO1dPOnz/5vLmdmQk/MRiSU2kpGpMi3x7i2R2G OK2WmdEhLX+eKE2KxtYj30Z2ZTmZqt2v0tSw48ywg66WhNwCAACWYD0hAACwBIuPXcQAAABWSURB VLkFAAAsQW4BAABLkFsAAMAS5BYAALAEuQUAACxBbgEAAEuQWwAAwBLkFgAAsAS5BQAALEFuAQAA S5BbAADAEuQWAACwBLkFAAAsQW4BAABL/j++6NpdoktYmQAAAABJRU5ErkJggg== "
       id="image832"
       x="18.43116"
       y="92.055008" />
  </g>
</svg>
