D:\Documents\HTL_Grieskirchen\5_m\PRE5m\gitlab_folder\webapplikation_zeitaufzeichnung\WebApp_Zeitaufzeichnung\src\main\java\com\mycompany\webapp_zeitaufzeichnung\MethodsNeedForCasting.java
D:\Documents\HTL_Grieskirchen\5_m\PRE5m\gitlab_folder\webapplikation_zeitaufzeichnung\WebApp_Zeitaufzeichnung\src\main\java\com\mycompany\webapp_zeitaufzeichnung\StudentsBean.java
D:\Documents\HTL_Grieskirchen\5_m\PRE5m\gitlab_folder\webapplikation_zeitaufzeichnung\WebApp_Zeitaufzeichnung\src\main\java\com\mycompany\webapp_zeitaufzeichnung\SprintWrapper.java
D:\Documents\HTL_Grieskirchen\5_m\PRE5m\gitlab_folder\webapplikation_zeitaufzeichnung\WebApp_Zeitaufzeichnung\src\main\java\com\mycompany\webapp_zeitaufzeichnung\IssuesBean.java
D:\Documents\HTL_Grieskirchen\5_m\PRE5m\gitlab_folder\webapplikation_zeitaufzeichnung\WebApp_Zeitaufzeichnung\src\main\java\com\mycompany\webapp_zeitaufzeichnung\Project.java
D:\Documents\HTL_Grieskirchen\5_m\PRE5m\gitlab_folder\webapplikation_zeitaufzeichnung\WebApp_Zeitaufzeichnung\src\main\java\com\mycompany\webapp_zeitaufzeichnung\GetAccessToken.java
D:\Documents\HTL_Grieskirchen\5_m\PRE5m\gitlab_folder\webapplikation_zeitaufzeichnung\WebApp_Zeitaufzeichnung\src\main\java\com\mycompany\webapp_zeitaufzeichnung\Issue.java
D:\Documents\HTL_Grieskirchen\5_m\PRE5m\gitlab_folder\webapplikation_zeitaufzeichnung\WebApp_Zeitaufzeichnung\src\main\java\com\mycompany\webapp_zeitaufzeichnung\ProjectsBean.java
D:\Documents\HTL_Grieskirchen\5_m\PRE5m\gitlab_folder\webapplikation_zeitaufzeichnung\WebApp_Zeitaufzeichnung\src\main\java\com\mycompany\webapp_zeitaufzeichnung\User.java
D:\Documents\HTL_Grieskirchen\5_m\PRE5m\gitlab_folder\webapplikation_zeitaufzeichnung\WebApp_Zeitaufzeichnung\src\main\java\com\mycompany\webapp_zeitaufzeichnung\AccessToken.java
D:\Documents\HTL_Grieskirchen\5_m\PRE5m\gitlab_folder\webapplikation_zeitaufzeichnung\WebApp_Zeitaufzeichnung\src\main\java\com\mycompany\webapp_zeitaufzeichnung\Student.java
