{
  "project_info": {
    "project_number": "258608835943",
    "firebase_url": "https://bambam-80ab8.firebaseio.com",
    "project_id": "bambam-80ab8",
    "storage_bucket": "bambam-80ab8.appspot.com"
  },
  "client": [
    {
      "client_info": {
        "mobilesdk_app_id": "1:258608835943:android:184e607a057b3f428ad3c2",
        "android_client_info": {
          "package_name": "com.cs.charlyharper"
        }
      },
      "oauth_client": [
        {
          "client_id": "258608835943-bjg1p52pnqc2a78m2aep7tjqq7e82i7n.apps.googleusercontent.com",
          "client_type": 3
        }
      ],
      "api_key": [
        {
          "current_key": "AIzaSyCpejOvGB5olxV2mtPeB7qyqyVHyVFRAek"
        }
      ],
      "services": {
        "appinvite_service": {
          "other_platform_oauth_client": [
            {
              "client_id": "258608835943-bjg1p52pnqc2a78m2aep7tjqq7e82i7n.apps.googleusercontent.com",
              "client_type": 3
            }
          ]
        }
      }
    }
  ],
  "configuration_version": "1"
}