Name,WeightClassKg,Sex,Division,Age,Best3SquatKg,Squat4Kg,Best3BenchKg,Best3DeadliftKg,TotalKg,Event,Equipment,Place
T. Lasorsa,52,M,Open,16,99.79,,72.57,111.13,283.5,SBD,Single-ply,1
L. Winter,52,F,Open,,97.52,,43.09,129.27,269.89,SBD,Single-ply,2
J. Maloney,52,M,Open,,77.11,,61.24,102.06,240.4,SBD,Single-ply,3
D. Sanderson,52,F,Open,,72.57,,40.82,99.79,213.19,SBD,Single-ply,4
A. Perry,52,M,Open,,31.75,,34.02,70.31,136.08,SBD,Single-ply,5
J. Huckyale,56,M,Open,,136.08,,90.72,145.15,371.95,SBD,Single-ply,1
Terri Dors,56,F,Open,,122.47,136.08,61.24,156.49,340.19,SBD,Single-ply,2
M. Miller,56,M,Open,,90.72,,68.04,149.69,308.44,SBD,Single-ply,3
S. Sergio,56,M,Open,,77.11,,63.5,120.2,260.82,SBD,Single-ply,4
Howie Hoffman,60,M,Open,,172.37,174.63,108.86,213.19,494.42,SBD,Single-ply,1
C. Stevens,60,M,Open,,163.29,,99.79,181.44,444.52,SBD,Single-ply,2
R. Kaufman,60,M,Open,,136.08,,102.06,163.29,401.43,SBD,Single-ply,3
V. Vicente,60,M,Open,,88.45,,56.7,113.4,258.55,SBD,Single-ply,4
J. Correia,60,M,Open,,72.57,,74.84,102.06,249.48,SBD,Single-ply,5
R. Borges,60,M,Open,,70.31,,56.7,102.06,229.06,SBD,Single-ply,6
Joe Rizza,67.5,M,Open,,181.44,,129.27,195.04,505.76,SBD,Single-ply,1
W. Shine,67.5,M,Open,,167.83,,106.59,170.1,444.52,SBD,Single-ply,2
F. Youkstetter,67.5,M,Open,,165.56,,104.33,174.63,444.52,SBD,Single-ply,3
C. Kristian,67.5,M,Open,,149.69,,108.86,181.44,439.99,SBD,Single-ply,4
R. Shamey,67.5,M,Open,,151.95,,124.74,154.22,430.91,SBD,Single-ply,5
B. Hubin,67.5,M,Open,,142.88,,,,,SBD,Single-ply,DQ
C. Young,67.5,M,Open,,,,,,,SBD,Single-ply,DQ
R. Basset,75,M,Open,,190.51,,161.03,240.4,591.94,SBD,Single-ply,1
M. Holmes,75,M,Open,,226.8,,136.08,222.26,585.13,SBD,Single-ply,2
P. Bentubo,75,M,Open,,206.38,,127.01,215.46,548.85,SBD,Single-ply,3
J. Lannon,75,M,Open,,185.97,,124.74,217.72,528.44,SBD,Single-ply,4
P. Bryant,75,M,Open,51,176.9,,92.99,244.94,514.83,SBD,Single-ply,5
K. Bonohue,75,M,Open,,188.24,,102.06,199.58,489.88,SBD,Single-ply,6
M. Cordero,75,M,Open,,147.42,,131.54,199.58,478.54,SBD,Single-ply,7
W. Smigelski,75,M,Open,,183.71,,92.99,185.97,462.66,SBD,Single-ply,8
J. Campbell,75,M,Open,,61.24,,45.36,102.06,208.65,SBD,Single-ply,9
J. Simas,75,M,Open,,204.12,,99.79,,,SBD,Single-ply,DQ
S. Lite,75,M,Open,,,,,,,SBD,Single-ply,DQ
Bruce Takala,82.5,M,Open,,281.23,,174.63,272.16,728.02,SBD,Single-ply,1
Isaac Akuna,82.5,M,Open,,240.4,,142.88,272.16,655.44,SBD,Single-ply,2
S. Quinzani,82.5,M,Open,,249.48,,154.22,249.48,653.17,SBD,Single-ply,3
M. Incutto,82.5,M,Open,,219.99,,163.29,240.4,623.69,SBD,Single-ply,4
T. Clough,82.5,M,Open,,219.99,,136.08,249.48,605.55,SBD,Single-ply,5
D. Egan,82.5,M,Open,,204.12,,122.47,215.46,542.04,SBD,Single-ply,6
R. Costa,82.5,M,Open,,174.63,,113.4,197.31,485.34,SBD,Single-ply,7
P. Stromeerg,82.5,M,Open,47,167.83,,108.86,199.58,476.27,SBD,Single-ply,8
C. Violette,82.5,M,Open,,163.29,,120.2,190.51,474,SBD,Single-ply,9
E. Olson,82.5,M,Open,14,149.69,,124.74,192.78,467.2,SBD,Single-ply,10
J. Rizza,90,M,Open,,317.52,,161.03,258.55,737.09,SBD,Single-ply,1
C. Amaechi,90,M,Open,,226.8,,167.83,244.94,639.57,SBD,Single-ply,2
K. Mattson,90,M,Open,,244.94,,145.15,229.06,619.15,SBD,Single-ply,3
B. Moore #9,90,M,Open,,197.31,,127.01,238.14,562.46,SBD,Single-ply,4
J. Balboni,90,M,Open,,199.58,,124.74,226.8,551.12,SBD,Single-ply,5
Jl Poh,90,M,Open,,181.44,,142.88,204.12,528.44,SBD,Single-ply,6
M. Thomas,90,M,Open,,176.9,,142.88,206.38,526.17,SBD,Single-ply,7
C. McCauley,90,M,Open,,185.97,,124.74,210.92,521.63,SBD,Single-ply,8
A. Ursch,90,M,Open,,158.76,,124.74,226.8,510.29,SBD,Single-ply,9
B. Bacon,90,M,Open,52,192.78,,108.86,204.12,505.76,SBD,Single-ply,10
J. Lawrence,90,M,Open,,222.26,,,,,SBD,Single-ply,DQ
B. Powell,100,M,Open,,285.76,,185.97,317.52,789.25,SBD,Single-ply,1
Jim Donahue,100,M,Open,,294.84,,183.71,281.23,759.77,SBD,Single-ply,2
R. Pauli Jr,100,M,Open,,249.48,,165.56,263.08,678.12,SBD,Single-ply,3
A. Barbera,100,M,Open,18,249.48,,167.83,238.14,655.44,SBD,Single-ply,4
C. Disangra,100,M,Open,,217.72,,140.61,272.16,630.49,SBD,Single-ply,5
S. Moran,100,M,Open,,217.72,,131.54,238.14,587.4,SBD,Single-ply,6
B. Delano,100,M,Open,,208.65,,145.15,229.06,582.87,SBD,Single-ply,7
M. Rego,100,M,Open,,231.33,,142.88,190.51,564.72,SBD,Single-ply,8
A. Solleina,100,M,Open,,190.51,,124.74,247.21,562.46,SBD,Single-ply,9
B. Djerrasi,110,M,Open,,328.85,,204.12,294.84,827.81,SBD,Single-ply,1
G. Kostas,110,M,Open,,249.48,,181.44,249.48,680.39,SBD,Single-ply,2
B. Giancoila,110,M,Open,,249.48,,176.9,240.4,666.78,SBD,Single-ply,3
B. Keefe,110,M,Open,,197.31,,158.76,,,SBD,Single-ply,DQ
S. Sanderson,110,M,Open,,260.82,,,,,SBD,Single-ply,DQ
R. Rogers,125,M,Open,,335.66,,210.92,308.44,855.02,SBD,Single-ply,1
J. Ranahan,125,M,Open,,251.74,,142.88,238.14,632.76,SBD,Single-ply,2
E. O'Donough,125,M,Open,,235.87,,170.1,226.8,632.76,SBD,Single-ply,3
G. Thorsen,125,M,Open,,199.58,,163.29,226.8,589.67,SBD,Single-ply,4
F. Daly,125,M,Open,,199.58,,138.35,199.58,537.51,SBD,Single-ply,5
D. Lagace,125+,M,Open,,185.97,,208.65,204.12,598.74,SBD,Single-ply,1
