WeightClassKg,Event,Equipment,Sex,Tested,Name,CyrillicName,BirthDate,Division,BodyweightKg,Squat1Kg,Squat2Kg,Squat3Kg,Squat4Kg,Best3SquatKg,Bench1Kg,Bench2Kg,Bench3Kg,Bench4Kg,Best3BenchKg,Deadlift1Kg,Deadlift2Kg,Deadlift3Kg,Deadlift4Kg,Best3DeadliftKg,TotalKg,Place
52,SBD,Wraps,M,Yes,Evgeniy Petrov,Евгений Петров,1996-10-26,Teen 16-17,50.55,110,-120,-120,,110,55,60,-62.5,,60,120,135,-140,,135,305,1
60,SBD,Wraps,M,Yes,Sergey Velts,Сергей Вельц,1996-04-07,Teen 16-17,59.65,-170,-180,180,,180,85,95,-100,,95,150,165,170,,170,445,1
75,SBD,Wraps,M,Yes,Vladislav Minin,Владислав Минин,1995-07-16,Teen 16-17,74.2,-170,170,185,,185,95,100,-102.5,,100,150,160,165,,165,450,2
75,SBD,Wraps,M,Yes,Mikhail Pupynin,Михаил Пупынин,1995-02-04,Teen 16-17,74.3,-145,145,160,,160,100,-107.5,-107.5,,100,150,160,165,,165,425,3
75,SBD,Wraps,M,Yes,Vadim Dityatin,Вадим Дитятин,1995-07-11,Teen 16-17,74.2,-150,-150,-150,,,,,,,,,,,,,,DQ
82.5,SBD,Wraps,M,Yes,Anton Belosvetov,Антон Белосветов,1995-01-13,Teen 16-17,79.45,170,-180,-180,,170,105,110,-112.5,,110,202.5,212.5,-215,,212.5,492.5,1
90,SBD,Wraps,M,Yes,Danila Pereslavtsev,Данила Переславцев,1996-05-13,Teen 16-17,88.8,160,170,180,190.5,180,110,117.5,-122.5,,117.5,180,200,-210,,200,497.5,1
90,SBD,Wraps,M,Yes,Yaroslav Ivanov,Ярослав Иванов,1995-07-20,Teen 16-17,84.65,130,140,150,,150,70,80,85,,85,175,195,205,,205,440,2
60,SBD,Wraps,M,Yes,Vasiliy Sashchenko,Василий Сащенко,1994-08-18,Teen 18-19,60,-100,110,-130,,110,65,-70,-72.5,,65,110,-120,120,,120,295,2
75,SBD,Wraps,M,Yes,Dmitriy Chankin,Дмитрий Чанкин,1994-12-05,Teen 18-19,73.5,120,130,-135,,130,107.5,115,117.5,,117.5,145,-162.5,,,145,392.5,1
82.5,SBD,Wraps,M,Yes,Aleksey Zabalotskiy,Алексей Забалоцкий,1993-01-13,Teen 18-19,80.2,170,190,205,,205,110,117.5,125,,125,180,192.5,195,,195,525,1
90,SBD,Wraps,M,Yes,Fedor Kazlov,Федор Казлов,1994-06-16,Teen 18-19,83,-130,-130,130,,130,-90,90,-92.5,,90,130,-142.5,-142.5,,130,350,2
52,SBD,Wraps,M,Yes,Anton Kornilov,Антон Корнилов,1988-12-12,Junior,52,80,-90,-90,,80,65,-70,70,,70,90,-105,-105,,90,240,1
67.5,SBD,Wraps,M,Yes,Ilya Gurko,Илья Гурко,1989-02-24,Junior,66.6,160,170,-175,,170,100,105,-107.5,,105,160,175,180,,180,455,2
75,SBD,Wraps,M,Yes,Dzhamshed Achilov,Джамшед Ачилов,1990-10-16,Junior,73.3,180,195,210,-225,210,115,120,-125,,120,190,200,-210,,200,530,2
75,SBD,Wraps,M,Yes,Aleksey Kuptsov,Алексей Купцов,1990-06-21,Junior,74.1,-180,180,-190,,180,105,110,112.5,,112.5,170,180,185,,185,477.5,3
82.5,SBD,Wraps,M,Yes,Aleksey Shoveynikov,Алексей Шовейников,1989-01-17,Junior,80.2,-210,210,-220,,210,130,-140,140,,140,210,220,225,,225,575,3
100,SBD,Wraps,M,Yes,Leonid Bagrintsev,Леонид Багринцев,1989-07-30,Junior,97.55,-140,140,170,,170,130,142.5,-150,,142.5,150,175,200,,200,512.5,2
67.5,SBD,Wraps,M,Yes,Aleksey Samoylov,Алексей Самойлов,1982-05-25,Open,67.2,165,175,187.5,,187.5,120,125,-130,,125,205,215,-222.5,,215,527.5,1
67.5,SBD,Wraps,M,Yes,Ilya Gurko,Илья Гурко,1989-02-24,Open,66.6,160,170,-175,,170,100,105,-107.5,,105,160,175,180,,180,455,2
67.5,SBD,Wraps,M,Yes,Sergey Kruglykhin,Сергей Круглыхин,1987-09-29,Open,61.75,130,135,-140,,135,80,-85,-85,,80,140,150,-157.5,,150,365,3
75,SBD,Wraps,M,Yes,Aleksey Kuptsov,Алексей Купцов,1990-06-21,Open,74.1,-180,180,-190,,180,105,110,112.5,,112.5,170,180,185,,185,477.5,2
75,SBD,Wraps,M,Yes,Vitaliy Bolatbaev,Виталий Болатбаев,1989-12-25,Open,74.15,160,-175,-175,,160,105,107.5,110,,110,170,175,180,,180,450,4
75,SBD,Wraps,M,Yes,Vladislav Medvedev,Владислав Медведев,1986-03-19,Open,69.5,-180,-180,-180,,,,,,,,,,,,,,DQ
82.5,SBD,Wraps,M,Yes,Andrey Lavrentev,Андрей Лавреньтьев,1973-04-04,Open,82,220,230,-240,,230,100,110,-112.5,,110,237.5,-245,-245,,237.5,577.5,4
82.5,SBD,Wraps,M,Yes,Aleksey Vinokov,Алексей Виноков,1973-10-19,Open,77.55,170,-180,190,,190,120,-125,-125,,120,200,210,-215,,210,520,5
82.5,SBD,Wraps,M,Yes,Oksana Andreeva,Оксана Андреева,1976-11-08,Open,76.5,80,85,-90,,85,50,55,-60,,55,90,100,115,,115,255,7
90,SBD,Wraps,M,Yes,Grigoriy Kostenko,Григорий Костенко,1986-07-04,Open,84.3,170,180,185,,185,110,117.5,125,,125,190,200,210,,210,520,4
90,SBD,Wraps,M,Yes,Maksim Kondakov,Максим Кондаков,1994-07-14,Open,89.5,180,195,-210,,195,115,-125,-125,,115,210,-220,-220,,210,520,5
90,SBD,Wraps,M,Yes,Maksim Denisenko,Максим Денисенко,1988-08-11,Open,88.45,170,-185,-185,,170,120,125,-127.5,,125,180,190,200,,200,495,6
90,SBD,Wraps,M,Yes,Maksim Starikov,Максим Стариков,1984-11-28,Open,88.25,130,-145,-160,,130,-110,120,-130,,120,160,-175,-175,,160,410,7
100,SBD,Wraps,M,Yes,Andrey Anisimov,Андрей Анисимов,1984-12-26,Open,99.4,-220,220,227.5,,227.5,130,140,145,,145,260,280,,,280,652.5,2
100,SBD,Wraps,M,Yes,Aleksandr Pushkarev,Александр Пушкарев,1987-07-22,Open,95.5,180,-200,200,,200,130,140,145,,145,190,200,220,,220,565,3
100,SBD,Wraps,M,Yes,Oleg Smolin,Олег Смолин,1963-04-01,Open,96.2,190,-210,-210,,190,140,145,-150,,145,190,205,212.5,,212.5,547.5,4
110,SBD,Wraps,M,Yes,Yuriy Zherebtsov,Юрий Жеребцов,1974-04-06,Open,107.5,-150,150,170,,170,130,140,-145,,140,180,200,242.5,,242.5,552.5,3
110,SBD,Wraps,M,Yes,Mikhail Batukov,Михаил Батуков,1972-09-10,Master 40-44,103.2,-202.5,-202.5,202.5,,202.5,130,135,140,,140,200,205,210,,210,552.5,1
52,SBD,Wraps,F,Yes,Yana Lazutkina,Яна Лазуткина,1993-03-01,Teen 18-19,50.7,55,60,70,,70,30,35,-37.5,,35,60,70,80,,80,185,1
48,SBD,Wraps,F,Yes,Tatyana Chechkina,Татьяна Чечкина,1986-07-26,Open,47.85,-100,105,112.5,,112.5,60,-65,-65,,60,105,115,-125,,115,287.5,3
52,SBD,Wraps,F,Yes,Natalya Paramonova,Наталья Парамонова,1972-06-02,Open,51.8,90,100,115,,115,50,-57.5,57.5,,57.5,100,110,115,,115,287.5,1
52,SBD,Wraps,F,Yes,Anna Galkina,Анна Галкина,1991-11-11,Open,51.3,80,-90,-95,,80,50,-57.5,57.5,,57.5,-85,85,-90,,85,222.5,2
52,SBD,Wraps,F,Yes,Kristina Trishina,Кристина Тришина,1994-03-10,Open,49.6,70,77.5,-87.5,,77.5,40,47.5,-52.5,,47.5,70,75,-82.5,,75,200,3
56,SBD,Wraps,F,Yes,Tatyana Razumak,Татьяна Разумак,1989-12-24,Open,56,135,-142.5,-150,,135,60,65,-67.5,,65,127.5,135,-137.5,,135,335,2
56,SBD,Wraps,F,Yes,Elena Lipaeva,Елена Липаева,1996-04-07,Open,55.3,80,-90,-90,,80,40,42.5,-45,,42.5,90,102.5,-110,,102.5,225,3
67.5,SBD,Wraps,F,Yes,Natalya Anosova,Наталья Аносова,1991-02-23,Open,60.45,95,100,-105,,100,57.5,62.5,65,,65,120,130,140,,140,305,1
67.5,SBD,Wraps,F,Yes,Ekaterina Koshkareva,Екатерина Кошкарева,1991-08-22,Open,67.1,95,-105,-105,,95,45,50,-52.5,,50,-120,120,125,,125,270,2
67.5,SBD,Wraps,F,Yes,Larisa Krikun,Лариса Крикун,1974-10-13,Open,66.2,-65,65,70,,70,42.5,45,-50,,45,90,100,-105,,100,215,3
67.5,SBD,Wraps,F,Yes,Viktoriya Beskrovnaya,Виктория Бескровная,1991-01-31,Open,66.65,-75,75,-85,,75,45,-52.5,-52.5,,45,75,85,95,,95,215,4
75,SBD,Wraps,F,Yes,Olga Gerasimyuk,Ольга Герасимюк,1996-03-01,Open,74.05,120,130,135,,135,60,-65,-65,,60,140,150,-155,,150,345,1
75,SBD,Wraps,F,Yes,Aygul Alyakova,Айгуль Алякова,1995-04-03,Open,70.84,-70,70,80,,80,35,-40,-45,,35,70,80,90,,90,205,2
90,SBD,Multi-ply,M,Yes,Kirill Shein,Кирилл Шеин,1994-03-13,Teen 18-19,89.1,190,210,-220,,210,135,145,,,145,200,217.5,-247.5,,217.5,572.5,1
75,SBD,Multi-ply,M,Yes,Konstantin Polyakov,Константин Поляков,1976-04-21,Open,73.75,160,180,,,180,110,120,,,120,180,200,-210,,200,500,2
44,B,Raw,M,Yes,Vlad Shestakov,Влад Шестаков,1999-04-08,Teen 0-13,38.6,,,,,,30,40,-45,,40,,,,,,40,1
52,B,Raw,M,Yes,Danil Shestakov,Данил Шестаков,2000-08-17,Teen 0-13,46.4,,,,,,40,50,60,,60,,,,,,60,1
52,B,Raw,M,Yes,Dmitriy Boldin,Дмитрий Болдин,1998-03-29,Teen 14-15,46,,,,,,50,52.5,55,,55,,,,,,55,1
60,B,Raw,M,Yes,Nikita Filippov,Никита Филиппов,1997-10-09,Teen 14-15,58.4,,,,,,65,-67.5,-67.5,,65,,,,,,65,1
67.5,B,Raw,M,Yes,Mark Litvinov,Марк Литвинов,1997-06-08,Teen 14-15,65,,,,,,80,85,90,,90,,,,,,90,1
67.5,B,Raw,M,Yes,Evgniy Egorchenko,Евгний Егорченко,1998-01-15,Teen 14-15,66.9,,,,,,75,80,85,,85,,,,,,85,2
56,B,Raw,M,Yes,Sergey Irkitov,Сергей Иркитов,1995-05-29,Teen 16-17,55,,,,,,70,-77.5,-77.5,77.5,70,,,,,,70,1
75,B,Raw,M,Yes,Dmitriy Levchuk,Дмитрий Левчук,1995-04-22,Teen 16-17,74.3,,,,,,-115,-115,-115,,,,,,,,,DQ
82.5,B,Raw,M,Yes,Aleksey Luzhanskiy,Алексей Лужанский,1995-10-05,Teen 16-17,82.1,,,,,,-120,120,132.5,,132.5,,,,,,132.5,1
100,B,Raw,M,Yes,Aleksandr Rogozhnikov,Александр Рогожников,1995-02-11,Teen 16-17,98.95,,,,,,145,150,-155,-155,150,,,,,,150,2
60,B,Raw,M,Yes,Minas Karapetyan,Минас Карапетян,1994-04-19,Teen 18-19,60,,,,,,132.5,137.5,-140,,137.5,,,,,,137.5,1
60,B,Raw,M,Yes,Sergey Potapov,Сергей Потапов,1999-08-19,Teen 18-19,59.3,,,,,,95,100,-102.5,,100,,,,,,100,2
67.5,B,Raw,M,Yes,Aleksey Belskiy,Алексей Бельский,1993-05-14,Teen 18-19,65.6,,,,,,110,115,-120,,115,,,,,,115,1
82.5,B,Raw,M,Yes,Dalerchon Achilov,Далерчон Ачилов,1993-02-02,Teen 18-19,82.5,,,,,,130,135,-140,,135,,,,,,135,1
90,B,Raw,M,Yes,Aleksandr Volkov,Александр Волков,1993-03-06,Teen 18-19,86.7,,,,,,142.5,150,155,,155,,,,,,155,1
60,B,Raw,M,Yes,Maksim Kultyavin,Максим Культявин,1988-12-19,Junior,57.7,,,,,,-75,75,-90,,75,,,,,,75,1
75,B,Raw,M,Yes,Evgeniy Ikryannikov,Евгений Икрянников,1990-03-24,Junior,73.7,,,,,,-130,-130,130,,130,,,,,,130,1
75,B,Raw,M,Yes,Aleksey Shatilov,Алексей Шатилов,1989-01-12,Junior,72.1,,,,,,110,-115,-115,,110,,,,,,110,3
75,B,Raw,M,Yes,Evgeniy Derbenev,Евгений Дербенев,1990-08-09,Junior,74.4,,,,,,-110,-115,-115,,,,,,,,,DQ
82.5,B,Raw,M,Yes,Vladimir Kryttsev,Владимир Крытцев,1990-11-19,Junior,76.95,,,,,,102.5,112.5,-117.5,,112.5,,,,,,112.5,2
90,B,Raw,M,Yes,Leonid Popov,Леонид Попов,1992-03-23,Junior,86.9,,,,,,155,157.5,-160,,157.5,,,,,,157.5,3
90,B,Raw,M,Yes,Ivan Frolov,Иван Фролов,1988-12-15,Junior,85.9,,,,,,120,-130,-130,,120,,,,,,120,4
90,B,Raw,M,Yes,Roman Shurygin,Роман Шурыгин,1992-10-28,Junior,89.15,,,,,,90,100,-112.5,,100,,,,,,100,5
100,B,Raw,M,Yes,Andrey Seredin,Андрей Середин,1992-05-23,Junior,93.5,,,,,,120,-142.5,-142.5,,120,,,,,,120,2
60,B,Raw,M,Yes,Dmitriy Glotov,Дмитрий Глотов,1975-02-16,Open,59.1,,,,,,-112.5,-115,-115,,,,,,,,,DQ
67.5,B,Raw,M,Yes,Dmitriy Kaygorodov,Дмитрий Кайгородов,1983-09-24,Open,65.15,,,,,,140,145,147.5,,147.5,,,,,,147.5,1
67.5,B,Raw,M,Yes,Evgeniy Mosin,Евгений Мосин,1983-10-22,Open,66.8,,,,,,115,122.5,-125,,122.5,,,,,,122.5,2
67.5,B,Raw,M,Yes,Maksim Zelenin,Максим Зеленин,1992-11-22,Open,63.9,,,,,,110,115,-120,,115,,,,,,115,3
67.5,B,Raw,M,Yes,Danila Kuzmichev,Данила Кузмичев,1986-03-02,Open,64.2,,,,,,105,115,-120,,115,,,,,,115,4
67.5,B,Raw,M,Yes,Denis Borovikov,Денис Боровиков,1986-10-17,Open,66.4,,,,,,110,115,-120,,115,,,,,,115,5
75,B,Raw,M,Yes,Daniil Lamanov,Даниил Ламанов,1987-08-17,Open,73.7,,,,,,130,-145,145,,145,,,,,,145,2
75,B,Raw,M,Yes,Vladimir Malyavkin,Владимир Малявкин,1986-03-26,Open,75,,,,,,130,142.5,-150,,142.5,,,,,,142.5,3
75,B,Raw,M,Yes,Aleksandr Burukhin,Александр Бурухин,1983-05-06,Open,73.6,,,,,,115,120,125,,125,,,,,,125,4
90,B,Raw,M,Yes,Petr Rodlinskiy,Петр Родлинский,1986-03-21,Open,83,,,,,,-150,150,-155,,150,,,,,,150,5
90,B,Raw,M,Yes,Nikolay Mikhalchenko,Николай Михальченко,1985-10-17,Open,89.15,,,,,,150,-155,-155,,150,,,,,,150,6
90,B,Raw,M,Yes,Ivan Shatyakhin,Иван Шатяхин,1988-03-22,Open,89.15,,,,,,140,147.5,-155,,147.5,,,,,,147.5,7
90,B,Raw,M,Yes,Artem Lukyanov,Артем Лукьянов,1983-04-02,Open,86,,,,,,145,-155,-155,,145,,,,,,145,8
90,B,Raw,M,Yes,Aleksandr Semikolenov,Александр Семиколенов,1988-04-06,Open,87.8,,,,,,-145,145,-150,,145,,,,,,145,9
90,B,Raw,M,Yes,Konstantin Shestakov,Константин Шестаков,1979-03-12,Open,87.4,,,,,,-140,140,-150,,140,,,,,,140,10
90,B,Raw,M,Yes,Pavel Kryshin,Павел Крышин,1982-03-15,Open,84.9,,,,,,130,-135,-135,,130,,,,,,130,11
90,B,Raw,M,Yes,Aleksandr Engelman,Александр Энгельман,1985-03-26,Open,88.1,,,,,,-130,-130,-137.5,,,,,,,,,DQ
100,B,Raw,M,Yes,Pavel Cheredov,Павел Чередов,1984-10-02,Open,99.75,,,,,,210.5,-215,215,,215,,,,,,215,2
100,B,Raw,M,Yes,Konstantin Kovazhenko,Константин Коваженко,1978-04-17,Open,91.9,,,,,,175,185,190,,190,,,,,,190,5
100,B,Raw,M,Yes,Mikhail Kiselev,Михаил Киселев,1976-05-29,Open,100,,,,,,-152.5,162.5,165,,165,,,,,,165,6
100,B,Raw,M,Yes,Sergey Manzyrev,Сергей Манзырев,1986-01-22,Open,95.8,,,,,,152.5,-162.5,162.5,,162.5,,,,,,162.5,7
100,B,Raw,M,Yes,Roman Shchurenkov,Роман Щуренков,1984-02-13,Open,97.3,,,,,,132.5,142.5,-147.5,,142.5,,,,,,142.5,8
110,B,Raw,M,Yes,Maksim Starosvetskiy,Максим Старосветский,1975-04-10,Open,102.5,,,,,,162.5,167.5,172.5,,172.5,,,,,,172.5,2
125,B,Raw,M,Yes,Grigoriy Shevelev,Григорий Шевелев,1982-08-02,Open,116.3,,,,,,165,-175,-175,,165,,,,,,165,2
125,B,Raw,M,Yes,Aleksandr Abramov,Александр Абрамов,1987-09-20,Open,111.4,,,,,,125,130,135,,135,,,,,,135,3
125,B,Raw,M,Yes,Sergey Seliverstov,Сергей Селиверстов,1978-03-02,Open,111,,,,,,110,117.5,-125,,117.5,,,,,,117.5,4
140,B,Raw,M,Yes,Dmitriy Goncharov,Дмитрий Гончаров,1988-04-26,Open,132.5,,,,,,100,105,-110,,105,,,,,,105,2
90,B,Raw,M,Yes,Seva Sandomirskiy,Сева Сандомирский,1969-01-31,Master 40-44,89.2,,,,,,145,150,-155,,150,,,,,,150,3
90,B,Raw,M,Yes,Nikolay Leshchenko,Николай Лещенко,1966-02-20,Master 45-49,87.15,,,,,,125,132.5,-137.5,,132.5,,,,,,132.5,2
100,B,Raw,M,Yes,Aleksandr Bragin,Александр Брагин,1965-01-03,Master 45-49,98.8,,,,,,155,165,-176,176,165,,,,,,165,1
100,B,Raw,M,Yes,Sergey Angel,Сергей Ангел,1955-03-25,Master 55-59,99.1,,,,,,-90,90,100,,100,,,,,,100,1
82.5,B,Raw,F,Yes,Alena Simonova,Алена Симонова,1996-01-30,Teen 16-17,78,,,,,,42.5,45,-47.5,,45,,,,,,45,1
52,B,Raw,F,Yes,Yana Lazunina,Яна Лазунина,1993-03-01,Teen 18-19,50.7,,,,,,32.5,-37.5,-37.5,,32.5,,,,,,32.5,1
60,B,Raw,F,Yes,Elena Sushkina,Елена Сушкина,1994-09-19,Teen 18-19,57.6,,,,,,40,42.5,-45,,42.5,,,,,,42.5,1
60,B,Raw,F,Yes,Galina Tukal,Галина Тукаль,1989-06-19,Junior,59.6,,,,,,45,50,55,,55,,,,,,55,1
56,B,Raw,F,Yes,Anzhela Derbeneva,Анжела Дербенева,1992-09-05,Open,54.7,,,,,,72.5,-77.5,-77.5,,72.5,,,,,,72.5,2
67.5,B,Raw,F,Yes,Mariya Prokonich,Мария Проконич,1988-09-25,Open,62.25,,,,,,40,45,-47.5,,45,,,,,,45,1
75,B,Raw,F,Yes,Natalya Korenkova,Наталья Коренкова,1980-01-07,Open,68.7,,,,,,85,95,100,,100,,,,,,100,1
82.5,B,Multi-ply,M,Yes,Dmitriy Sedymov,Дмитрий Седымов,1995-10-06,Teen 16-17,80.2,,,,,,140,150,-155,,150,,,,,,150,1
67.5,B,Multi-ply,M,Yes,Aleksey Evdokimov,Алексей Евдокимов,1993-01-27,Teen 18-19,67.2,,,,,,115,125,-132.5,,125,,,,,,125,1
90,B,Multi-ply,M,Yes,Sergey Chubarov,Сергей Чубаров,1993-12-15,Teen 18-19,88,,,,,,-130,130,-140,,130,,,,,,130,1
67.5,B,Multi-ply,M,Yes,Semen Kopushenkov,Семен Копушенков,1991-09-30,Junior,64.85,,,,,,-140,-140,140,,140,,,,,,140,1
90,B,Multi-ply,M,Yes,Viktor Sanko,Виктор Санько,1990-01-24,Junior,87.9,,,,,,-170,170,-180,,170,,,,,,170,1
67.5,B,Multi-ply,M,Yes,Artur Volchanskiy,Артур Волчанский,1988-11-11,Open,66.8,,,,,,140,-145,-147.5,,140,,,,,,140,2
75,B,Multi-ply,M,Yes,Evegniy Zuev,Евегний Зуев,1985-07-11,Open,72.65,,,,,,-180,180,-190,,180,,,,,,180,1
82.5,B,Multi-ply,M,Yes,Aleksandr Sorokin,Александр Сорокин,1980-05-29,Open,78.25,,,,,,-190,190,-200,,190,,,,,,190,2
82.5,B,Multi-ply,M,Yes,Dmitriy Sedymov,Дмитрий Седымов,1995-10-06,Open,80.2,,,,,,140,150,-155,,150,,,,,,150,4
90,B,Multi-ply,M,Yes,Konstantin Shestakov,Константин Шестаков,1979-03-12,Open,87.4,,,,,,150,-170,-170,,150,,,,,,150,3
90,B,Multi-ply,M,Yes,Ivan Shatyakhin,Иван Шатяхин,1988-03-22,Open,89.15,,,,,,-140,,,,,,,,,,,DQ
100,B,Multi-ply,M,Yes,Vasiliy Synkov,Василий Сынков,1972-09-07,Open,98.85,,,,,,230,240,250,,250,,,,,,250,2
100,B,Multi-ply,M,Yes,Vasiliy Synkov,Василий Сынков,1972-09-07,Master 40-44,98.85,,,,,,230,240,250,,250,,,,,,250,1
44,SBD,Wraps,M,No,Artem Sidorov,Артем Сидоров,1999-06-26,Teen 0-13,39.5,50,60,-70,,60,32.5,35,37.5,,37.5,-60,60,80,,80,177.5,1
44,SBD,Wraps,M,No,Denis Vodolazskiy,Денис Водолазский,2001-05-25,Teen 0-13,36.9,50,-60,62.5,,62.5,20,25,-30,,25,55,67.5,-75,,67.5,155,2
52,SBD,Wraps,M,No,Nikolay Dyakov,Николай Дьяков,1999-01-17,Teen 0-13,50.5,70,-80,80,,80,45,50,52.5,,52.5,90,100,-105,,100,232.5,1
52,SBD,Wraps,M,No,Daniil Panov,Даниил Панов,1999-12-28,Teen 0-13,51.6,-75,75,-85,,75,40,42.5,45,,45,90,-100,-100,,90,210,2
60,SBD,Wraps,M,No,Vitaliy Vrachev,Виталий Врачев,1999-04-04,Teen 0-13,58.6,-80,80,90,,90,45,47.5,50,,50,90,100,110,,110,250,1
60,SBD,Wraps,M,No,Sergey Babkin,Сергей Бабкин,2001-11-21,Teen 0-13,59.25,60,70,-75,,70,32.5,35,-37.5,,35,60,70,80,,80,185,2
75,SBD,Wraps,M,No,Grigoriy Burmatov,Григорий Бурматов,2001-05-19,Teen 0-13,72.6,80,90,-100,,90,45,-50,-50,,45,60,70,75,,75,210,1
60,SBD,Wraps,M,No,Leonid Myshkin,Леонид Мышкин,1997-06-03,Teen 14-15,59.3,-130,130,140,,140,-72.5,72.5,-80,,72.5,125,135,-140,,135,347.5,1
67.5,SBD,Wraps,M,No,Vladimir Pervyshin,Владимир Первышин,1996-08-05,Teen 16-17,65.6,-150,155,-165,,155,105,110,112.5,,112.5,160,170,177.5,,177.5,445,1
75,SBD,Wraps,M,No,Nikita Gordeev,Никита Гордеев,1994-03-16,Teen 16-17,71,145,160,170,,170,105,-115,-115,,105,175,190,200,,200,475,1
100,SBD,Wraps,M,No,Pavel Volkov,Павел Волков,1995-03-11,Teen 16-17,94,200,-220,-225,,200,125,-132.5,132.5,,132.5,200,210,230,,230,562.5,1
60,SBD,Wraps,M,No,Demur Khorava,Демур Хорава,1995-06-06,Teen 18-19,59.1,145,155,165,,165,85,-95,-95,,85,150,-165,-165,,150,400,1
67.5,SBD,Wraps,M,No,Mikhail Suslov,Михаил Суслов,1994-08-24,Teen 18-19,65.85,-190,195,200,,200,115,-120,-120,,115,210,220,-230,,220,535,1
75,SBD,Wraps,M,No,Maksim Kandakov,Максим Кандаков,1994-04-22,Teen 18-19,71.4,125,130,140,,140,75,80,-90,,80,130,135,145,,145,365,2
75,D,Raw,M,No,Konstantin Sobolev,Константин Соболев,1994-06-15,Teen 18-19,68.85,,,,,,,,,,,130,140,145,,145,145,1
82.5,SBD,Wraps,M,No,Grigoriy Borodin,Григорий Бородин,1994-08-03,Teen 18-19,81.3,217.5,-237.5,-237.5,,217.5,110,-117.5,-117.5,,110,190,-205,-205,,190,517.5,2
82.5,SBD,Wraps,M,No,Vyacheslav Sokolov,Вячеслав Соколов,1992-02-16,Teen 18-19,79,175,-185,,,175,85,90,95,,95,175,185,195,,195,465,3
90,SBD,Wraps,M,No,Dmitriy Podchasov,Дмитрий Подчасов,1994-03-03,Teen 18-19,85.5,145,160,-170,,160,100,105,-107.5,,105,190,200,207.5,,207.5,472.5,1
100,SBD,Wraps,M,No,Vladimir Maslyuk,Владимир Маслюк,1994-07-26,Teen 18-19,92.9,160,-180,180,,180,115,-120,122.5,,122.5,160,180,-200,,180,482.5,1
110,SBD,Wraps,M,No,Georgiy Usov,Георгий Усов,1993-09-01,Teen 18-19,110,250,270,-290,,270,130,140,-150,,140,265,275,-280,,275,685,1
125,SBD,Wraps,M,No,Nikita Shafikov,Никита Шафиков,1993-05-15,Teen 18-19,123.1,225,-250,-250,,225,-120,120,-130,,120,260,275,290,-300,290,635,1
67.5,SBD,Wraps,M,No,Pavel Evtushenko,Павел Евтушенко,1992-01-06,Junior,67.5,175,185,195,,195,85,-90,90,,90,205,215,220,,220,505,1
75,SBD,Wraps,M,No,Ilya Kuznetsov,Илья Кузнецов,1989-10-18,Junior,72.4,180,190,-200,,190,-155,155,160,,160,190,200,205,,205,555,1
82.5,SBD,Wraps,M,No,Vyacheslav Yurov,Вячеслав Юров,1991-02-17,Junior,82.5,260,270,-280,,270,180,185,-190,,185,255,262.5,267.5,,267.5,722.5,1
82.5,SBD,Wraps,M,No,Aleksandr Zyryanov,Александр Зырянов,1990-12-14,Junior,80.9,220,240,-252.5,,240,117.5,-127.5,127.5,,127.5,200,217.5,-225,,217.5,585,2
82.5,SBD,Wraps,M,No,Ignat Salnikov,Игнат Сальников,1991-04-09,Junior,81.5,180,-195,200,,200,120,127.5,132.5,,132.5,200,210,220,,220,552.5,4
82.5,SBD,Wraps,M,No,Vyacheslav Sokolov,Вячеслав Соколов,1992-02-16,Junior,79,175,-185,,,175,85,90,95,,95,175,185,195,,195,465,5
82.5,SBD,Wraps,M,No,Vladimir Niolaev,Владимир Ниолаев,1990-03-18,Junior,82.4,240,-272.5,-272.5,,240,,,,,,,,,,,,DQ
90,SBD,Wraps,M,No,Aleksandr Druzhinin,Александр Дружинин,1989-05-27,Junior,89.9,260,275,285,,285,160,170,-180,,170,250,-270,270,,270,725,1
90,SBD,Wraps,M,No,Danil Tsarev,Данил Царев,1990-09-12,Junior,88.5,220,240,,,240,-140,-150,150,,150,255,270,280,-288,280,670,2
100,SBD,Wraps,M,No,Stanislav Shishkin,Станислав Шишкин,1991-12-30,Junior,98.4,220,235,245,,245,120,130,135,,135,222.5,235,,,235,615,1
67.5,SBD,Wraps,M,No,Aleksey Kamanev,Алексей Каманев,1984-12-05,Open,65.1,100,110,-120,,110,75,85,-90,,85,115,125,-142.5,,125,320,4
67.5,S,Wraps,M,No,Sergey Plekhanov,Сергей Плеханов,1987-09-30,Open,65.1,-130,130,-145,,130,,,,,,,,,,,130,1
75,SBD,Wraps,M,No,Denis Grishin,Денис Гришин,1986-03-05,Open,74.7,200,-210,210,,210,115,,,,115,200,230,-250,,230,555,1
75,SBD,Wraps,M,No,Anton Morozov,Антон Морозов,1982-11-09,Open,75,-165,170,177.5,,177.5,110,115,117.5,,117.5,165,175,-185,,175,470,3
75,SBD,Wraps,M,No,Sergey Fedoseev,Сергей Федосеев,1982-01-18,Open,71.6,120,127.5,135,,135,95,100,105,,105,150,160,-165,,160,400,5
75,SBD,Wraps,M,No,Anton Morozov,Антон Морозов,1982-11-09,Open,75,,,,,,,,,,,,,,,,,NS
82.5,SBD,Wraps,M,No,Vyacheslav Yurov,Вячеслав Юров,1991-02-17,Open,82.5,260,270,-280,,270,180,185,-190,,185,255,262.5,267.5,,267.5,722.5,1
82.5,SBD,Wraps,M,No,Denis Kochmarev,Денис Кочмарев,1981-08-27,Open,81.85,-220,220,227.5,,227.5,150,160,-165,,160,212.5,230,247.5,,247.5,635,2
82.5,SBD,Wraps,M,No,Aleksandr Kuchin,Александр Кучин,1987-10-06,Open,82.3,230,245,-255,,245,135,145,-150,,145,230,245,-250,,245,635,3
82.5,SBD,Wraps,M,No,Dmitriy Sprygin,Дмитрий Спрыгин,1987-06-10,Open,81.6,135,-145,155,,155,-105,-105,105,,105,160,175,195,,195,455,6
82.5,S,Wraps,M,No,Vladimir Niolaev,Владимир Ниолаев,1990-03-18,Open,82.4,240,-272.5,-272.5,,240,,,,,,,,,,,240,1
90,SBD,Wraps,M,No,Aleksandr Druzhinin,Александр Дружинин,1989-05-27,Open,89.9,260,275,285,,285,160,170,-180,,170,250,-270,270,,270,725,1
90,SBD,Wraps,M,No,Danil Tsarev,Данил Царев,1990-09-12,Open,88.5,220,240,,,240,-140,-150,150,,150,255,270,280,-288,280,670,2
90,SBD,Wraps,M,No,Aleksey Zavorin,Алексей Заворин,1975-04-30,Open,87.3,200,215,-225,,215,150,160,-167.5,,160,230,,,,230,605,3
90,SBD,Wraps,M,No,Valeriyyo Laryushkin,Валерийё Ларюшкин,1945-06-27,Open,86.5,-140,140,-150,,140,80,90,-95,,90,160,170,-180,,170,400,8
100,SBD,Wraps,M,No,Ivan Vasyunin,Иван Васюнин,1983-08-01,Open,97.25,280,295,307.5,,307.5,215,-225,225,,225,260,275,285,,285,817,1
100,SBD,Wraps,M,No,Dmitriy Shishkin,Дмитрий Шишкин,1987-12-23,Open,92.2,-140,140,-160,,140,90,95,-100,,95,150,160,180,,180,415,5
110,SBD,Wraps,M,No,Kirill Ignatv,Кирилл Игнатьв,1984-01-20,Open,109.4,260,280,290,,290,200,210,220,,220,260,280,-300,,280,790,1
110,SBD,Wraps,M,No,Georgiy Usov,Георгий Усов,1993-09-01,Open,110,250,270,-290,,270,130,140,-150,,140,265,275,-280,,275,685,2
110,SBD,Wraps,M,No,Aleksandr Babkin,Александр Бабкин,1983-05-20,Open,109,160,-170,170,,170,110,-120,-120,,110,160,170,180,,180,460,4
125,SBD,Wraps,M,No,Anton Dementev,Антон Дементьев,1984-08-09,Open,125,-290,-290,-290,290,,200,210,-220,220,210,305,315,-322.5,,315,,DQ
125,SBD,Wraps,M,No,Sergey Farafontev,Сергей Фарафонтьев,1984-01-27,Open,118,270,285,-300,,285,180,190,-195,,190,280,300,-310,,300,775,1
125,SBD,Wraps,M,No,Viktor Litvinov,Виктор Литвинов,1982-02-07,Open,119.1,220,230,240,,240,150,155,160,,160,220,240,-245,,240,640,2
125,SBD,Wraps,M,No,Nikita Shafikov,Никита Шафиков,1993-05-15,Open,123.1,225,-250,-250,,225,-120,120,-130,,120,260,275,290,-300,290,635,3
125,SBD,Wraps,M,No,Stanislav Savinov,Станислав Савинов,1986-04-09,Open,116.15,140,150,-165,,150,125,140,-147.5,,140,215,230,245,,245,535,4
140+,SBD,Wraps,M,No,Pavel Mazyrin,Павел Мазырин,1991-02-25,Open,157.4,200,-215,-215,,200,115,125,-132.5,,125,170,180,-190,,180,505,1
110,SBD,Wraps,M,No,Evgeniy Gorshkov,Евгений Горшков,1969-12-04,Master 40-44,105,170,182.5,192.5,,192.5,100,107.5,115,,115,170,182.5,192.5,,192.5,500,2
125,SBD,Wraps,M,No,Andrey Kudrin,Андрей Кудрин,1968-06-15,Master 40-44,125,280,300,-315,,300,200,215,225,,225,280,300,320,,320,845,1
125,SBD,Wraps,M,No,Borislav Dzokhsorov,Борислав Дзохсоров,1972-07-19,Master 40-44,116.2,200,220,-240,,220,-150,150,160,,160,200,220,230,,230,610,2
110,SBD,Wraps,M,No,Valeriy Gorbunov,Валерий Горбунов,1965-01-30,Master 45-49,108.95,250,-270,270,,270,150,160,-165,,160,240,255,-270,,255,685,1
44,SBD,Wraps,F,No,Dinara Shpeyder,Динара Шпейдер,2002-10-08,Teen 0-13,23.9,35,45,50,,50,20,-22.5,22.5,,22.5,-40,40,50,,50,122.5,1
67.5,SBD,Wraps,F,No,Irina Denisova,Ирина Денисова,1990-02-10,Junior,64.3,80,90,-95,,90,40,45,50,,50,90,105,115,120.5,115,255,1
67.5,SBD,Wraps,F,No,Alena Volferts,Алена Вольферц,1992-06-23,Junior,66.4,70,80,-87.5,,80,-35,35,-42.5,,35,90,105,-110,,105,220,2
52,SBD,Wraps,F,No,Yuliya Sergeeva,Юлия Сергеева,1995-06-05,Open,51.95,-100,100,-115,,100,55,60,-62.5,,60,135,142.5,-147.5,,142.5,302.5,1
48,SBD,Wraps,F,No,Darya Markova,Дарья Маркова,1995-04-27,Open,46.95,110,-120,120,,120,60,65,67.5,,67.5,95,100,-105,,100,287.5,2
52,SBD,Wraps,F,No,Sveta Pereladova,Света Переладова,1994-10-21,Open,51.8,-70,-70,70,,70,35,-40,40,,40,75,82.5,-87.5,,82.5,192.5,4
56,SBD,Wraps,F,No,Anna Fedorova,Анна Федорова,1993-11-04,Open,55.8,125,135,145,,145,62.5,67.5,-72.5,,67.5,110,120,125,,125,337.5,1
60,SBD,Wraps,F,No,Anastasiya Amelina,Анастасия Амелина,1988-12-01,Open,60,155,-165,-165,,155,62.5,67.5,72.5,,72.5,150,160,170,,170,397.5,1
60,SBD,Wraps,F,No,Olesya Plikus,Олеся Пликус,1982-03-07,Open,58.8,-100,-100,100,,100,60,65,-70,,65,110,120,130,,130,295,2
60,SBD,Wraps,F,No,Kristina Timofeeva,Кристина Тимофеева,1995-12-30,Open,58.7,80,-90,90,,90,40,-45,-45,,40,-80,80,-87.5,,80,210,3
60,S,Wraps,F,No,Anna Kiseleva,Анна Киселева,1984-01-22,Open,59.9,60,70,-80,,70,,,,,,,,,,,70,1
82.5,SBD,Multi-ply,M,No,Sergey Marchenko,Сергей Марченко,1994-03-07,Teen 18-19,75.3,190,210,225,,225,125,135,-140,,135,220,240,250,,250,610,1
100,SBD,Multi-ply,M,No,Pavel Kunievskiy,Павел Куниевский,,Teen 18-19,100,230,242.5,-255,,242.5,120,-130,-130,,120,225,240,-252.5,,240,602.5,1
52,SBD,Multi-ply,M,No,Aleksandr Kristinin,Александр Кристинин,1992-11-15,Junior,50,150,-160,-165,,150,70,75,80,,80,160,170,180,,180,410,1
75,SBD,Multi-ply,M,No,Mikhail Zaytsev,Михаил Зайцев,1991-12-10,Junior,72.7,170,185,200,,200,100,115,122.5,,122.5,165,180,190,,190,512.5,1
90,SBD,Multi-ply,M,No,Anton Pechenenko,Антон Печененко,1991-10-13,Junior,87.3,-225,225,235,,235,-140,140,145,,145,265,275,280,,280,660,1
75,SBD,Multi-ply,M,No,Viktor Shmatkov,Виктор Шматков,1982-11-05,Open,75,200,-212.5,-215,,200,-140,-140,140,-152.5,140,190,-210,-210,,190,530,1
90,SBD,Multi-ply,M,No,Evgeniy Doroshenko,Евгений Дорошенко,,Open,85,290,310,,,310,190,200,,,200,270,-280,,,270,780,1
90,SBD,Multi-ply,M,No,Sergey Boldin,Сергей Болдин,1971-05-31,Master 40-44,88,-180,185,-200,,185,147.5,155,-160,,155,175,,,,175,515,1
56,SBD,Multi-ply,F,No,Yuliya Dubrovina,Юлия Дубровина,1983-07-14,Open,56,120,132.5,145,,145,65,-70,70,,70,115,127.5,-135,,127.5,342.5,1
60,SBD,Multi-ply,F,No,Alina Dubrovina,Алина Дубровина,1992-09-01,Open,58.9,-150,150,-157.5,,150,80,85,90,,90,120,130,135,,135,375,1
75,SBD,Multi-ply,F,No,Kseniya Baskakova,Ксения Баскакова,1992-02-23,Open,74.9,140,-150,150,,150,85,90,-95,,90,110,120,-125,,120,360,1
56,B,Multi-ply,M,No,Aleksandr Ignatov,Александр Игнатов,1997-09-19,Teen 14-15,50.25,,,,,,80,-90,90,,90,,,,,,90,1
56,B,Multi-ply,M,No,Maksim Polyakov,Максим Поляков,1995-11-27,Teen 16-17,55.65,,,,,,90,97.5,102.5,,102.5,,,,,,102.5,1
75,B,Multi-ply,M,No,Pavel Gridchin,Павел Гридчин,1993-01-03,Teen 18-19,74.75,,,,,,160,170,-180,,170,,,,,,170,1
75,B,Multi-ply,M,No,Dmitriy Kobtsev,Дмитрий Кобцев,1994-05-20,Teen 18-19,75,,,,,,145,-152.5,-152.5,,145,,,,,,145,2
100,B,Multi-ply,M,No,Aleksandr Kurmashev,Александр Курмашев,1993-07-13,Teen 18-19,97.3,,,,,,190,-200,-200,,190,,,,,,190,1
110,B,Multi-ply,M,No,Maksim Nechaev,Максим Нечаев,1993-01-09,Teen 18-19,109.45,,,,,,180,195,205,,205,,,,,,205,1
67.5,B,Multi-ply,M,No,Petr Kuptsov,Петр Купцов,1992-06-16,Junior,64.75,,,,,,-135,135,-145,,135,,,,,,135,2
75,B,Multi-ply,M,No,Ilya Teplov,Илья Теплов,1992-06-04,Junior,72.9,,,,,,-180,-180,-180,,,,,,,,,DQ
82.5,B,Multi-ply,M,No,Denis Alypov,Денис Алыпов,1992-09-22,Junior,80.6,,,,,,230,242.5,255,,255,,,,,,255,1
82.5,B,Multi-ply,M,No,Dmitriy Shenkovyak,Дмитрий Шеньковяк,1992-03-04,Junior,79.85,,,,,,130,140,-150,,140,,,,,,140,2
100,B,Multi-ply,M,No,Mikhail Kuleshov,Михаил Кулешов,1990-11-25,Junior,98,,,,,,195,205,-212.5,,205,,,,,,205,1
100,B,Multi-ply,M,No,Kostya Verkoglyadov,Костя Веркоглядов,1990-04-15,Junior,98.15,,,,,,-205,-205,-205,,,,,,,,,DQ
140,B,Multi-ply,M,No,Aleksandr Gubarenko,Александр Губаренко,1991-07-16,Junior,138.85,,,,,,-200,200,-225,,200,,,,,,200,1
60,B,Multi-ply,M,No,Igor Zhukov,Игорь Жуков,1993-09-24,Open,60,,,,,,160,165,-175,,165,,,,,,165,1
67.5,B,Multi-ply,M,No,Evgeniy Gansh,Евгений Ганш,1992-04-10,Open,66.8,,,,,,180,-187.5,-187.5,,180,,,,,,180,1
75,B,Multi-ply,M,No,Pavel Gridchin,Павел Гридчин,1993-01-03,Open,74.75,,,,,,160,170,-180,,170,,,,,,170,2
82.5,B,Multi-ply,M,No,Denis Alypov,Денис Алыпов,1992-09-22,Open,80.6,,,,,,230,242.5,255,,255,,,,,,255,1
82.5,B,Multi-ply,M,No,Yura Mikhaylov,Юра Михайлов,1987-07-22,Open,81.3,,,,,,152.5,162.5,170,,170,,,,,,170,3
82.5,B,Multi-ply,M,No,Aleksandr Abramov,Александр Абрамов,1987-09-20,Open,79.1,,,,,,-230,-240,-240,,,,,,,,,DQ
90,B,Multi-ply,M,No,Stepan Borovskiy,Степан Боровский,1986-01-22,Open,86,,,,,,200,-210,210,,210,,,,,,210,1
90,B,Multi-ply,M,No,Dmitriy Savchenko,Дмитрий Савченко,1981-08-03,Open,82.8,,,,,,170,182.5,-200,,182.5,,,,,,182.5,2
90,B,Multi-ply,M,No,Artem Bykhovets,Артем Быховец,1983-01-19,Open,85,,,,,,-230,-230,-230,,,,,,,,,DQ
100,B,Multi-ply,M,No,Ivan Vasyunin,Иван Васюнин,1983-08-01,Open,97.4,,,,,,275,287.5,300,,300,,,,,,300,1
100,B,Multi-ply,M,No,Mikhail Ryzhkin,Михаил Рыжкин,1984-08-12,Open,99.3,,,,,,220,232.5,-240,,232.5,,,,,,232.5,3
100,B,Multi-ply,M,No,Mikhail Kuleshov,Михаил Кулешов,1990-11-25,Open,98,,,,,,195,205,-212.5,,205,,,,,,205,4
110,B,Multi-ply,M,No,Aleksey Pavlovskiy,Алексей Павловский,1974-04-29,Open,104.3,,,,,,-290,290,310,,310,,,,,,310,1
52,B,Raw,M,No,Aleksey Chanov,Алексей Чанов,1995-05-22,Teen 16-17,51.7,,,,,,85,-90,-90,,85,,,,,,85,1
67.5,B,Raw,M,No,Aleksey Savchenko,Алексей Савченко,1995-07-12,Teen 16-17,65.75,,,,,,-90,-95,-95,,,,,,,,,DQ
75,B,Raw,M,No,Vladislav Mavrin,Владислав Маврин,1995-10-17,Teen 16-17,69.45,,,,,,77.5,-80,-80,,77.5,,,,,,77.5,1
82.5,B,Raw,M,No,Aleksey Slobodchikov,Алексей Слободчиков,1995-01-14,Teen 16-17,82.35,,,,,,75,85,90,,90,,,,,,90,2
100,B,Raw,M,No,Matvey Mishulin,Матвей Мишулин,1995-08-24,Teen 16-17,96.45,,,,,,155,160,172.5,,172.5,,,,,,172.5,1
125,B,Raw,M,No,Ivan Tsimbal,Иван Цимбал,1996-07-25,Teen 16-17,125,,,,,,90,102.5,110,,110,,,,,,110,1
75,B,Raw,M,No,Konstantin Sobolev,Константин Соболев,1994-06-15,Teen 18-19,69.2,,,,,,92.5,-97.5,97.5,,97.5,,,,,,97.5,1
100,B,Raw,M,No,Denis Zenin,Денис Зенин,1993-08-18,Teen 18-19,96,,,,,,200,205,210,,210,,,,,,210,1
110,B,Raw,M,No,Maksim Nechaev,Максим Нечаев,1993-01-09,Teen 18-19,109.45,,,,,,170,185,-190,,185,,,,,,185,1
110,B,Raw,M,No,Karim Kananov,Карим Кананов,1994-05-17,Teen 18-19,105.35,,,,,,130,-140,140,,140,,,,,,140,2
75,B,Raw,M,No,Artem Malykh,Артем Малых,1991-08-06,Junior,68.8,,,,,,-100,105,112.5,,112.5,,,,,,112.5,2
82.5,B,Raw,M,No,Anton Kornev,Антон Корнев,1989-04-24,Junior,82.3,,,,,,140,150,-155,,150,,,,,,150,1
90,B,Raw,M,No,Kirill Rybalchenko,Кирилл Рыбальченко,1990-08-03,Junior,87,,,,,,167.5,172.5,177.5,,177.5,,,,,,177.5,1
90,B,Raw,M,No,Aleksandr Smirnov,Александр Смирнов,1991-04-03,Junior,89,,,,,,160,170,175,,175,,,,,,175,2
100,B,Raw,M,No,Evgeniy Osykin,Евгений Осыкин,1990-03-02,Junior,92.65,,,,,,152.5,157.5,160,,160,,,,,,160,1
140,B,Raw,M,No,Aleksandr Elshin,Александр Ельшин,1992-08-17,Junior,125.7,,,,,,155,165,175,,175,,,,,,175,1
75,B,Raw,M,No,Vyacheslav Izmaylov,Вячеслав Измайлов,1985-07-31,Open,74.9,,,,,,152.5,162.5,-165,,162.5,,,,,,162.5,1
82.5,B,Raw,M,No,Andrey Berkovich,Андрей Беркович,1972-10-07,Open,80,,,,,,165,170,-177.5,,170,,,,,,170,1
82.5,B,Raw,M,No,Andrey Shelest,Андрей Шелест,1987-04-14,Open,82.5,,,,,,130,150,160,,160,,,,,,160,2
82.5,B,Raw,M,No,Sergey Zhuganenko,Сергей Жуганенко,1987-02-11,Open,76.7,,,,,,120,-130,-130,,120,,,,,,120,3
90,B,Raw,M,No,Vitaliy Dubrovin,Виталий Дубровин,1982-08-06,Open,87.5,,,,,,185,192.5,-197.5,,192.5,,,,,,192.5,1
90,B,Raw,M,No,Ivan Kudelin,Иван Куделин,1972-08-23,Open,87.8,,,,,,180,-190,-190,,180,,,,,,180,2
90,B,Raw,M,No,Aleksandr Smirnov,Александр Смирнов,1991-04-03,Open,89,,,,,,160,170,175,,175,,,,,,175,3
90,B,Raw,M,No,Sergey Voronets,Сергей Воронец,1971-10-16,Open,87.2,,,,,,145,155,-160,,155,,,,,,155,4
100,B,Raw,M,No,Ivan Vasyunin,Иван Васюнин,1983-08-01,Open,97.4,,,,,,210,220,-235,,220,,,,,,220,1
100,B,Raw,M,No,Denis Zenin,Денис Зенин,1993-08-18,Open,96,,,,,,200,205,210,,210,,,,,,210,3
100,B,Raw,M,No,Dmitriy Rudykh,Дмитрий Рудых,1986-04-21,Open,99.35,,,,,,190,197.5,200,,200,,,,,,200,4
110,B,Raw,M,No,Konstantin Elshin,Константин Ельшин,1986-07-19,Open,109.15,,,,,,215,227.5,232.5,,232.5,,,,,,232.5,1
110,B,Raw,M,No,Rustam Bylkilov,Рустам Былкилов,1985-05-22,Open,109.8,,,,,,130,142.5,147.5,,147.5,,,,,,147.5,3
110,B,Raw,M,No,Aleksandr Abramov,Александр Абрамов,1987-09-20,Open,109.8,,,,,,130,137.5,140,,140,,,,,,140,4
125,B,Raw,M,No,Oleg Saydentsal,Олег Сайденцаль,1975-03-14,Open,112.1,,,,,,235,242.5,-245,,242.5,,,,,,242.5,1
140,B,Raw,M,No,Roman Nikishin,Роман Никишин,1982-01-19,Open,125.1,,,,,,175,-185,-187.5,,175,,,,,,175,1
140+,B,Raw,M,No,Sergey Kushchev,Сергей Кущев,1967-10-21,Open,150,,,,,,250,267.5,272.5,,272.5,,,,,,272.5,1
82.5,B,Raw,M,No,Andrey Berkovich,Андрей Беркович,1972-10-07,Master 40-44,80,,,,,,165,170,-177.5,,170,,,,,,170,1
90,B,Raw,M,No,Ivan Kudelin,Иван Куделин,1972-08-23,Master 40-44,87.8,,,,,,180,-190,-190,,180,,,,,,180,1
90,B,Raw,M,No,Sergey Voronets,Сергей Воронец,1971-10-16,Master 40-44,87.2,,,,,,145,155,-160,,155,,,,,,155,2
100,B,Raw,M,No,Oleg Vrublevskiy,Олег Врублевский,1968-05-10,Master 40-44,96.8,,,,,,140,150,155,,155,,,,,,155,1
90,B,Raw,M,No,Yuriy Rubanov,Юрий Рубанов,1967-11-28,Master 45-49,88.3,,,,,,170,180,182.5,,182.5,,,,,,182.5,1
140+,B,Raw,M,No,Sergey Kushchev,Сергей Кущев,1967-10-21,Master 45-49,150,,,,,,250,267.5,272.5,,272.5,,,,,,272.5,1
110,B,Raw,M,No,Mikhail Ishchechkin,Михаил Ищечкин,1962-01-22,Master 50-54,107.35,,,,,,155,162.5,167.5,,167.5,,,,,,167.5,1
67.5,B,Raw,F,No,Natalya Morozova,Наталья Морозова,1997-09-05,Teen 14-15,65.3,,,,,,52.5,55,-57.5,,55,,,,,,55,1
60,B,Raw,F,No,Galina Tukal,Галина Тукаль,1989-06-19,Junior,58.2,,,,,,50,-57.5,-57.5,,50,,,,,,50,2
52,B,Raw,F,No,Natalya Konovalova,Наталья Коновалова,1988-09-14,Open,50.9,,,,,,100,-106,106,-107.5,106,,,,,,106,1
67.5,B,Raw,F,No,Natalya Kukushkina,Наталья Кукушкина,1982-09-17,Open,61.55,,,,,,-40,-40,40,,40,,,,,,40,2
82.5,B,Raw,F,No,Irina Nikulina,Ирина Никулина,1988-03-29,Open,81.35,,,,,,102.5,112.5,-115,,112.5,,,,,,112.5,1
44,D,Raw,M,Yes,Danil Simonov,Данил Симонов,2004-05-25,Teen 0-13,25.95,,,,,,,,,,,40,45,50,,50,50,1
60,D,Raw,M,Yes,Maksim Kutyavin,Максим Кутявин,1988-12-19,Junior,57.3,,,,,,,,,,,-135,135,-145,,135,135,1
67.5,D,Raw,M,Yes,Anatoliy Tkachenko,Анатолий Ткаченко,1990-09-12,Junior,66,,,,,,,,,,,-160,-180,-190,,,,DQ
82.5,D,Raw,M,Yes,Aleksandr Anosov,Александр Аносов,1979-11-13,Open,81.7,,,,,,,,,,,190,200,205,,205,205,1
110,D,Raw,M,Yes,Aleksandr Abramov,Александр Абрамов,1987-09-20,Open,110,,,,,,,,,,,200,210,215,,215,215,1
110,D,Multi-ply,M,Yes,Aleksandr Obukhovich,Александр Обухович,1987-08-16,Open,100.9,,,,,,,,,,,370,400,-410,,400,,DD
75,D,Raw,M,No,Konstantin Sobolev,Константин Соболев,1994-06-15,Teen 18-19,68.85,,,,,,,,,,,130,140,145,,145,145,1
75,D,Raw,M,No,Dmitriy Solonnikov,Дмитрий Солонников,1982-07-03,Open,75,,,,,,,,,,,240,250,-260,,250,250,1
