Place,Sex,Name,CyrillicName,BodyweightKg,Squat1Kg,Squat2Kg,Squat3Kg,Best3SquatKg,Squat4Kg,Bench1Kg,Bench2Kg,Bench3Kg,Best3BenchKg,Bench4Kg,Deadlift1Kg,Deadlift2Kg,Deadlift3Kg,Best3DeadliftKg,Deadlift4Kg,TotalKg,WeightClassKg,Event,Equipment,Tested,Division,Age,BirthDate
1,F,Pelageya Prokhorova,Пелагея Прохорова,29.4,25,30,-35,30,,-20,22.5,25,25,,35,40,45,45,,100,44,SBD,Raw,Yes,Youth,9,2009-10-27
1,M,Vladimir Borovkov,Владимир Боровков,74.2,120,-130,-130,120,,100,110,112.5,112.5,,175,180,-185,180,,412.5,75,SBD,Raw,Yes,Open,26,1992-11-13
1,M,Sergey Banturov,Сергей Бантуров,100.8,175,185,190,190,,120,-125,-125,120,,220,230,-240,230,,540,110,SBD,Raw,Yes,Open,36,1982-09-28
1,F,Ulyana Sorokina,Ульяна Сорокина,42,50,55,57.5,57.5,,30,35,-37.5,35,,70,75,80,80,,172.5,44,SBD,Raw,No,Teen 13-15,15,2003-11-20
1,M,Aleksey Trofimov,Алексей Трофимов,92.9,167.5,175,180,180,,125,127.5,130,130,,195,205,,205,,515,100,SBD,Raw,No,Juniors 20-23,23,1996-02-27
1,M,Aleksey Nikolaichev,Алексей Николаичев,106.4,230,235,240,240,,170,177.5,-182.5,177.5,,190,200,-210,200,,617.5,110,SBD,Raw,No,Masters 40-44,44,1975-06-09
2,M,Aleksandr Shishkin,Александр Шишкин,101.5,200,215,225,225,,130,140,,140,,230,245,-252.5,245,,610,110,SBD,Raw,No,Masters 40-44,43,1975-10-27
1,M,Evgeniy Tyutyaev,Евгений Тютяев,122.3,230,240,-250,240,,180,190,-200,190,,240,255,-260,255,,685,125,SBD,Raw,No,Open,31,1987-07-25
2,M,Ivan Sapronov,Иван Сапронов,110.9,195,210,220,220,,140,147.5,155,155,,200,-215,225,225,,600,125,SBD,Raw,No,Open,39,1979-06-30
3,M,Dmitriy Volkov,Дмитрий Волков,123.6,200,210,225,225,,135,145,-150,145,,200,220,230,230,,600,125,SBD,Raw,No,Open,36,1983-02-24
1,M,Mikhail Solovev,Михаил Соловьев,110,245,265,-275,265,,165,175,180,180,,245,275,285,285,,730,110,SBD,Wraps,No,Masters 40-44,42,1976-09-15
1,F,Elizaveta Nikolaicheva,Елизавета Николаичева,58.2,-67.5,67.5,-72.5,67.5,,,,,,,,,,,,67.5,60,S,Raw,Yes,Juniors 20-23,22,1997-06-19
1,F,Nadezhda Aprelova,Надежда Апрелова,51,,,,,,60,65,-67.5,65,,,,,,,65,52,B,Raw,Yes,Open,55,1963-07-24
1,F,Nadezhda Aprelova,Надежда Апрелова,51,,,,,,60,65,-67.5,65,,,,,,,65,52,B,Raw,Yes,Masters 55-59,55,1963-07-24
1,M,Aleksey Gusev,Алексей Гусев,70.4,,,,,,115,-117.5,117.5,117.5,,,,,,,117.5,75,B,Raw,Yes,Open,38,1981-02-27
1,M,Andrey Shiryaev,Андрей Ширяев,81.3,,,,,,130,137.5,-140,137.5,,,,,,,137.5,82.5,B,Raw,Yes,Juniors 20-23,22,1997-06-06
1,M,Aleksandr Seleznev,Александр Селезнев,78.2,,,,,,152.5,160,-167.5,160,,,,,,,160,82.5,B,Raw,Yes,Open,44,1975-05-18
2,M,Denis Popov,Денис Попов,79.3,,,,,,135,140,-142.5,140,,,,,,,140,82.5,B,Raw,Yes,Open,35,1984-06-19
3,M,Andrey Shiryaev,Андрей Ширяев,81.3,,,,,,130,137.5,-140,137.5,,,,,,,137.5,82.5,B,Raw,Yes,Open,22,1997-06-06
1,M,Roman Yurov,Роман Юров,88.5,,,,,,-175,175,-180,175,,,,,,,175,90,B,Raw,Yes,Open,33,1985-08-07
2,M,Mikhail Butenko,Михаил Бутенко,89,,,,,,137.5,147.5,-152.5,147.5,,,,,,,147.5,90,B,Raw,Yes,Open,30,1988-09-17
3,M,Ivan Ardentov,Иван Ардентов,89.2,,,,,,140,147.5,-152.5,147.5,,,,,,,147.5,90,B,Raw,Yes,Open,27,1991-08-17
4,M,Mikhail Shunaev,Михаил Шунаев,86.2,,,,,,125,135,-152.5,135,,,,,,,135,90,B,Raw,Yes,Open,30,1988-10-19
5,M,Ivan Makartet,Иван Макартет,88.8,,,,,,135,-145,-152.5,135,,,,,,,135,90,B,Raw,Yes,Open,31,1987-09-17
6,M,Mikhail Razzhivin,Михаил Разживин,86.3,,,,,,-125,125,132.5,132.5,,,,,,,132.5,90,B,Raw,Yes,Open,26,1992-12-29
1,M,Igor Koptelov,Игорь Коптелов,87.4,,,,,,142.5,-150,-150,142.5,,,,,,,142.5,90,B,Raw,Yes,Masters 45-49,46,1973-01-29
1,M,Mikhail Chachev,Михаил Чачев,97.7,,,,,,170,-175,-175,170,,,,,,,170,100,B,Raw,Yes,Open,25,1994-02-23
2,M,Oleg Solin,Олег Солин,97.8,,,,,,160,170,-175,170,,,,,,,170,100,B,Raw,Yes,Open,26,1992-11-07
3,M,Andrey Deryabin,Андрей Дерябин,99.2,,,,,,140,152.5,-162.5,152.5,,,,,,,152.5,100,B,Raw,Yes,Open,24,1994-10-07
1,M,Dmitriy Samaryanov,Дмитрий Самарянов,109.5,,,,,,175,185,,185,,,,,,,185,110,B,Raw,Yes,Open,40,1978-10-17
2,M,Aleksandr Degtev,Александр Дегтев,102.1,,,,,,140,-145,145,145,,,,,,,145,110,B,Raw,Yes,Open,32,1986-09-17
1,M,Aleksandr Gryaznov,Александр Грязнов,133.9,,,,,,160,170,-172.5,170,,,,,,,170,140,B,Raw,Yes,Open,33,1985-09-27
1,F,Ekaterina Kudryashova,Екатерина Кудряшова,54.8,,,,,,27.5,30,32.5,32.5,,,,,,,32.5,56,B,Raw,No,Teen 13-15,14,2005-04-26
1,F,Alyona Mukhina,Алёна Мухина,65.5,,,,,,55,57.5,-60,57.5,,,,,,,57.5,67.5,B,Raw,No,Teen 13-15,15,2003-11-08
1,M,Vitaliy Zhukov,Виталий Жуков,60,,,,,,52.5,55,57.5,57.5,,,,,,,57.5,60,B,Raw,No,Teen 13-15,13,2006-03-21
1,M,Dmitriys Tikhoys,Дмитрийс Тихойс,69.5,,,,,,125,130,135,135,,,,,,,135,75,B,Raw,No,Open,38,1981-05-11
2,M,Artem Grigorev,Артем Григорьев,71.7,,,,,,97.5,105,117.5,117.5,,,,,,,117.5,75,B,Raw,No,Open,24,1995-02-27
3,M,Aleksandr Evdokimov,Александр Евдокимов,69.5,,,,,,95,-100,-100,95,,,,,,,95,75,B,Raw,No,Open,36,1982-07-03
1,M,Egor Baydurov,Егор Байдуров,77.2,,,,,,130,140,145,145,,,,,,,145,82.5,B,Raw,No,Open,33,1986-01-13
2,M,Dmitriy Zhulin,Дмитрий Жулин,81.3,,,,,,145,-155,-165,145,,,,,,,145,82.5,B,Raw,No,Open,34,1985-06-13
1,M,Ivan Vagin,Иван Вагин,87.8,,,,,,125,-135,-140,125,,,,,,,125,90,B,Raw,No,Open,26,1993-03-24
1,M,Andrey Bogatkov,Андрей Богатков,86.9,,,,,,-150,150,-155,150,,,,,,,150,90,B,Raw,No,Masters 40-44,44,1975-05-12
1,M,Ivan Udalov,Иван Удалов,99.1,,,,,,140,145,-150,145,,,,,,,145,100,B,Raw,No,Open,27,1992-05-25
1,M,Aleksey Nikolaichev,Алексей Николаичев,106.4,,,,,,170,177.5,-182.5,177.5,,,,,,,177.5,110,B,Raw,No,Masters 40-44,44,1975-06-09
1,M,Anton Ganin,Антон Ганин,118.7,,,,,,195,202.5,-205,202.5,,,,,,,202.5,125,B,Raw,No,Open,34,1985-06-26
2,M,Denis Fedyakin,Денис Федякин,122.4,,,,,,195,-202.5,-202.5,195,,,,,,,195,125,B,Raw,No,Open,37,1982-06-29
1,M,Aleksandr Sidorov,Александр Сидоров,132.1,,,,,,220,-230,-230,220,,,,,,,220,140,B,Raw,No,Open,38,1980-07-20
1,M,Sergey Bolshakov,Сергей Большаков,109,,,,,,210,-227.5,-227.5,210,,,,,,,210,110,B,Single-ply,Yes,Open,28,1991-05-06
1,M,Lev Bergert,Лев Бергерт,137,,,,,,225,235,250,250,,,,,,,250,140,B,Single-ply,No,Open,53,1966-06-13
1,M,Vladimir Borovkov,Владимир Боровков,74.2,,,,,,140,-150,-150,140,,,,,,,140,75,B,Multi-ply,Yes,Open,26,1992-11-13
1,M,Aleksey Sergeev,Алексей Сергеев,81.1,,,,,,195,202.5,-205,202.5,,,,,,,202.5,82.5,B,Multi-ply,Yes,Open,38,1981-04-19
1,M,Anatoliy Sulimov,Анатолий Сулимов,94.1,,,,,,115,-125,-125,115,,,,,,,115,100,B,Multi-ply,No,Masters 60-64,60,1959-06-06
1,M,Maksim Kustov,Максим Кустов,112.3,,,,,,210,-215,,210,,,,,,,210,125,B,Multi-ply,No,Open,34,1985-03-25
1,F,Olga Koshlokova,Ольга Кошлокова,45.4,,,,,,,,,,,100,105,110,110,,110,48,D,Raw,Yes,Open,28,1991-03-02
1,F,Olga Moksina,Ольга Моксина,55.4,,,,,,,,,,,115,125,130,130,,130,56,D,Raw,Yes,Open,36,1982-07-30
1,M,Dmitriy Khlynov,Дмитрий Хлынов,66.4,,,,,,,,,,,165,170,-180,170,,170,67.5,D,Raw,Yes,Open,31,1988-05-15
1,M,Dmitriy Strokin,Дмитрий Строкин,81.5,,,,,,,,,,,230,-250,-250,230,,230,82.5,D,Raw,Yes,Open,28,1991-05-30
2,M,Kirill Aleksandrov,Кирилл Александров,77,,,,,,,,,,,192.5,-200,200,200,,200,82.5,D,Raw,Yes,Open,31,1988-01-10
1,M,Artem Platonov,Артем Платонов,86,,,,,,,,,,,190,202.5,230,230,,230,90,D,Raw,Yes,Juniors 20-23,23,1995-08-01
1,M,Aleksandr Zharkov,Александр Жарков,85.5,,,,,,,,,,,230,240,-250,240,,240,90,D,Raw,Yes,Open,31,1988-05-24
1,M,Kirill Shkuratov,Кирилл Шкуратов,95.7,,,,,,,,,,,210,220,-230,220,,220,100,D,Raw,Yes,Open,39,1979-08-28
1,M,Dmitriy Samaryanov,Дмитрий Самарянов,109.5,,,,,,,,,,,250,-272.5,,250,,250,110,D,Raw,Yes,Open,40,1978-10-17
1,M,Aleksey Dronov,Алексей Дронов,123.8,,,,,,,,,,,205,215,-225,215,,215,125,D,Raw,Yes,Juniors 20-23,22,1996-08-22
1,M,Anastasiya Lesovaya,Анастасия Лесовая,53.8,,,,,,,,,,,70,77.5,80,80,,80,56,D,Raw,No,Teen 18-19,18,2001-04-25
1,M,Mikhail Bukharev,Михаил Бухарев,73.4,,,,,,,,,,,190,205,-215,205,,205,75,D,Raw,No,Open,30,1988-09-10
1,M,Mikhail Solovev,Михаил Соловьев,110,,,,,,,,,,,245,275,285,285,,285,110,D,Raw,No,Masters 40-44,42,1976-09-15
1,M,Vladimir Marchenko,Владимир Марченко,121.6,,,,,,,,,,,320,340,360,360,,360,125,D,Raw,No,Open,34,1984-10-19
1,M,Lev Bergert,Лев Бергерт,137,,,,,,,,,,,250,,,250,,250,140,D,Raw,No,Masters 50-54,53,1966-06-13
