Place,Name,Division,Country,BodyweightKg,Squat1Kg,Squat2Kg,Squat3Kg,Best3SquatKg,Squat4Kg,Bench1Kg,Bench2Kg,Bench3Kg,Best3BenchKg,Deadlift1Kg,Deadlift2Kg,Deadlift3Kg,Best3DeadliftKg,Deadlift4Kg,TotalKg,WeightClassKg,Sex,Equipment,Event
1,Samantha Jo Crain,T1,USA,40,75,85,91,91,,27.5,32.5,35,35,67.5,75,82.5,82.5,,208.5,44,F,Multi-ply,SBD
1,Katja Roedel,J,Germany,43.5,50,60,70,70,,35,40,-42.5,40,60,70,-75,70,,180,44,F,Multi-ply,SBD
1,Leslie Watson,O,UK,47.4,90,-100,-100,90,,60,62.5,-65,62.5,100,-110,-110,100,,252.5,48,F,Multi-ply,SBD
1,Julie Schroeder,M1,UK,46.9,95,105,-107.5,105,,50,55,57.5,57.5,105,115,-122.5,115,,277.5,48,F,Multi-ply,SBD
1,Kim Sommers,O,USA,52,-182.5,182.5,-210,182.5,,87.5,-97.5,-97.5,87.5,142.5,160,-170,160,,430,52,F,Multi-ply,SBD
2,Eva Carr-Hill,O,UK,52,147.5,-157.5,-157.5,147.5,,77.5,-82.5,-82.5,77.5,-160,160,-172.5,160,,385,52,F,Multi-ply,SBD
3,Jayne Thomas,O,UK,51.2,110,125,140,140,,65,70,75,75,150,-160,160,160,,375,52,F,Multi-ply,SBD
1,Coral Quinell,M1,Australia,51.6,100,110,-120,110,-120.5,65,-70,-70,65,135,-145,-145,135,,310,52,F,Multi-ply,SBD
2,Karin Heindl,M1,Austria,51.4,75,80,-85,80,,35,40,-42.5,40,87.5,95,100,100,,220,52,F,Multi-ply,SBD
1,Linda Higgins,M3,USA,51.9,67.5,76,80,80,,35,47.5,-52.5,47.5,112.5,121,125,125,,252.5,52,F,Multi-ply,SBD
1,Angie Lee,T2,USA,54.7,80,100,-110,100,,45,55,67.5,67.5,67,92.5,105,105,,272.5,56,F,Multi-ply,SBD
1,Annelie Du Toit,J,South Africa,54.8,90,110,120,120,,40,45,-47.5,45,120,130,140,140,,305,56,F,Multi-ply,SBD
1,Amy Weisberger,O,USA,55.9,-175,-175,175,175,,112.5,120,-125.5,120,175,185,-197.5,185,,480,56,F,Multi-ply,SBD
2,Lee Steggles,O,UK,54.8,145,-160,-160,145,,85,90,-95,90,145,150,-155,150,,385,56,F,Multi-ply,SBD
1,Wendy Greig,M1,Canada,54.7,90,102.5,117.5,117.5,,50,60,-65,60,130,-147.5,-147.5,130,,307.5,56,F,Multi-ply,SBD
1,Shorty Labuschagne,T2,South Africa,60,67.5,77.5,-87.5,77.5,,32.5,37.5,42.5,42.5,77.5,87.5,95,95,,215,60,F,Multi-ply,SBD
2,Daetli Labuschagne,T2,South Africa,58.1,65,75,82.5,82.5,,35,40,-42.5,40,75,85,90,90,,212.5,60,F,Multi-ply,SBD
1,Mary Ellen Warman,O,USA,59.9,-222.5,-222.5,222.5,222.5,,100,105,-110,105,185,192.5,197.5,197.5,,525,60,F,Multi-ply,SBD
2,Melanie Diamond,O,USA,59.9,157.5,-167.5,167.5,167.5,,95,102.5,105,105,170,187.5,-200,187.5,,460,60,F,Multi-ply,SBD
1,Barbara Fruzyna,M1,USA,59.4,-115,-115,115,115,,47.5,52.5,-57.5,52.5,115,125,130,130,,297.5,60,F,Multi-ply,SBD
1,Patricia Dyer,M2,USA,59.9,142.5,150,157.5,157.5,,85,90,-93,90,145,155,-165,155,,402.5,60,F,Multi-ply,SBD
1,Elzaan Nel,T1,South Africa,62.7,95,110,117.5,117.5,,45,52.5,-55,52.5,115,125,-130,125,,295,67.5,F,Multi-ply,SBD
1,Arianne Pacek,T3,Canada,63.6,85,-90,90,90,,60,-65,65,65,120,127.5,132.5,132.5,,287.5,67.5,F,Multi-ply,SBD
1,Adivia Murphy,J,Canada,64.5,100,125,-130,125,,60,70,-75,70,130,140,145,145,,340,67.5,F,Multi-ply,SBD
1,Mariah Liggett,O,USA,66.8,200,-215,-215,200,,122.5,-127.5,127.5,127.5,190,197.5,205,205,,532.5,67.5,F,Multi-ply,SBD
2,Nancy Dangerfield,O,USA,65.8,-185,-185,185,185,,92.5,-100,-100,92.5,212.5,238,-245,238,,515.5,67.5,F,Multi-ply,SBD
3,Mariann Olivier,O,South Africa,65,-130,130,150,150,,60,65,-70,65,130,-150,-150,130,,345,67.5,F,Multi-ply,SBD
1,Jean Wayne,M3,USA,62.1,55,-72.5,-72.5,55,,37.5,45,-50,45,-62.5,65,87.5,87.5,,187.5,67.5,F,Multi-ply,SBD
1,Patricia Thomas,M5,Canada,67.2,77.5,-85,-85,77.5,,35,40,-42.5,40,95,105,-110,105,,222.5,67.5,F,Multi-ply,SBD
1,Andrea Callan,T3,UK,70.5,100,120,132.5,132.5,,70,75,80,80,-150,150,175,175,,387.5,75,F,Multi-ply,SBD
1,Stephanie van de Weghe,O,USA,74.7,-245,245,-267.5,245,,155,-167.5,167.5,167.5,182.5,205,-215,205,,617.5,75,F,Multi-ply,SBD
2,Gabi Weinberger,O,Germany,74,155,-167.5,-167.5,155,,80,87.5,-90,87.5,180,-195,-195,180,,422.5,75,F,Multi-ply,SBD
1,Pam Coons,M1,USA,70.3,117.5,-135,-137.5,117.5,,75,82.5,-87.5,82.5,102.5,125,130,130,,330,75,F,Multi-ply,SBD
1,Patricia Damon,M2,USA,73,115,-127.5,-127.5,115,,70,-77.5,-77.5,70,117.5,125,127.5,127.5,,312.5,75,F,Multi-ply,SBD
1,Schutte Evelyn,M3,,74.6,130,145,165,165,,60,70,85,85,160,175,185,185,,435,75,F,Multi-ply,SBD
1,Judy Van Niekerk,T2,South Africa,80.8,115,-125,-125,115,,67.5,-72.5,-72.5,67.5,125,132.5,-140,132.5,,315,82.5,F,Multi-ply,SBD
1,Annelie Marais,J,South Africa,81.2,160,-175,175,175,,85,95,-100,95,165,180,-190,180,,450,82.5,F,Multi-ply,SBD
1,Coral Blair,O,Austria,82.4,180,200,207.5,207.5,,90,100,105,105,215,230,242.5,242.5,,555,82.5,F,Multi-ply,SBD
2,Krista Ford,O,USA,81.8,190,-220,-220,190,,130,140,142.5,142.5,190,207.5,220,220,,552.5,82.5,F,Multi-ply,SBD
3,Patti Carson,O,USA,76.9,150,-170,-170,150,,102.5,110,-115,110,170,-180,-180,170,,430,82.5,F,Multi-ply,SBD
1,Anita Bruwer,M4,South Africa,81.9,155,176,185,185,,75,85,92.5,92.5,155,178,185,185,192.5,462.5,82.5,F,Multi-ply,SBD
1,Ulrike Herchenhein,O,Germany,88.8,192.5,202.5,210,210,,130,140,145,145,220,-235,235,235,,590,90,F,Multi-ply,SBD
1,Edith Pongracz,O,Austria,87.1,200,215,220,220,,115,127.5,132.5,132.5,205,-222.5,-222.5,205,,557.5,90,F,Multi-ply,SBD
1,Monica Overstreet,M1,USA,89.3,155,175,182.5,182.5,,92.5,100,105,105,170,190,-195,190,,477.5,90,F,Multi-ply,SBD
1,Youlundi Strydom,J,South Africa,113.6,-60,60,105,105,,80,92.5,-100,92.5,155,-167.5,167.5,167.5,,365,90+,F,Multi-ply,SBD
1,Laura Hodzhamkulova,O,Russia,127.4,180,-200,200,200,,90,100,110,110,190,200,-210,200,,510,90+,F,Multi-ply,SBD
2,Emma Ylitalo-James,O,UK,90.9,175,185,195,195,,110,-115,-115,110,185,200,-205,200,,505,90+,F,Single-ply,SBD
1,Chantal Coulon,M1,France,94.7,145,152.5,160,160,,100,110,115,115,160,170,175,175,,450,90+,F,Multi-ply,SBD
2,Jackie Bates,M1,UK,119.2,60,120,140,140,,75,102.5,-120.5,102.5,140,180,-210,180,,422.5,90+,F,Multi-ply,SBD
1,Maris Sternberg,M3,USA,91.7,-92.5,-92.5,92.5,92.5,,-60,-60,60,60,-102.5,-102.5,102.5,102.5,,255,90+,F,Multi-ply,SBD
1,Kai Weinberger,T,Germany,50,40,52.5,65,65,,25,30,-35,30,55,65,72.5,72.5,,167.5,52,M,Multi-ply,SBD
2,Lee Crain Rickey,T,USA,50,57.5,-65,67.5,67.5,,20,-25,25,25,57.5,65,70,70,,162.5,52,M,Multi-ply,SBD
1,Gavin Cronjie,T1,South Africa,50,80,90,-95,90,,37.5,40,-45,40,85,95,105,105,,235,52,M,Multi-ply,SBD
2,Jean-Pierre Fluerie,T1,South Africa,50,30,-50,-75,30,,30,40,-45,40,50,70,95,95,,165,52,M,Multi-ply,SBD
3,Hennie Cordier,T1,South Africa,50,45,50,55,55,,25,30,35,35,60,70,75,75,,165,52,M,Multi-ply,SBD
1,Mike McDermott,O,UK,52,100,120,-125,120,,50,60,-70,60,140,-160,-160,140,,320,52,M,Multi-ply,SBD
1,Joey Mitchell,O,UK,54.5,140,160,172.5,172.5,,70,75,80,80,180,202.5,-213,202.5,,455,56,M,Multi-ply,SBD
2,Steven Grey,O,UK,56,105,-115,115,115,,75,90,-95,90,125,130,135,135,,340,56,M,Multi-ply,SBD
1,Pierre Viviers,T1,South Africa,60,100,115,125,125,,-60,65,70,70,130,150,165,165,,360,60,M,Multi-ply,SBD
2,Jeffrey Naki,T1,South Africa,58.5,90,-100,100,100,,50,-60,-60,50,125,135,-145,135,,285,60,M,Multi-ply,SBD
1,David Ramokadi,T3,South Africa,58.5,110,125,140,140,,65,-85,-85,65,120,135,150,150,,355,60,M,Multi-ply,SBD
1,Mushvig Gadjiyev,J,Azerbaijan,59.9,190,200,215,215,222.5,125,-143,143,143,190,210,-216,210,,568,60,M,Multi-ply,SBD
2,Moses Tsimane,J,South Africa,58.8,145,-165,165,165,,100,115,-125,115,-200,210,220,220,,500,60,M,Multi-ply,SBD
1,Doug Heath,O,USA,59.6,192.5,217.5,230,230,,152.5,162.5,-167.5,162.5,192.5,215,-222.5,215,,607.5,60,M,Multi-ply,SBD
2,Stephane Moret,O,France,59.3,180,-240,-240,180,,120,-130,-130,120,-200,-200,200,200,,500,60,M,Multi-ply,SBD
3,Luciano Pelligrino,O,Italy,58.7,150,160,170,170,,85,-90,-90,85,190,-200,200,200,,455,60,M,Multi-ply,SBD
1,Stanley Du Plessis,T1,South Africa,67.5,130,160,-188,160,,75,-85,85,85,170,190,-200,190,,435,67.5,M,Multi-ply,SBD
1,Justin Wilson #5,T2,South Africa,66.3,-80,80,-100,80,,60,70,-80,70,100,120,140,140,,290,67.5,M,Multi-ply,SBD
1,Thomas Lackner,J,Austria,64.8,180,195,200,200,,100,107.5,115,115,185,197.5,-205,197.5,,512.5,67.5,M,Multi-ply,SBD
2,Fabrice Brottier,J,France,67.4,155,170,177.5,177.5,,102.5,107.5,110,110,190,202.5,215,215,,502.5,67.5,M,Multi-ply,SBD
3,Rustam Vagif Musayev,J,Azerbaijan,65,-160,160,180,180,,90,105,-110,105,190,205,-215,205,,490,67.5,M,Multi-ply,SBD
1,Sakari Selkäinaho,O,Finland,67.5,-250,-260,260,260,,155,-162.5,-162.5,155,-240,240,-255,240,,655,67.5,M,Multi-ply,SBD
2,Umberto Breglia,O,Italy,65.7,205,-215,-215,205,,125,-132.5,132.5,132.5,240,250,-260,250,,587.5,67.5,M,Multi-ply,SBD
3,Tim Judge,O,USA,67.5,215,-235,-235,215,,145,155,-162.5,155,205,215,-227.5,215,,585,67.5,M,Multi-ply,SBD
4,Michelangelo Minniti,O,Italy,67.2,202.5,-220,-220,202.5,,115,125,-132.5,125,215,230,240,240,,567.5,67.5,M,Multi-ply,SBD
5,Khandanise Ephraim,O,South Africa,67.5,170,180,185,185,,70,80,-85,80,200,-210,-210,200,,465,67.5,M,Multi-ply,SBD
1,Nikolay Galkin,M1,Russia,66.7,220,-240,-240,220,,130,140,-145,140,190,205,215,215,,575,67.5,M,Multi-ply,SBD
2,Martin Heindl,M1,Austria,66,160,170,175,175,,120,125,-127.5,125,205,222.5,227.5,227.5,,527.5,67.5,M,Multi-ply,SBD
1,Robert Charles,M3,USA,66.5,215,227.5,-232.5,227.5,,110,115,-117.5,115,205,-217.5,220,220,232.5,562.5,67.5,M,Multi-ply,SBD
2,Budgie Mullan,M3,UK,67.2,185,192.5,-195,192.5,,105,110,115,115,190,-200,200,200,,507.5,67.5,M,Multi-ply,SBD
DQ,Wally Brown,M3,South Africa,66.9,-200,-215,-222.5,,,,,,,,,,,,,67.5,M,Multi-ply,SBD
1,Nick Luffman,M4,UK,64,162.5,175,180,180,,82.5,87.5,90,90,180,190,195,195,,465,67.5,M,Multi-ply,SBD
1,Raimund Necessany,M6,Austria,65.5,152.5,-155,155,155,,45,50,55,55,152.5,157.5,162.5,162.5,165.5,372.5,67.5,M,Multi-ply,SBD
1,Etienne Bruwer,T1,South Africa,71.7,125,135,-140,135,,75,-82.5,82.5,82.5,160,175,180,180,,397.5,75,M,Multi-ply,SBD
2,Luke Cabot,T1,UK,69.4,130,135,140,140,,60,65,-70,65,150,160,-162.5,160,,365,75,M,Multi-ply,SBD
1,Juan Marais,T2,South Africa,71.5,145,155,-165,155,,95,102.5,110,110,-160,180,200,200,,465,75,M,Multi-ply,SBD
1,Wynand Badenhorst,T2,South Africa,74.3,-120,-120,130,130,,50,60,-80,60,140,160,180,180,,370,75,M,Multi-ply,SBD
1,Pierre Wolmarans,T3,South Africa,70.7,150,162.5,175,175,,75,90,-95,90,165,185,-187.5,185,,450,75,M,Multi-ply,SBD
1,Kristian Devetak,J,Italy,74.1,240,255,-270,255,,125,132.5,140,140,210,225,240,240,,635,75,M,Multi-ply,SBD
2,Winfried Koeck,J,Austria,74.9,200,-215,220,220,,130,145,-155,145,210,-230,-230,210,,575,75,M,Multi-ply,SBD
3,Hennie Britz,J,South Africa,74.1,200,215,-230,215,,120,-130,-130,120,190,-200,200,200,,535,75,M,Multi-ply,SBD
4,Corne Engelbrecht,J,South Africa,73.7,180,200,-215,200,,120,125,-130,125,-190,-200,200,200,,525,75,M,Multi-ply,SBD
1,Angelo Berardinelli,O,USA,74.7,305,327.5,-348,327.5,,190,205,-210,205,-240,-240,240,240,,772.5,75,M,Multi-ply,SBD
2,David Mannering,O,UK,68.4,230,250,255,255,,185,-192.5,-192.5,185,230,245,260,260,,700,75,M,Multi-ply,SBD
3,Luca Segrer,O,Italy,75,-250,255,-265,255,,140,147.5,-152.5,147.5,250,260,-265,260,,662.5,75,M,Multi-ply,SBD
4,Wolfgang Haider,O,Austria,73.8,245,257.5,262.5,262.5,,140,-147.5,147.5,147.5,230,242.5,247.5,247.5,,657.5,75,M,Multi-ply,SBD
5,Conan Ries,O,South Africa,74.7,240,255,-262.5,255,,160,170,-175,170,200,-220,220,220,,645,75,M,Multi-ply,SBD
6,Gianfranco Manca,O,South Africa,74.6,240,-250,-250,240,,140,-150,-150,140,240,-255,255,255,,635,75,M,Multi-ply,SBD
7,Corne Engelbrecht,O,South Africa,73.9,180,190,200,200,,-120,120,130,130,190,200,210,210,,540,75,M,Multi-ply,SBD
8,Rafik Lall,O,,74.7,180,200,-220,200,,100,-110,-110,100,200,220,230,230,,530,75,M,Multi-ply,SBD
9,Snakes Snyman,O,,75,170,200,210,210,,100,120,-132.5,120,165,175,185,185,,515,75,M,Multi-ply,SBD
1,John Callan,M1,UK,74.9,240,260,-270,260,,160,170,-175,170,-255,-255,255,255,,685,75,M,Multi-ply,SBD
2,Dieter John,M1,Germany,74.3,-145,145,160,160,,100,-107.5,-107.5,100,160,-172.5,172.5,172.5,,432.5,75,M,Multi-ply,SBD
1,Jawanda Avtar Singh,M2,UK,74.1,215,225,235,235,,105,-122.5,122.5,122.5,202.5,225,-230,225,,582.5,75,M,Multi-ply,SBD
1,Gordon Santee,M3,USA,73.7,175,195,212.5,212.5,,125,135,145,145,205,227.5,247.5,247.5,,605,75,M,Multi-ply,SBD
1,Terry Dangerfield,M4,USA,74.3,-205,205,222.5,222.5,,25,65,80,80,205,220,-243,220,,522.5,75,M,Multi-ply,SBD
2,James Capehart,M4,USA,74.4,162.5,177.5,182.5,182.5,,112.5,120,125,125,170,182.5,192.5,192.5,,500,75,M,Multi-ply,SBD
1,Ben Rodriguez,M6,USA,72.2,-175,175,182.5,182.5,,112.5,120,-130,120,192.5,205,-217.5,205,,507.5,75,M,Multi-ply,SBD
1,Koos Van Rooyen,T1,South Africa,80.2,120,140,-160,140,,65,75,-85,75,175,185,-195,185,,400,82.5,M,Multi-ply,SBD
1,Akbar Faradjov,T2,Azerbaijan,80.1,210,230,245,245,,145,162.5,165,165,220,255,265,265,,675,82.5,M,Multi-ply,SBD
2,Darren Sherwood,T2,UK,80.4,155,170,-185,170,,85,100,-105,100,195,210,220,220,,490,82.5,M,Multi-ply,SBD
DQ,Horace Karnes,T2,Canada,79.6,-155,-155,-155,,,,,,,,,,,,,82.5,M,Multi-ply,SBD
1,Mike Caltagirone,T3,USA,80.9,-205,205,227.5,227.5,,130,-145,-145,130,217.5,230,237.5,237.5,,595,82.5,M,Multi-ply,SBD
2,Steenkamp De Vries,T3,South Africa,78.2,160,-180,-190,160,,100,110,-115,110,200,210,220,220,,490,82.5,M,Multi-ply,SBD
1,Thomas Zeller,J,Austria,82.5,230,-250,-250,230,,145,152.5,155,155,230,242.5,-262.5,242.5,,627.5,82.5,M,Multi-ply,SBD
2,Stephan Kotze,J,South Africa,82.5,200,220,240,240,,130,-145,145,145,220,240,-260,240,,625,82.5,M,Multi-ply,SBD
3,Moukarram Djafarov,J,Azerbaijan,81.4,210,230,-240,230,,120,-130,-130,120,220,235,-245,235,,585,82.5,M,Multi-ply,SBD
4,Jan Stansfield,J,South Africa,81.3,220,-230,-230,220,,140,150,-160,150,-180,180,190,190,,560,82.5,M,Multi-ply,SBD
5,Morne Du Toit,J,South Africa,81.8,160,-170,170,170,,90,100,-110,100,190,200,-210,200,,470,82.5,M,Multi-ply,SBD
1,Enzo Vaccari,O,Italy,81.6,-320,-320,320,320,,-215,215,-220,215,270,-280,280,280,,815,82.5,M,Multi-ply,SBD
2,Peter Bartlett,O,UK,82.5,-300,300,-320,300,,200,212.5,-217.5,212.5,265,275,-285,275,,787.5,82.5,M,Multi-ply,SBD
3,Eric Athias,O,France,82.5,-300,300,-315,300,,160,172.5,-180,172.5,287.5,-300,-300,287.5,,760,82.5,M,Multi-ply,SBD
4,Özkan Savran,O,Germany,82.2,270,-290,-290,270,,150,157.5,160,160,285,-302.5,-302.5,285,,715,82.5,M,Multi-ply,SBD
5,Harald Greiner,O,Austria,80.3,250,-277.5,277.5,277.5,,132.5,137.5,142.5,142.5,255,265,-272.5,265,,685,82.5,M,Multi-ply,SBD
6,Georg Schober,O,Austria,81.6,255,-267.5,270,270,,150,160,-165,160,240,255,-262.5,255,,685,82.5,M,Multi-ply,SBD
7,Mathys Jansen,O,South Africa,82,230,-250,250,250,,140,150,-160,150,230,250,-260,250,,650,82.5,M,Multi-ply,SBD
8,Darel Van Niekerk,O,South Africa,82.4,200,-220,220,220,,140,150,-155,150,200,225,-240,225,,595,82.5,M,Multi-ply,SBD
9,Clegg Manie,O,South Africa,81.2,-180,-180,180,180,,110,-130,-130,110,180,190,200,200,,490,82.5,M,Multi-ply,SBD
DQ,Jarmo Laine,O,Finland,82,-310,-325,-325,,,-195,-195,-200,,,,,,,,82.5,M,Multi-ply,SBD
DQ,Neville Primich,O,South Africa,82,-325,-325,-340,,,-220,-220,-220,,,,,,,,82.5,M,Multi-ply,SBD
DQ,John Wood,O,USA,80.9,-290,-290,-290,,,,,,,,,,,,,82.5,M,Multi-ply,SBD
1,Antonio Graneri,M1,Australia,80.8,-225,235,-260,235,,145,165,175,175,225,260,270,270,,680,82.5,M,Multi-ply,SBD
2,Dough Peterson,M1,USA,81.6,240,255,-260,255,,137.5,145,150,150,240,260,-267.5,260,,665,82.5,M,Multi-ply,SBD
3,Erich Zeller,M1,Austria,82.2,210,225,235,235,,135,-142.5,-142.5,135,250,-270,-297.5,250,,620,82.5,M,Multi-ply,SBD
4,Renier Van Rensburg,M1,South Africa,79.8,-160,160,-180,160,,80,90,-95,90,180,190,200,200,,450,82.5,M,Multi-ply,SBD
5,Isaiah Ntsala,M1,South Africa,80.2,135,155,-165,155,,100,-110,-110,100,155,175,185,185,,440,82.5,M,Multi-ply,SBD
1,Raimond Marcier,M3,Belgium,79.2,-170,-170,170,170,,115,120,125,125,180,192.5,-200,192.5,,487.5,82.5,M,Multi-ply,SBD
DQ,Fabian Wambsgans,M3,USA,82,-287.5,-287.5,-305,,,,,,,,,,,,,82.5,M,Multi-ply,SBD
1,Robyn Brown,M4,UK,80.7,240,-262.5,262.5,262.5,,145,155,-160,155,250,265,-272.5,265,,682.5,82.5,M,Multi-ply,SBD
2,Roy Barnes,M4,USA,78.6,-192.5,192.5,-222.5,192.5,,110,-122.5,122.5,122.5,165,180,187.5,187.5,,502.5,82.5,M,Multi-ply,SBD
1,Pieter Venter,T2,South Africa,87.2,-195,-195,195,195,,95,102.5,-105,102.5,215,225,240,240,,537.5,90,M,Multi-ply,SBD
2,Christian Oberschlick,T2,Austria,85.1,200,-210,210,210,,105,112.5,-120,112.5,200,210,-215,210,,532.5,90,M,Multi-ply,SBD
3,Paul Chester,T2,UK,84.8,-120,130,160,160,,90,-100,-100,90,180,210,-230,210,,460,90,M,Multi-ply,SBD
1,Theo Senn,T3,Austria,89.7,240,255,260,260,,140,155,-160,155,240,260,265,265,,680,90,M,Multi-ply,SBD
2,Kanan Suleyman-Zade,T3,Azerbaijan,87.2,160,180,-200,180,,90,102.5,-110,102.5,160,180,200,200,,482.5,90,M,Multi-ply,SBD
1,Andrew Dexter,J,Canada,89.9,260,277.5,287.5,287.5,,190,200,-211,200,285,297.5,305,305,,792.5,90,M,Multi-ply,SBD
2,Niel Meiring,J,South Africa,89,300,330,-340,330,,185,-195,-195,185,275,-285,-290,275,,790,90,M,Multi-ply,SBD
3,Tanguy Nappe,J,France,88.7,270,280,-287.5,280,,162.5,-167.5,-167.5,162.5,245,255,257.5,257.5,,700,90,M,Multi-ply,SBD
4,Rene Wallner,J,Austria,88.2,230,240,247.5,247.5,,130,140,145,145,230,247.5,-255,247.5,,640,90,M,Multi-ply,SBD
5,Hennie Hartzenberg,J,South Africa,89.3,210,220,-235,220,,120,130,140,140,215,225,235,235,,595,90,M,Multi-ply,SBD
6,Michael Rangger,J,Austria,89.4,220,230,235,235,,125,135,140,140,220,-240,-240,220,,595,90,M,Multi-ply,SBD
DQ,Dominik Stang,J,Germany,89.3,-225,-225,-225,,,,,,,,,,,,,90,M,Multi-ply,SBD
DQ,Freddie Nonjola,J,South Africa,88.7,-180,-190,-190,,,,,,,,,,,,,90,M,Multi-ply,SBD
1,Matt Zweng,O,USA,89.6,337.5,347.5,360,360,,220,-227.5,-227.5,220,272.5,295,-302.5,295,,875,90,M,Multi-ply,SBD
2,Nickie Blackie,O,South Africa,89,300,-340,340,340,,200,230,-245,230,250,285,-305,285,,855,90,M,Multi-ply,SBD
3,Markku Vierikko,O,Finland,89.5,290,310,320,320,,190,200,205,205,300,-332.5,-332.5,300,,825,90,M,Multi-ply,SBD
4,Oliver Kopp Dr. Marc,O,Germany,89.9,250,-270,280,280,,200,-205,205,205,260,-272.5,-272.5,260,,745,90,M,Multi-ply,SBD
5,Hannes Foeger,O,Austria,85.5,-250,250,-270,250,,160,165,-170,165,260,280,-290,280,,695,90,M,Multi-ply,SBD
6,Jozsef Edmond,O,Israel,87.6,240,250,-260,250,,150,160,165,165,270,280,-290,280,,695,90,M,Multi-ply,SBD
7,Sergio Bianchi,O,Italy,89.5,260,270,-285,270,,160,170,175,175,240,250,-260,250,,695,90,M,Multi-ply,SBD
8,Franz Schoen,O,Austria,86.9,270,-285,-285,270,,-150,150,-155,150,255,270,-287.5,270,,690,90,M,Multi-ply,SBD
9,Alphonse Ruiz,O,France,87.8,220,240,-250,240,,150,160,-170,160,240,255,265,265,,665,90,M,Multi-ply,SBD
10,Shaun Crighton,O,South Africa,89.5,-215,215,-225,215,,150,165,-170,165,220,230,-240,230,,610,90,M,Multi-ply,SBD
11,Sergio Simonetti,O,Italy,90,200,-210,-215,200,,135,150,155,155,220,245,-260,245,,600,90,M,Multi-ply,SBD
12,Leon Labuschagne,O,South Africa,88.9,160,180,185,185,,120,130,-140,130,190,205,210,210,,525,90,M,Multi-ply,SBD
DQ,Joe Vougherty,O,USA,88.5,-295,-295,-295,,,,,,,,,,,,,90,M,Multi-ply,SBD
DQ,Frank Hoskins,O,UK,89.9,-300,-320,-320,,,,,,,,,,,,,90,M,Multi-ply,SBD
DQ,Patrick Verblydt,O,Belgium,87.5,225,-237.5,-237.5,225,,-120,,,,,,,,,,90,M,Multi-ply,SBD
DQ,Georg Haake,O,Germany,89.6,285,-305,-310,285,,167.5,175,180,180,-315,-315,-315,,,,90,M,Multi-ply,SBD
1,Heinz Buhl,M1,Austria,88.9,260,275,290,290,,165,180,182.5,182.5,260,287.5,295,295,,767.5,90,M,Multi-ply,SBD
2,Christian Mikysek,M1,Austria,89.5,230,270,-285,270,,130,140,147.5,147.5,260,280,-290,280,,697.5,90,M,Multi-ply,SBD
1,Randy Egli,M2,USA,89.7,285,300,-307.5,300,,170,-200,200,200,235,255,-262.5,255,,755,90,M,Multi-ply,SBD
2,Gordon Olson,M2,USA,89,272.5,302.5,-310,302.5,,-150,152.5,157.5,157.5,250,280,-295,280,,740,90,M,Multi-ply,SBD
3,David Jones,M2,UK,87,-255,255,-265,255,,170,177.5,182.5,182.5,250,260,-265,260,,697.5,90,M,Multi-ply,SBD
1,John Atkinson,M3,USA,89.4,262.5,-285,285,285,,167.5,177.5,-180,177.5,240,260,272.5,272.5,,735,90,M,Multi-ply,SBD
2,Robert Jordan,M3,UK,87.7,265,275,280,280,,145,-150,-150,145,280,-287.5,-287.5,280,,705,90,M,Multi-ply,SBD
1,Ian Morris,M4,South Africa,83.8,-170,-170,170,170,,100,110,120,120,-140,-140,140,140,,430,90,M,Multi-ply,SBD
1,Robert Bassman,M5,USA,88.6,180,197.5,-205,197.5,,127.5,-137.5,-137.5,127.5,185,200,-217.5,200,,525,90,M,Multi-ply,SBD
2,Ronald Damon,M5,USA,88.1,185,195,-205,195,,97.5,-102.5,-102.5,97.5,200,210,-215,210,,502.5,90,M,Multi-ply,SBD
1,Werner Griesel,T2,South Africa,95.7,-140,140,-170,140,,90,-100,-100,90,180,200,210,210,,440,100,M,Multi-ply,SBD
1,Bernhard Schwab,T3,Austria,97.4,300,320,-325,320,,185,195,200,200,275,290,305,305,,825,100,M,Multi-ply,SBD
2,Matthias Lenhart,T3,Austria,96,270,-280,-280,270,,165,175,-185,175,220,240,-260,240,,685,100,M,Multi-ply,SBD
1,Hannes Winkler,J,Austria,100,300,-320,320,320,,140,150,155,155,240,250,260,260,,735,100,M,Multi-ply,SBD
2,Duane Matthys,J,South Africa,97.2,220,250,260,260,,145,165,170,170,250,265,-275,265,,695,100,M,Multi-ply,SBD
3,Falko Jentsch,J,Germany,98.8,240,-260,260,260,,155,165,172.5,172.5,260,-270,-275,260,,692.5,100,M,Multi-ply,SBD
4,Pieter Opperman,J,South Africa,97.5,210,225,-235,225,,150,160,165,165,230,245,250,250,,640,100,M,Multi-ply,SBD
5,Patrick Kohlmann,J,Germany,96.2,225,-240,-245,225,,130,142.5,-150,142.5,225,240,247.5,247.5,,615,100,M,Multi-ply,SBD
6,Hannes Goosen,J,South Africa,98.6,190,205,220,220,,125,135,140,140,195,215,225,225,,585,100,M,Multi-ply,SBD
1,Gerhard Depner,O,Austria,98.6,330,350,360,360,,210,220,-225,220,325,347.5,355,355,,935,100,M,Multi-ply,SBD
2,Kevin Hammerton,O,UK,98.8,350,375,385,385,,-210,210,217.5,217.5,-325,325,-332.5,325,,927.5,100,M,Multi-ply,SBD
3,Hugh Dunagan,O,USA,100,320,-337.5,345,345,,205,212.5,220,220,-320,-332.5,332.5,332.5,,897.5,100,M,Multi-ply,SBD
4,Chad Hammond,O,USA,99.5,-320,320,-332.5,320,,205,-220,227.5,227.5,-307.5,307.5,315,315,,862.5,100,M,Multi-ply,SBD
5,Harald Selsam,O,Germany,99.8,325,345,-360,345,,-210,210,215,215,290,-310,-310,290,,850,100,M,Multi-ply,SBD
6,Hannes Sommer,O,Austria,96,275,-295,-295,275,,160,167.5,-172.5,167.5,270,-290,290,290,,732.5,100,M,Multi-ply,SBD
7,Robbert Greeff,O,South Africa,96.2,200,220,230,230,,150,160,-170,160,250,-270,270,270,,660,100,M,Multi-ply,SBD
8,Quintus Dippenaar,O,South Africa,99.6,240,260,-280,260,,140,150,160,160,210,225,235,235,,655,100,M,Multi-ply,SBD
9,Dawie Els,O,South Africa,98.5,200,215,-230,215,,-125,125,-135,125,200,215,230,230,,570,100,M,Multi-ply,SBD
DQ,Matteo Armellini,O,Italy,99.1,-330,-330,-330,,,,,,,,,,,,,100,M,Multi-ply,SBD
DQ,Krister Kangas,O,Finland,97.9,305,320,330,330,,185,-192.5,192.5,192.5,-330,-330,-330,,,,100,M,Multi-ply,SBD
1,Sakari Mäntylä,M1,Finland,97.6,280,300,315,315,,155,165,170,170,290,300,-305,300,,785,100,M,Multi-ply,SBD
2,Philip Bell,M1,UK,98.3,245,265,-280,265,,200,210,-215,210,292.5,302.5,-317.5,302.5,,777.5,100,M,Multi-ply,SBD
3,Eduard Kesaev,M1,Russia,99.9,250,260,-265,260,,190,-200,-200,190,260,-270,-270,260,,710,100,M,Multi-ply,SBD
4,Michael Higgins,M1,USA,90.9,205,227.5,-260,227.5,,160,165,172.5,172.5,215,-242.5,242.5,242.5,,642.5,100,M,Multi-ply,SBD
5,Henry Fourie,M1,South Africa,96.5,120,130,140,140,,60,75,,75,135,145,160,160,,375,100,M,Multi-ply,SBD
1,Louis Dunn,M2,South Africa,98.6,255,270,-282.5,270,,-162.5,162.5,-167.5,162.5,250,270,282.5,282.5,,715,100,M,Multi-ply,SBD
2,Dick Zenzen,M2,USA,98.7,262.5,282.5,292.5,292.5,,157.5,167.5,-172.5,167.5,217.5,240,255,255,,715,100,M,Multi-ply,SBD
3,Heinz Stroj,M2,Austria,98.7,-235,235,-245,235,,150,-155,-155,150,260,-267.5,-270,260,,645,100,M,Multi-ply,SBD
4,Jess Lopez,M2,USA,97.5,245,-262.5,-262.5,245,,145,-147.5,147.5,147.5,240,-250,-250,240,,632.5,100,M,Multi-ply,SBD
5,Theunis Pretorius,M2,South Africa,99.4,200,-220,-220,200,,130,-140,-140,130,200,220,-240,220,,550,100,M,Multi-ply,SBD
1,Jon Wolbers,M3,Canada,91.4,172.5,192.5,195,195,,-140,140,145,145,217.5,237.5,242.5,242.5,,582.5,100,M,Multi-ply,SBD
2,John Burgard,M3,USA,97.2,210,-222.5,-225,210,,-90,90,-95,90,-210,210,-220,210,,510,100,M,Multi-ply,SBD
1,Dan Hamblet,M4,USA,99.1,227.5,240,245,245,,147.5,150,152.5,152.5,277.5,287.5,297.5,297.5,,695,100,M,Multi-ply,SBD
2,Tom Bronkhorst,M4,South Africa,95.7,220,230,-247.5,230,,150,160,170,170,250,270,-285,270,,670,100,M,Multi-ply,SBD
1,Paul Schutte,M5,South Africa,91.6,140,155,-165,155,,70,80,-85,80,160,175,-185,175,,410,100,M,Multi-ply,SBD
1,Richard Austin,M6,USA,98.1,-235,235,-252.5,235,,-137.5,137.5,147.5,147.5,217.5,-230,-230,217.5,,600,100,M,Multi-ply,SBD
1,Juergen Rauch,T2,Austria,108.2,140,-180,-180,140,,95,107.5,-125.5,107.5,140,180,-200.5,180,,427.5,110,M,Multi-ply,SBD
1,Timo Schmitz,J,Germany,102.8,225,250,265,265,,150,162.5,-170,162.5,240,272.5,285,285,,712.5,110,M,Multi-ply,SBD
2,Albertus Jordaan,J,South Africa,105,195,205,-220,205,,130,140,-145,140,225,235,-242.5,235,,580,110,M,Multi-ply,SBD
1,Paul Urchick,O,USA,106.9,380,400,-410,400,,220,230,-232.5,230,325,332.5,-340,332.5,,962.5,110,M,Multi-ply,SBD
2,Michael Weiler,O,Austria,109.8,375,390,400,400,,210,220,-227.5,220,300,320,-325,320,,940,110,M,Multi-ply,SBD
3,Rufat Agaev,O,Azerbaijan,108.6,-330,-330,330,330,,210,-225,225,225,310,330,-355,330,,885,110,M,Multi-ply,SBD
4,Frank Schütze,O,Germany,103.8,300,320,330,330,,240,-250,-250,240,-270,270,-280,270,,840,110,M,Multi-ply,SBD
5,Keith Thompson,O,UK,108.3,290,-305,-305,290,,205,215,-217.5,215,320,335,-337.5,335,,840,110,M,Multi-ply,SBD
6,Kevin Green Brian,O,South Africa,107,280,-310,310,310,,200,-230,230,230,280,-320,-320,280,,820,110,M,Multi-ply,SBD
7,Alessandro Schiavon,O,Italy,107.7,250,260,275,275,,160,170,-182.5,170,270,280,290,290,,735,110,M,Multi-ply,SBD
8,Tiekie Bezuidenhout,O,South Africa,107.2,-240,250,260,260,,-180,180,-190,180,240,260,270,270,,710,110,M,Multi-ply,SBD
9,Andre Gouws,O,South Africa,101.6,120,140,155,155,,70,80,90,90,170,-180,180,180,,425,110,M,Multi-ply,SBD
1,Doug Williams,M1,UK,108.2,280,300,310,310,,180,195,-200,195,300,320,325,325,,830,110,M,Multi-ply,SBD
1,Josef Pollendorfer,M2,Austria,104.5,270,-285,292.5,292.5,,140,150,-157.5,150,250,260,272.5,272.5,,715,110,M,Multi-ply,SBD
1,Bill West,M3,UK,104.5,335,365,-380,365,,185,-190,190,190,300,320,-330,320,,875,110,M,Multi-ply,SBD
DQ,Joe DeVerville,M3,USA,106.2,-257.5,-275,-282.5,,,,,,,,,,,,,110,M,Multi-ply,SBD
1,Larry Sandberg,M4,USA,102.5,250,272.5,-285,272.5,,180,-192.5,-192.5,180,262.5,280,285,285,,737.5,110,M,Multi-ply,SBD
1,Vugar Zeynalov,J,Azerbaijan,122.1,-260,270,300,300,,165,185,-190,185,220,250,270,270,,755,125,M,Multi-ply,SBD
DQ,Bakhtiyar Guliyev,J,Azerbaijan,112,-300,-300,-300,,,,,,,,,,,,,125,M,Multi-ply,SBD
1,Craig Gallo,O,USA,124,400,-422.5,-422.5,400,,230,237.5,-242.5,237.5,-327.5,327.5,-340,327.5,,965,125,M,Multi-ply,SBD
2,Rudolf Kunitzky,O,Austria,114.2,340,355,-360,355,,230,-240,240,240,315,330,335,335,,930,125,M,Multi-ply,SBD
3,Lee Marshall,O,UK,113.8,360,370,-380,370,,180,185,190,190,320,330,340,340,,900,125,M,Multi-ply,SBD
4,Alain Jungo,O,Switzerland,119.9,310,340,-350,340,,170,-180,-180,170,320,350,370,370,,880,125,M,Multi-ply,SBD
5,Ruggiero Chiannese,O,South Africa,121.8,300,320,-330,320,,220,230,-240,230,320,330,-350,330,,880,125,M,Multi-ply,SBD
6,Stefan Gladu,O,Switzerland,117.3,280,290,300,300,,180,190,200,200,290,300,312.5,312.5,,812.5,125,M,Multi-ply,SBD
7,Robert Möbius,O,Austria,121.9,310,-320,320,320,,202.5,-207.5,-207.5,202.5,290,-300,-300,290,,812.5,125,M,Multi-ply,SBD
8,Nigel Hatton,O,UK,120.6,290,-320,-320,290,,-190,190,-195,190,290,320,330,330,,810,125,M,Multi-ply,SBD
9,Dave Chouinard,O,Canada,112.6,-265,285,-307.5,285,,165,182.5,-190,182.5,225,252.5,260,260,,727.5,125,M,Multi-ply,SBD
10,Bennie Rossouw,O,South Africa,125,220,240,260,260,,150,160,175,175,240,260,280,280,,715,125,M,Multi-ply,SBD
11,Botes Botha,O,South Africa,117.2,230,250,-270,250,,140,160,175,175,220,240,260,260,,685,125,M,Multi-ply,SBD
12,Michael Knopf,O,Germany,114.2,235,-255,-260,235,,165,-172.5,-172.5,165,230,245,-252.5,245,,645,125,M,Multi-ply,SBD
DQ,Ano Turtiainen,O,Finland,123.8,-380,-400,-400,,,-260.5,-260.5,-260.5,,,,,,,,125,M,Multi-ply,SBD
DQ,Arto Turonen,O,Finland,116.3,-340,-350,-350,,,-230,-230,-230,,,,,,,,125,M,Multi-ply,SBD
1,Reijo Haltunen,M1,Finland,122.4,325,-350,350,350,,190,200,205,205,-300,-300,300,300,,855,125,M,Multi-ply,SBD
2,Mark Goovaerts,M1,Belgium,120.7,290,310,320,320,,170,180,192.5,192.5,290,310,325,325,,837.5,125,M,Multi-ply,SBD
3,Peter Pacas,M1,Austria,115,305,-320,322.5,322.5,,155,160,165,165,312.5,320,-330,320,,807.5,125,M,Multi-ply,SBD
1,Ian Visser,M2,South Africa,116.3,260,280,-290,280,,180,190,200,200,220,230,240,240,,720,125,M,Multi-ply,SBD
2,Rex Thomas,M2,UK,122.8,,,25,25,,-65,-65,65,65,-65,-65,65,65,,155,125,M,Raw,SBD
1,Charles Binkowski,M3,USA,112.6,227.5,-245,245,245,,170,-182.5,-182.5,170,227.5,240,250,250,,665,125,M,Multi-ply,SBD
2,Jerry O'Conner,M3,Canada,113,-235,235,-252.5,235,,167.5,-175,-175,167.5,-102.5,-102.5,102.5,102.5,,505,125,M,Multi-ply,SBD
1,Tyson Cobb,J,USA,134.6,-307.5,307.5,-347.5,307.5,,200,215,227.5,227.5,282.5,300,-320,300,,835,140,M,Multi-ply,SBD
1,Richard Coates,O,USA,133.4,350,377.5,410,410,,240,260,272.5,272.5,-320,320,340,340,,1022.5,140,M,Multi-ply,SBD
2,Gerhard Holleitner,O,Austria,125.2,310,325,-335,325,,225,235,240,240,310,317.5,-347.5,317.5,,882.5,140,M,Multi-ply,SBD
3,Mike Robertson,O,South Africa,133.2,320,-360,360,360,,200,215,222.5,222.5,300,-330,-330,300,,882.5,140,M,Multi-ply,SBD
4,Hubert Dörer,O,Austria,126,305,325,-330,325,,200,210,-217.5,210,305,320,-332.5,320,,855,140,M,Multi-ply,SBD
5,Michael Barker,O,South Africa,139.6,280,330,-350,330,,200,-210,210,210,260,-280,280,280,,820,140,M,Multi-ply,SBD
6,Chris Stark #1,O,UK,126.8,280,-300,-300,280,,165,175,180,180,310,-335,-335,310,,770,140,M,Multi-ply,SBD
7,Hannie Smith,O,South Africa,130.6,300,-320,-320,300,,170,190,-200,190,240,-265,265,265,,755,140,M,Multi-ply,SBD
1,Matt Israelson,M1,USA,133.4,250,282.5,325,325,,185,202.5,-210,202.5,230,250,-260,250,,777.5,140,M,Multi-ply,SBD
1,Bruce Greig,M2,Canada,128.5,300,320,335,335,,180,190,-197.5,190,340,355,365,365,,890,140,M,Multi-ply,SBD
1,Ross Aaron,J,USA,146.8,302.5,327.5,-350,327.5,,195,210,220,220,297.5,320,-332.5,320,,867.5,140+,M,Multi-ply,SBD
2,Mags Schultz,J,Canada,158.3,280,307.5,320,320,,200,217.5,-225,217.5,250,272.5,285,285,,822.5,140+,M,Multi-ply,SBD
3,Chris Rannals,J,USA,144.4,272.5,-287.5,287.5,287.5,,182.5,-205,-205,182.5,320,342.5,-350,342.5,,812.5,140+,M,Multi-ply,SBD
1,Peter Tregloan,O,UK,155.8,365,390,410,410,,235,245,250,250,345,357.5,365,365,,1025,140+,M,Multi-ply,SBD
2,James Voronin,O,USA,163.4,395,-415,-415,395,,260,275,280,280,320,327.5,-345,327.5,,1002.5,140+,M,Multi-ply,SBD
3,Josef Newrkla,O,Austria,152.5,350,370,380,380,,245,255,-260,255,285,300,307.5,307.5,,942.5,140+,M,Multi-ply,SBD
4,Thomas Wegscheider,O,Austria,175.4,290,310,320,320,,195,205,215,215,290,310,-320,310,,845,140+,M,Multi-ply,SBD
5,Gary Baum,O,USA,174.2,300,320,340,340,,142.5,155,-165,155,270,282.5,295,295,,790,140+,M,Multi-ply,SBD
6,Ben Visagie,O,South Africa,167.2,300,340,350,350,,120,150,-160,150,220,-260,260,260,,760,140+,M,Multi-ply,SBD
DQ,Brett Burchall,O,South Africa,158.6,-380,-380,-420,,,-277.5,-285,-285,,,,,,,,140+,M,Multi-ply,SBD
1,Phil Niemandt,M2,South Africa,140.7,280,310,330,330,,-120,-120,120,120,270,-290,290,290,,740,140+,M,Multi-ply,SBD
2,Lee Pesca,M2,USA,143.7,-165,165,205,205,,102.5,-122.5,-127.5,102.5,185,227.5,232.5,232.5,,540,140+,M,Multi-ply,SBD
1,Katja Roedel,J,Germany,43.8,,,,,,35,-40,-40,35,,,,,,35,44,F,Multi-ply,B
1,Leslie Watson,O,UK,49.3,,,,,,60,65,67.5,67.5,,,,,,67.5,52,F,Multi-ply,B
1,Annelie Du Toit,J,South Africa,55.1,,,,,,35,37.5,40,40,,,,,,40,56,F,Multi-ply,B
1,Daetli Labuschagne,T2,South Africa,59,,,,,,32.5,35,37.5,37.5,,,,,,37.5,60,F,Multi-ply,B
1,Cornelia Mueller,O,Austria,56.3,,,,,,85,92.5,97.5,97.5,,,,,,97.5,60,F,Multi-ply,B
2,Cristina Boscolo,O,Italy,59.1,,,,,,75,80,-82.5,80,,,,,,80,60,F,Multi-ply,B
1,Elzaan Nel,T1,South Africa,63.7,,,,,,50,52.5,-55,52.5,,,,,,52.5,67.5,F,Multi-ply,B
DQ,Mariann Olivier,O,South Africa,64.9,,,,,,-70,-70,-70,,,,,,,,67.5,F,Multi-ply,B
1,Ofelia Giaccheloni,M2,Italy,63.5,,,,,,90,-95,-95,90,,,,,,90,67.5,F,Multi-ply,B
1,Michaela Zimmer,O,Austria,73.3,,,,,,110,125,-135,125,,,,,,125,75,F,Multi-ply,B
1,Judy Van Niekerk,T2,South Africa,80.8,,,,,,70,-75,-75,70,,,,,,70,82.5,F,Multi-ply,B
1,Annelie Marais,J,South Africa,80.5,,,,,,80,85,90,90,,,,,,90,82.5,F,Multi-ply,B
1,Anita Bruwer,M4,South Africa,81.1,,,,,,70,77.5,82.5,82.5,,,,,,82.5,82.5,F,Multi-ply,B
1,Tarja Rantanen,O,Finland,87.7,,,,,,137.5,-145,-145,137.5,,,,,,137.5,90,F,Multi-ply,B
2,Monica Johnson,O,USA,88.6,,,,,,95,100,-105,100,,,,,,100,90,F,Multi-ply,B
1,Jackie Bates,M1,UK,118.2,,,,,,75,95,-105,95,,,,,,95,90+,F,Multi-ply,B
1,Steven Grey,O,UK,55.5,,,,,,70,85,90,90,,,,,,90,56,M,Multi-ply,B
1,Anatoliy Nefedov,O,Russia,59.8,,,,,,-95,95,105,105,,,,,,105,60,M,Multi-ply,B
1,Otto Steinhoeffler,M3,Austria,59.4,,,,,,100,-110.5,-110.5,100,,,,,,100,60,M,Multi-ply,B
1,Marton Richter,T2,Germany,67.3,,,,,,90,97.5,-102.5,97.5,,,,,,97.5,67.5,M,Multi-ply,B
1,Paolo Bonavita,O,Italy,67.1,,,,,,135,145,155,155,,,,,,155,67.5,M,Multi-ply,B
2,Philippe Baudoin,O,France,67.4,,,,,,140,145,-150,145,,,,,,145,67.5,M,Multi-ply,B
1,Ivano Fialdini,M1,Italy,65.6,,,,,,135,140,145,145,,,,,,145,67.5,M,Multi-ply,B
2,Martin Heindl,M1,Austria,66.4,,,,,,117.5,122.5,-130,122.5,,,,,,122.5,67.5,M,Multi-ply,B
3,Giuseppe D'amico,M1,Italy,66.1,,,,,,105,110,-112.5,110,,,,,,110,67.5,M,Multi-ply,B
1,Wally Brown,M3,South Africa,67.4,,,,,,125,-130,-130,125,,,,,,125,67.5,M,Multi-ply,B
2,Budgie Mullan,M3,UK,66.7,,,,,,105,112.5,-115,112.5,,,,,,112.5,67.5,M,Multi-ply,B
1,Etienne Bruwer,T1,South Africa,72,,,,,,67.5,72.5,77.5,77.5,,,,,,77.5,75,M,Multi-ply,B
1,Juan Marais,T2,South Africa,71.1,,,,,,90,95,100,100,,,,,,100,75,M,Multi-ply,B
1,Frederic Alost,J,France,72.9,,,,,,150,160,-165,160,,,,,,160,75,M,Multi-ply,B
2,Oliver Willisch,J,Switzerland,74,,,,,,130,135,-140,135,,,,,,135,75,M,Multi-ply,B
3,Corne Engelbrecht,J,South Africa,73.7,,,,,,120,125,-130,125,,,,,,125,75,M,Multi-ply,B
4,Hennie Britz,J,South Africa,74.9,,,,,,-125,125,-130,125,,,,,,125,75,M,Multi-ply,B
1,Markus Schick,O,Germany,71.6,,,,,,230,-243,-243,230,,,,,,230,75,M,Multi-ply,B
2,Jean-Luc Garcia,O,France,73,,,,,,170,-175,180,180,,,,,,180,75,M,Multi-ply,B
3,Stefano Molinari,O,Italy,74.9,,,,,,150,162.5,-172.5,162.5,,,,,,162.5,75,M,Multi-ply,B
1,Rickey Dale Crain,M2,USA,75,,,,,,177.5,-182.5,-182.5,177.5,,,,,,177.5,75,M,Multi-ply,B
2,Jawanda Avtar Singh,M2,UK,74.5,,,,,,100,120,-125,120,,,,,,120,75,M,Multi-ply,B
1,Franz Haar,M3,Austria,74.4,,,,,,125,130,135,135,,,,,,135,75,M,Multi-ply,B
1,Stanley Du Plessis,T1,South Africa,75.7,,,,,,80,-85,85,85,,,,,,85,82.5,M,Multi-ply,B
1,Risto Lestenmaa,O,Finland,80.9,,,,,,-220,220,-225,220,,,,,,220,82.5,M,Multi-ply,B
2,Enzo Vaccari,O,Italy,82.4,,,,,,215,-220,220,220,,,,,,220,82.5,M,Multi-ply,B
3,Stefano Marescotti,O,Italy,80.5,,,,,,195,200,205,205,,,,,,205,82.5,M,Multi-ply,B
4,Stephen Webb,O,USA,81.5,,,,,,192.5,197.5,-205,197.5,,,,,,197.5,82.5,M,Multi-ply,B
5,Mario Aurer,O,Austria,80.3,,,,,,175,185,190,190,,,,,,190,82.5,M,Multi-ply,B
6,Alon Ben-Shahar,O,Israel,81.9,,,,,,182.5,-190,-190,182.5,,,,,,182.5,82.5,M,Multi-ply,B
7,Jörg Wiemann,O,Germany,81.1,,,,,,160,-165,-165,160,,,,,,160,82.5,M,Multi-ply,B
8,Gianfranco Manca,O,South Africa,78,,,,,,150,-155,-155,150,,,,,,150,82.5,M,Multi-ply,B
DQ,Kari Laitila,O,Finland,81.5,,,,,,-230,-230,-230,,,,,,,,82.5,M,Multi-ply,B
1,Herbert Pandion,M2,Austria,82.1,,,,,,140,147.5,155,155,,,,,,155,82.5,M,Multi-ply,B
1,Stefan Kobli,M3,Austria,82.1,,,,,,160,170,-180,170,,,,,,170,82.5,M,Multi-ply,B
1,Ian Morris,M4,South Africa,81.9,,,,,,100,120,-122.5,120,,,,,,120,82.5,M,Multi-ply,B
2,Gugliema Trentin,M4,Italy,77.2,,,,,,110,115,-120,115,,,,,,115,82.5,M,Multi-ply,B
1,Koos Van Rooyen,T1,South Africa,83,,,,,,70,-80,80,80,,,,,,80,90,M,Multi-ply,B
1,Marko Schmidtchen,J,Germany,88.7,,,,,,180,-185,-185,180,,,,,,180,90,M,Multi-ply,B
2,Dominik Stang,J,Germany,89,,,,,,165,-170,172.5,172.5,,,,,,172.5,90,M,Multi-ply,B
3,Ronald Ber,J,Austria,89,,,,,,160,170,-175,170,,,,,,170,90,M,Multi-ply,B
4,Hennie Hartzenberg,J,South Africa,87.8,,,,,,120,130,-140,130,,,,,,130,90,M,Multi-ply,B
1,Rene Imesch,O,Switzerland,88.9,,,,,,-225,225,230,230,,,,,,230,90,M,Multi-ply,B
2,Christian Plachy,O,Austria,88.7,,,,,,202.5,-210,-210,202.5,,,,,,202.5,90,M,Multi-ply,B
3,Kilian Imesch,O,Switzerland,86.7,,,,,,190,197.5,-205,197.5,,,,,,197.5,90,M,Multi-ply,B
4,Anssi Ainali,O,Finland,88.3,,,,,,-195,195,-207.5,195,,,,,,195,90,M,Multi-ply,B
5,Emanuel Koestinger,O,Austria,87.1,,,,,,175,185,-190,185,,,,,,185,90,M,Multi-ply,B
6,Silvano Camozzi,O,Italy,87.1,,,,,,175,-180,180,180,,,,,,180,90,M,Multi-ply,B
7,Cristiano Dicecco,O,Italy,83.1,,,,,,150,-160,-160,150,,,,,,150,90,M,Multi-ply,B
8,Mathys Jansen,O,South Africa,84.9,,,,,,-140,-140,140,140,,,,,,140,90,M,Multi-ply,B
DQ,Oliver Kopp Dr. Marc,O,Germany,89.7,,,,,,-205,-205,-205,,,,,,,,90,M,Multi-ply,B
1,Franz Topf,M1,Austria,87.5,,,,,,175,-185,185,185,,,,,,185,90,M,Multi-ply,B
2,Heinz Buhl,M1,Austria,89.4,,,,,,175,-185,-185,175,,,,,,175,90,M,Multi-ply,B
3,Marcello Paredi,M1,Italy,87,,,,,,150,-160,-160,150,,,,,,150,90,M,Multi-ply,B
DQ,Glenn Clayman,M1,USA,89.4,,,,,,-200,-210,-210,,,,,,,,90,M,Multi-ply,B
DQ,Jan Lindén,M1,Finland,89.2,,,,,,-250,-250,-250,,,,,,,,90,M,Multi-ply,B
1,Lucio Sartori,M2,Italy,89.8,,,,,,130,135,-140,135,,,,,,135,90,M,Multi-ply,B
1,Elvio Malpelo,M3,Italy,84.9,,,,,,130,140,147.5,147.5,,,,,,147.5,90,M,Multi-ply,B
1,Alfred Stolz,M4,Austria,89.7,,,,,,150,155,-160,155,,,,,,155,90,M,Multi-ply,B
1,Louis Hoerler,M5,Switzerland,88.7,,,,,,165,-175,-175,165,,,,,,165,90,M,Multi-ply,B
1,Marcel Benkert,T2,Germany,98.5,,,,,,210,220,-230,220,,,,,,220,100,M,Multi-ply,B
1,Matt Magnum,J,USA,91.4,,,,,,202.5,-207.5,-207.5,202.5,,,,,,202.5,100,M,Multi-ply,B
2,Serge Cina,J,Switzerland,92.6,,,,,,170,177.5,185,185,,,,,,185,100,M,Multi-ply,B
3,Pieter Opperman,J,South Africa,98.1,,,,,,-150,-160,160,160,,,,,,160,100,M,Multi-ply,B
1,Mika Haaristo,O,Finland,97.7,,,,,,250,-260,-260,250,,,,,,250,100,M,Multi-ply,B
2,Robert Brasseur,O,France,99.2,,,,,,220,222.5,227.5,227.5,,,,,,227.5,100,M,Multi-ply,B
3,Harald Selsam,O,Germany,99.1,,,,,,210,220,-225,220,,,,,,220,100,M,Multi-ply,B
4,Franz Gansinger,O,Austria,99.5,,,,,,192.5,200,-205,200,,,,,,200,100,M,Multi-ply,B
5,Cristian Miorandi,O,Italy,96.8,,,,,,-175,175,185,185,,,,,,185,100,M,Multi-ply,B
6,Stephen Parkhurst,O,USA,98.8,,,,,,110,-192.5,-192.5,110,,,,,,110,100,M,Multi-ply,B
1,Rudolf Sterkl,M1,Austria,98.9,,,,,,177.5,190,202.5,202.5,,,,,,202.5,100,M,Multi-ply,B
2,Eduard Kesaev,M1,Russia,99.5,,,,,,190,202.5,-205,202.5,,,,,,202.5,100,M,Multi-ply,B
3,Mike Redelinghydys,M1,South Africa,98.2,,,,,,-165,175,180,180,,,,,,180,100,M,Multi-ply,B
1,Wolfgang Waldherr,M2,Austria,97.1,,,,,,195,200,-205,200,,,,,,200,100,M,Multi-ply,B
1,Jon Wolbers,M3,Canada,91.5,,,,,,142.5,-150,150,150,,,,,,150,100,M,Multi-ply,B
1,Kurt Marnul,M6,Austria,99.8,,,,,,100,-110,-110,100,,,,,,100,100,M,Multi-ply,B
1,Fabrizio Zandonai,J,Italy,103.7,,,,,,-175,175,185,185,,,,,,185,110,M,Multi-ply,B
2,Duane Matthys,J,South Africa,100.2,,,,,,-145,165,-175,165,,,,,,165,110,M,Multi-ply,B
3,Kilian Holzer,J,Switzerland,101.5,,,,,,155,-160,160,160,,,,,,160,110,M,Multi-ply,B
DQ,Timo Schmitz,J,Germany,103.6,,,,,,-165,-165,-165,,,,,,,,110,M,Multi-ply,B
1,Frank Schütze,O,Germany,105.3,,,,,,235,245,255,255,,,,,,255,110,M,Multi-ply,B
2,Josi Durrer,O,Switzerland,107.2,,,,,,-235,240,250,250,,,,,,250,110,M,Multi-ply,B
3,Chris Taylor,O,USA,110,,,,,,250,-270,-270,250,,,,,,250,110,M,Multi-ply,B
4,Patrick Pawelka,O,Austria,100.3,,,,,,-210,210,-212.5,210,,,,,,210,110,M,Multi-ply,B
5,Adolf Fick,O,South Africa,105.4,,,,,,180,-200,-200,180,,,,,,180,110,M,Multi-ply,B
6,Vladimir Scherbakov,O,Russia,106,,,,,,-180,180,-192.5,180,,,,,,180,110,M,Multi-ply,B
DQ,Kevin Green Brian,O,South Africa,106.5,,,,,,-235,-235,-240,,,,,,,,110,M,Multi-ply,B
1,Noble Cozine,M1,USA,107.8,,,,,,165,180,190,190,,,,,,190,110,M,Multi-ply,B
2,Orville Moorehouse,M1,Canada,103,,,,,,115,-137.5,-137.5,115,,,,,,115,110,M,Multi-ply,B
1,Julius Eilenberger,M2,Austria,108.5,,,,,,200,220,-227.5,220,,,,,,220,110,M,Multi-ply,B
1,Josef Hager,M3,Austria,108.5,,,,,,175,182.5,-190,182.5,,,,,,182.5,110,M,Multi-ply,B
2,Johann Grether,M3,Austria,107.8,,,,,,145,155,-160,155,,,,,,155,110,M,Multi-ply,B
1,Daniel Nay,M4,USA,106.2,,,,,,190,-202.5,207.5,207.5,,,,,,207.5,110,M,Multi-ply,B
2,Klaus Kurscheit,M4,Germany,100.3,,,,,,-200,200,-205,200,,,,,,200,110,M,Multi-ply,B
1,Onn Basson,J,Israel,117.4,,,,,,190,205,220,220,,,,,,220,125,M,Multi-ply,B
2,Ralf Ber,J,Austria,117.4,,,,,,180,-195,-195,180,,,,,,180,125,M,Multi-ply,B
1,Herbert Winkelmann,O,Germany,119.2,,,,,,260,275,-285,275,,,,,,275,125,M,Multi-ply,B
2,Frank Meichsner,O,Germany,121.9,,,,,,250,-260,-260,250,,,,,,250,125,M,Multi-ply,B
3,Ruggiero Chiannese,O,South Africa,120.6,,,,,,-220,220,-230,220,,,,,,220,125,M,Multi-ply,B
1,Pekka Rantanen,M1,Finland,120.4,,,,,,200,-215,-215,200,,,,,,200,125,M,Multi-ply,B
1,Bob Walker,M2,USA,116,,,,,,-227.5,227.5,-235,227.5,,,,,,227.5,125,M,Multi-ply,B
2,Meinhardt Schroeder,M2,Germany,122.3,,,,,,200,210,-220,210,,,,,,210,125,M,Multi-ply,B
3,Ian Visser,M2,South Africa,115.6,,,,,,180,-202.5,-202.5,180,,,,,,180,125,M,Multi-ply,B
1,Jerry O'Conner,M3,Canada,113.2,,,,,,167.5,-182.5,-182.5,167.5,,,,,,167.5,125,M,Multi-ply,B
1,JM Blakley,O,USA,132.5,,,,,,290,-300,300,300,,,,,,300,140,M,Multi-ply,B
2,Boris Wyssen,O,Switzerland,127.1,,,,,,230,240,-245,240,,,,,,240,140,M,Multi-ply,B
3,Gerhard Holleitner,O,Austria,125.1,,,,,,225,235,-245,235,,,,,,235,140,M,Multi-ply,B
4,Alexander Rubner,O,Germany,125.6,,,,,,220,230,-245,230,,,,,,230,140,M,Multi-ply,B
5,Hubert Dörer,O,Austria,126,,,,,,205,-215,-215,205,,,,,,205,140,M,Multi-ply,B
DQ,Hannie Smith,O,South Africa,132.3,,,,,,-205,-205,-205,,,,,,,,140,M,Multi-ply,B
DQ,Richard Coates,O,USA,135.9,,,,,,-285,-285,-285,,,,,,,,140,M,Multi-ply,B
1,Enrico Brusco,M2,Italy,129,,,,,,240,255,-260,255,,,,,,255,140,M,Multi-ply,B
1,Peter Oprawill,M4,Austria,125.9,,,,,,180,-190.5,-190.5,180,,,,,,180,140,M,Multi-ply,B
1,Gary Baum,O,USA,176.3,,,,,,115,145,155,155,,,,,,155,140+,M,Multi-ply,B
