{
  "data": {
    "id": 115,
    "primary_username": "email",
    "full_name": "Kszyr Ver Cobrador",
    "email": "kszyr.vercobrador@appetiser.com.au",
    "phone_number": "6391688364362",
    "created_at": "2020-02-17T07:10:51.000000Z",
    "updated_at": "2020-02-17T08:40:55.000000Z",
    "onboarded_at": "2020-02-17T08:40:55.000000Z",
    "email_verified": true,
    "phone_number_verified": false,
    "verified": true,
    "avatar_permanent_url": "https://baseplate-api.test/api/v1/users/121/avatar",
    "avatar_permanent_thumb_url": "https://baseplate-api.test/api/v1/users/121/avatar/thumb",
    "mine": true,
    "avatar": null
  },
  "http_status": 200,
  "success": true
}
