{
  "data": {
    "access_token": "eyJ0eXAiOiJKV1QiLCJhbGciOiJIUzI1NiJ9.eyJpc3MiOiJodHRwczpcL1wvYmFzZXBsYXRlLWFwaS5hcHBldGlzZXJkZXYudGVjaFwvYXBpXC92MVwvYXV0aFwvbG9naW4iLCJpYXQiOjE1Nzk1ODE4MjEsImV4cCI6MTU3OTY2ODIyMSwibmJmIjoxNTc5NTgxODIxLCJqdGkiOiJDQlNmS3l1NkdQMzZEMTF2Iiwic3ViIjoxLCJwcnYiOiIyM2JkNWM4OTQ5ZjYwMGFkYjM5ZTcwMWM0MDA4NzJkYjdhNTk3NmY3In0.A0zN4wrCqz5mWOPq90hMbQP443GiAE4OsoKkT5ydHr8",
    "token_type": "bearer",
    "expires_in": "2020-03-05T01:21:42.420607Z",
    "user": {
      "id": 1,
      "first_name": "Kszyr Ver",
      "last_name": "Cobrador",
      "full_name": "Kszyr Ver Cobrador",
      "email": "kszyr.vercobrador@appetiser.com.au",
      "phone_number": "639453200575",
      "created_at": "2019-08-07T14:11:13.000000Z",
      "updated_at": "2019-11-20T10:06:25.000000Z",
      "email_verified": true,
      "phone_number_verified": false,
      "verified": true,
      "avatar_permanent_url": "https://baseplate-api.appetiserdev.tech/api/v1/users/1/avatar",
      "avatar_permanent_thumb_url": "https://baseplate-api.appetiserdev.tech/api/v1/users/1/avatar/thumb",
      "mine": true,
      "avatar": {
        "id": 4,
        "name": "7baa8f08b1b748ab6b0498fb05eafb4d",
        "file_name": "7baa8f08b1b748ab6b0498fb05eafb4d.png",
        "collection_name": "avatar",
        "mime_type": "image/png",
        "size": 51610,
        "created_at": "2019-09-23T01:04:18.000000Z",
        "url": "https://baseplate-api.appetiserdev.tech/storage/4/7baa8f08b1b748ab6b0498fb05eafb4d.png",
        "thumb_url": "https://baseplate-api.appetiserdev.tech/storage/4/conversions/7baa8f08b1b748ab6b0498fb05eafb4d-thumb.jpg"
      }
    }
  },
  "http_status": 200,
  "success": true
}
