{
  "data": {
    "username": "kszyr.vercobrador@appetiser.com.au",
    "expires_at": "2020-05-28T02:51:38.000000Z",
    "created_at": "2020-05-28T01:51:38.000000Z"
  },
  "http_status": 201,
  "success": true
}
