{
  "data": {
    "id": 115,
    "primary_username": "email",
    "full_name": "Kszyr Ver Cobrador",
    "email": "kszyr.vercobrador@appetiser.com.au",
    "phone_number": "6391688364362",
    "created_at": "2020-02-17T07:10:51.000000Z",
    "updated_at": "2020-02-17T08:40:55.000000Z",
    "onboarded_at": "2020-02-17T08:40:55.000000Z",
    "email_verified": true,
    "phone_number_verified": false,
    "verified": true,
    "avatar_permanent_url": "https://baseplate-api.test/api/v1/users/115/avatar",
    "avatar_permanent_thumb_url": "https://baseplate-api.test/api/v1/users/115/avatar/thumb",
    "mine": true,
    "avatar": {
      "id": 6,
      "name": "f04f8372d365a7b8b5f46106a931f909",
      "file_name": "f04f8372d365a7b8b5f46106a931f909.png",
      "collection_name": "avatar",
      "mime_type": "image/png",
      "size": 733112,
      "created_at": "2020-02-17T08:40:47.000000Z",
      "url": "https://baseplate-api.test/storage/6/f04f8372d365a7b8b5f46106a931f909.png",
      "thumb_url": "https://baseplate-api.test/storage/6/conversions/f04f8372d365a7b8b5f46106a931f909-thumb.jpg"
    }
  },
  "http_status": 200,
  "success": true
}
