
0                         0
2.0000000000000003E-6     4.157791921498106E-6
4.000000000000001E-6      7.808142162220454E-6
6.0E-6                    1.0980055380572845E-5
8.000000000000001E-6      1.3705022398848577E-5
1.0E-5                    1.6016119470620832E-5
1.2E-5                    1.794723411348908E-5
1.4000000000000001E-5     1.953240817944479E-5
1.6000000000000003E-5     2.0805288598280004E-5
1.8000000000000004E-5     2.1798676179358565E-5
2.0E-5                    2.2544162963192236E-5
2.2E-5                    2.30718488488226E-5
2.4E-5                    2.3410128560880042E-5
2.6000000000000002E-5     2.3585540438906963E-5
2.8000000000000003E-5     2.3622669011115E-5
3.0000000000000008E-5     2.3544093837661203E-5
3.2000000000000005E-5     2.3370377659491805E-5
3.4000000000000007E-5     2.3120087454680212E-5
3.600000000000001E-5      2.2809842573791585E-5
3.8E-5                    2.24543846897962E-5
4.0E-5                    2.2066664848703223E-5
4.2E-5                    2.1657943438201425E-5
4.4E-5                    2.1237899398270937E-5
4.6E-5                    2.0814745476309092E-5
4.8E-5                    2.039534677711303E-5
5.0E-5                    1.9985340273381913E-5
5.2000000000000004E-5     1.9589253324237582E-5
5.4000000000000005E-5     1.9210619597371135E-5
5.6000000000000006E-5     1.885209110501677E-5
5.800000000000001E-5      1.8515545345787468E-5
6.0000000000000015E-5     1.8202186794538682E-5
6.200000000000002E-5      1.791264220225035E-5
6.400000000000001E-5      1.7647049359001657E-5
6.600000000000002E-5      1.740513913721732E-5
6.800000000000001E-5      1.7186310771322163E-5
7.0E-5                    1.6989700445651817E-5
7.200000000000002E-5      1.6814243356840578E-5
7.4E-5                    1.6658729491835345E-5
7.6E-5                    1.6521853420008107E-5
7.800000000000001E-5      1.6402258439342043E-5
8.0E-5                    1.629857544403546E-5
8.200000000000001E-5      1.6209456895708066E-5
8.4E-5                    1.6133606284195055E-5
8.600000000000002E-5      1.6069803458067433E-5
8.8E-5                    1.601692619079862E-5
9.000000000000002E-5      1.5973968327079434E-5
9.2E-5                    1.5940054826234142E-5
9.4E-5                    1.591445398697931E-5
9.6E-5                    1.5896587100777656E-5
9.8E-5                    1.588603574056983E-5
1.0E-4                    1.588254684845126E-5
