
0                         8.864528502219574E-4
8.33E-4                   8.744125827740318E-4
0.001667                  8.621085527982597E-4
0.0025                    8.499232982392928E-4
0.003333                  8.379037528019182E-4
0.004167                  8.260371611048848E-4
0.005                     8.143507996659337E-4
0.005833                  8.028326107107692E-4
0.006667                  7.91462467476906E-4
0.0075                    7.80265222232151E-4
0.008333                  7.692291354835496E-4
0.009167                  7.58334907192193E-4
0.01                      7.476063426592571E-4
0.010833                  7.370321940441797E-4
0.011667                  7.265939676225059E-4
0.0125                    7.163144711326652E-4
0.013333                  7.061829261599651E-4
0.014167                  6.961816118246097E-4
0.015                     6.863323801734516E-4
0.015833                  6.766249032722226E-4
0.016667                  6.67042201718828E-4
0.0175                    6.576052131567209E-4
0.018333                  6.483040426281628E-4
0.019167                  6.391224224936746E-4
0.02                      6.300804154379726E-4
0.020833                  6.211685421744127E-4
0.021667                  6.123712174538967E-4
0.0225                    6.037076655603297E-4
0.023333                  5.951688049372811E-4
0.024167                  5.867397032031148E-4
0.025                     5.784387799840206E-4
0.025833                  5.702573332982369E-4
0.026667                  5.621810547548629E-4
0.0275                    5.542275915366782E-4
0.028333                  5.463886042236148E-4
0.029167                  5.386503815795743E-4
0.03                      5.310298304766407E-4
0.030833                  5.235189592425985E-4
0.031667                  5.161046296727271E-4
0.0325                    5.088030406852742E-4
0.033333                  5.016065354379567E-4
0.034167                  4.945025265465021E-4
0.035                     4.8750653638347596E-4
0.035833                  4.8061123039205345E-4
0.036667                  4.7380455002338337E-4
0.0375                    4.6710136995159197E-4
0.038333                  4.604946643049995E-4
0.039167                  4.53972880521369E-4
0.04                      4.475502713535793E-4
0.040833                  4.412201049684169E-4
0.041667                  4.3497131163294084E-4
0.0425                    4.288175461171086E-4
0.043333                  4.227523564730591E-4
0.044167                  4.167651341133628E-4
0.045                     4.1086895992311316E-4
0.045833                  4.050576499053472E-4
0.046667                  3.9932103779334236E-4
0.0475                    3.93671655827877E-4
0.048333                  3.8810357850766353E-4
0.049167                  3.8260706552184146E-4
0.05                      3.771941258340293E-4
0.050833                  3.718590838619822E-4
0.051667                  3.665926093482615E-4
0.0525                    3.6140621128817553E-4
0.053333                  3.562944541934654E-4
0.054167                  3.5124840054921903E-4
0.055                     3.4627907929230846E-4
0.055833                  3.413812832596059E-4
0.056667                  3.365464489731964E-4
0.0575                    3.3178514271572083E-4
0.058333                  3.2709237344253695E-4
0.059167                  3.2245993363771703E-4
0.06                      3.178979443409679E-4
0.060833                  3.134016204369976E-4
0.061667                  3.089630951882109E-4
0.0625                    3.0459206373300516E-4
0.063333                  3.0028393985129617E-4
0.064167                  2.9603118563140677E-4
0.065                     2.9184309106816794E-4
0.065833                  2.877152635612507E-4
0.066667                  2.8364048320238174E-4
0.0675                    2.796276543684591E-4
0.068333                  2.7567257171941766E-4
0.069167                  2.7176832086985524E-4
0.07                      2.6792343644942195E-4
0.070833                  2.6413389120434703E-4
0.071667                  2.603930612253066E-4
0.0725                    2.56709123766688E-4
0.073333                  2.530782187857862E-4
0.074167                  2.4949399721625455E-4
0.075                     2.4596429065564234E-4
0.075833                  2.4248539683474743E-4
0.076667                  2.3905122853103158E-4
0.0775                    2.3566928584696888E-4
0.078333                  2.3233601863342483E-4
0.079167                  2.2904559263522652E-4
0.08                      2.2580519351522298E-4
0.080833                  2.2261142061559628E-4
0.081667                  2.1945868606051632E-4
0.0825                    2.1635387818808095E-4
0.083333                  2.1329374279487298E-4
0.084167                  2.1027293035579567E-4
0.085                     2.0729804536518513E-4
0.085833                  2.0436597353718308E-4
0.086667                  2.0147159196362506E-4
0.0875                    1.986212300483706E-4
0.088333                  1.9581190359613867E-4
0.089167                  1.9303870234192158E-4
0.09                      1.9030768742505364E-4
0.090833                  1.8761599521903644E-4
0.091667                  1.8495891600699304E-4
0.0925                    1.8234225196198236E-4
0.093333                  1.7976325466462114E-4
0.094167                  1.772174078047012E-4
0.095                     1.747102683381757E-4
0.095833                  1.7223920231245466E-4
0.096667                  1.6979988363452578E-4
0.0975                    1.673976397217858E-4
0.098333                  1.6502995128681684E-4
0.099167                  1.6269267871162535E-4
0.1                       1.6039093247644364E-4
0.100833                  1.581223043928812E-4
0.101667                  1.5588283297222547E-4
0.1025                    1.536774183474229E-4
0.103333                  1.515037547478276E-4
0.104167                  1.493580461465144E-4
0.105                     1.4724498503771558E-4
0.105833                  1.451623578496914E-4
0.106667                  1.4310652174816542E-4
0.1075                    1.4108196605346507E-4
0.108333                  1.3908656317242272E-4
0.109167                  1.3711681664601164E-4
0.11                      1.351770229542889E-4
0.110833                  1.3326514065787806E-4
0.111667                  1.313778189054371E-4
0.1125                    1.2951917609420004E-4
0.113333                  1.2768726020022465E-4
0.114167                  1.258788664269849E-4
0.115                     1.240979481602465E-4
0.115833                  1.22342642755436E-4
0.116667                  1.2060988696635436E-4
0.1175                    1.1890347518558806E-4
0.118333                  1.1722162714526535E-4
0.119167                  1.1556140993030475E-4
0.12                      1.1392645846466188E-4
0.120833                  1.12315063658945E-4
0.121667                  1.1072440969491415E-4
0.1225                    1.0915797155391344E-4
0.123333                  1.07614103076624E-4
0.124167                  1.0609009755279284E-4
0.125                     1.0458927634566655E-4
0.125833                  1.031100560365518E-4
0.126667                  1.0164983941558018E-4
0.1275                    1.0021180802323809E-4
0.128333                  9.879444707749075E-5
0.129167                  9.739527329355521E-5
0.13                      9.601734302867536E-5
0.130833                  9.46592143021007E-5
0.131667                  9.331851783736307E-5
0.1325                    9.199819202731273E-5
0.133333                  9.069686337341448E-5
0.134167                  8.941226754629116E-5
0.135                     8.814722259337174E-5
0.135833                  8.690041151822736E-5
0.136667                  8.566966037826772E-5
0.1375                    8.445766142585555E-5
0.138333                  8.326314281289098E-5
0.139167                  8.208401029897612E-5
0.14                      8.092283164186077E-5
0.140833                  7.977837794810553E-5
0.141667                  7.86486345635173E-5
0.1425                    7.75360568725131E-5
0.143333                  7.64394665836363E-5
0.144167                  7.53569364802752E-5
0.145                     7.429082646106036E-5
0.145833                  7.324001780044288E-5
0.146667                  7.220267628064746E-5
0.1475                    7.118107665295389E-5
0.148333                  7.01741595908791E-5
0.149167                  6.918017829881973E-5
0.15                      6.820131989212949E-5
0.150833                  6.723657253414782E-5
0.151667                  6.628426123083082E-5
0.1525                    6.53464753314806E-5
0.153333                  6.442223524054781E-5
0.154167                  6.350992297841118E-5
0.155                     6.261152510707891E-5
0.155833                  6.172608809272573E-5
0.156667                  6.0852048203223354E-5
0.1575                    5.9991298173044566E-5
0.158333                  5.9142918387052134E-5
0.159167                  5.830540949034581E-5
0.16                      5.748058954482738E-5
0.160833                  5.666758687918812E-5
0.161667                  5.5864978349560476E-5
0.1625                    5.507452273026737E-5
0.163333                  5.4295402121436445E-5
0.164167                  5.35262694315105E-5
0.165                     5.2768823998007576E-5
0.165833                  5.20222915370616E-5
0.166667                  5.1285385451537625E-5
0.1675                    5.055973178055627E-5
0.168333                  4.9844580497381154E-5
0.169167                  4.913868557759618E-5
0.17                      4.844358708400772E-5
0.170833                  4.775854688423698E-5
0.171667                  4.70823515148375E-5
0.1725                    4.641645854897675E-5
0.173333                  4.576014743515843E-5
0.174167                  4.5112247664937106E-5
0.175                     4.4474154798534025E-5
0.175833                  4.384518452750581E-5
0.176667                  4.3224227757442156E-5
0.1775                    4.261264012840763E-5
0.178333                  4.2009787400855886E-5
0.179167                  4.1414629576296844E-5
0.18                      4.0828487697978325E-5
0.180833                  4.025077183768606E-5
0.181667                  3.9680497808442085E-5
0.1825                    3.911893642514945E-5
0.183333                  3.8565519333633004E-5
0.184167                  3.8019292821313844E-5
0.185                     3.7481456152778624E-5
0.185833                  3.695144186036948E-5
0.186667                  3.642831056864611E-5
0.1875                    3.591318493070681E-5
0.188333                  3.540549856010385E-5
0.189167                  3.4904333961444046E-5
0.19                      3.441075673160994E-5
0.190833                  3.392422333396568E-5
0.191667                  3.344386269026818E-5
0.1925                    3.297071310718461E-5
0.193333                  3.25042775133147E-5
0.194167                  3.204374940479511E-5
0.195                     3.159015429809642E-5
0.195833                  3.114304385705702E-5
0.196667                  3.070166861181433E-5
0.1975                    3.0267027213324286E-5
0.198333                  2.9838696054569215E-5
0.199167                  2.941595290711737E-5
0.2                       2.8999739490564095E-5
0.200833                  2.8589626287121583E-5
0.201667                  2.8184891237330904E-5
0.2025                    2.7786401923948284E-5
0.203333                  2.7393713401612365E-5
0.204167                  2.700610411840961E-5
0.205                     2.6624382312930223E-5
0.205833                  2.6248109397844072E-5
0.206667                  2.5876592946197605E-5
0.2075                    2.5510618968889403E-5
0.208333                  2.5149789654472103E-5
0.209167                  2.4793472691025124E-5
0.21                      2.4442459475125435E-5
0.210833                  2.409640772303027E-5
0.211667                  2.3754748204205884E-5
0.2125                    2.3418270142446754E-5
0.213333                  2.308666542572567E-5
0.214167                  2.2759396423780457E-5
0.215                     2.24372128561468E-5
0.215833                  2.2119799740244866E-5
0.216667                  2.1806610900196695E-5
0.2175                    2.1498323580195197E-5
0.218333                  2.119459185689696E-5
0.219167                  2.0894848606787068E-5
0.22                      2.0599703010626493E-5
0.220833                  2.0308794947223817E-5
0.221667                  2.00215650011433E-5
0.2225                    1.97385964171063E-5
0.223333                  1.9459559562690293E-5
0.224167                  1.9183947893091244E-5
0.225                     1.891236298182339E-5
0.225833                  1.8644537760378497E-5
0.226667                  1.8380037870916815E-5
0.2275                    1.8119488848068376E-5
0.228333                  1.7862673544567897E-5
0.229167                  1.7609201759936287E-5
0.23                      1.7359682243331532E-5
0.230833                  1.7113897916173554E-5
0.231667                  1.6871448923154752E-5
0.2325                    1.663287566994157E-5
0.233333                  1.6397917663224884E-5
0.234167                  1.6166133890251497E-5
0.235                     1.593798311693921E-5
0.235833                  1.571316584707652E-5
0.236667                  1.549122197550185E-5
0.2375                    1.5272570610439994E-5
0.238333                  1.5056925186319337E-5
0.239167                  1.4843865159254931E-5
0.24                      1.4633833059595059E-5
0.240833                  1.4426609077042869E-5
0.241667                  1.4221854246024937E-5
0.2425                    1.4020061476526941E-5
0.243333                  1.3821082089729395E-5
0.244167                  1.362464207001742E-5
0.245                     1.3431247565542765E-5
0.245833                  1.3240767005042851E-5
0.246667                  1.3052925935080531E-5
0.2475                    1.2868172772482249E-5
0.248333                  1.2686326309970693E-5
0.249167                  1.2507054663498385E-5
0.25                      1.2330708950977253E-5
0.250833                  1.2157040941477819E-5
0.251667                  1.1985667230557326E-5
0.2525                    1.1816874752082215E-5
0.253333                  1.1650400884898835E-5
0.254167                  1.148587891644287E-5
0.255                     1.1323612943244468E-5
0.255833                  1.1163404305240138E-5
0.256667                  1.1004973510398645E-5
0.2575                    1.0848698954051287E-5
0.258333                  1.0694477561460276E-5
0.259167                  1.0542122712869395E-5
0.26                      1.0392064376549438E-5
0.260833                  1.0244245567507122E-5
0.261667                  1.0098501673857592E-5
0.2625                    9.955226596459605E-6
0.263333                  9.814318121929694E-6
0.264167                  9.675546103300965E-6
0.265                     9.5391937974243E-6
0.265833                  9.405063487720519E-6
0.266667                  9.272836796127567E-6
0.2675                    9.142697784905445E-6
0.268333                  9.014395505858967E-6
0.269167                  8.887592576441561E-6
0.27                      8.762468563815168E-6
0.270833                  8.638821611040361E-6
0.271667                  8.516398043768183E-6
0.2725                    8.395468445519927E-6
0.273333                  8.275950144830088E-6
0.274167                  8.157714481494723E-6
0.275                     8.041129531470058E-6
0.275833                  7.926200386561982E-6
0.276667                  7.812858490496777E-6
0.2775                    7.701473236926774E-6
0.278333                  7.592024818374024E-6
0.279167                  7.484384983755331E-6
0.28                      7.37880779412739E-6
0.280833                  7.275153993293842E-6
0.281667                  7.173169708063859E-6
0.2825                    7.072966569867148E-6
0.283333                  6.974301484132875E-6
0.284167                  6.876850718600732E-6
0.285                     6.780680389125914E-6
0.285833                  6.685563885238066E-6
0.286667                  6.591241882756599E-6
0.2875                    6.497874308914749E-6
0.288333                  6.405370107386144E-6
0.289167                  6.313625960785377E-6
0.29                      6.222949476132906E-6
0.290833                  6.133390401155661E-6
0.291667                  6.044960217993389E-6
0.2925                    5.95802485880858E-6
0.293333                  5.872651004055133E-6
0.294167                  5.788817227484839E-6
0.295                     5.706786472891515E-6
0.295833                  5.6264942098593555E-6
0.296667                  5.547761880514878E-6
0.2975                    5.470663706515212E-6
0.298333                  5.394971222230545E-6
0.299167                  5.320369593552076E-6
0.3                       5.24682420838666E-6
0.300833                  5.174067223436521E-6
0.301667                  5.101805750688768E-6
0.3025                    5.030079347888438E-6
0.303333                  4.958756071760381E-6
0.304167                  4.887720577825223E-6
0.305                     4.817207813547644E-6
0.305833                  4.747286526850144E-6
0.306667                  4.6780256316102655E-6
0.3075                    4.6097968065810874E-6
0.308333                  4.542753762993342E-6
0.309167                  4.476987613194515E-6
0.31                      4.412806472389458E-6
0.310833                  4.350243724705982E-6
0.311667                  4.289217869117803E-6
0.3125                    4.229808086197826E-6
0.313333                  4.171820270640804E-6
0.314167                  4.1149574827630235E-6
0.315                     4.0591038459550924E-6
0.315833                  4.0039424668295294E-6
0.316667                  3.949125485552158E-6
0.3175                    3.894559456796425E-6
0.318333                  3.8400367946227496E-6
0.319167                  3.7853879363088567E-6
0.32                      3.730749334860389E-6
0.320833                  3.6761720799422637E-6
0.321667                  3.6217489927443097E-6
0.3225                    3.5678508860681524E-6
0.323333                  3.5147099855741754E-6
0.324167                  3.462530821316621E-6
0.325                     3.4116977024988798E-6
0.325833                  3.3623689045592104E-6
0.326667                  3.3145909455773225E-6
0.3275                    3.2684992393918726E-6
0.328333                  3.223968841853874E-6
0.329167                  3.18074663842664E-6
0.33                      3.1386672920819806E-6
0.330833                  3.0973704947519854E-6
0.331667                  3.0564430511532444E-6
0.3325                    3.0156484515033697E-6
0.333333                  2.9746698753450945E-6
0.334167                  2.9332385342574065E-6
0.335                     2.8913544948128355E-6
0.335833                  2.8490022104235448E-6
0.336667                  2.8062505096451482E-6
0.3375                    2.7634425430520243E-6
0.338333                  2.720864889918029E-6
0.339167                  2.678824062634292E-6
0.34                      2.6377999846573593E-6
0.340833                  2.598100767247526E-6
0.341667                  2.5599370654354744E-6
0.3425                    2.523560180657952E-6
0.343333                  2.48896538094047E-6
0.344167                  2.4559893416081583E-6
0.345                     2.4244673270914194E-6
0.345833                  2.394020549639892E-6
0.346667                  2.364177142031161E-6
0.3475                    2.3345570781733156E-6
0.348333                  2.304707316075751E-6
0.349167                  2.274216408960619E-6
0.35                      2.2429020957124485E-6
0.350833                  2.210622128036934E-6
0.351667                  2.1773578325392924E-6
0.3525                    2.143374442958678E-6
0.353333                  2.1089664784372996E-6
0.354167                  2.074509745383738E-6
0.355                     2.0405780573132878E-6
0.355833                  2.007642633669694E-6
0.356667                  1.976111551871377E-6
0.3575                    1.9464158796296862E-6
0.358333                  1.918737450619915E-6
0.359167                  1.8930710739934637E-6
0.36                      1.8693270201824374E-6
0.360833                  1.8471592094672403E-6
0.361667                  1.826068200238881E-6
0.3625                    1.8055480327380366E-6
0.363333                  1.784996159211387E-6
0.364167                  1.7638230726754923E-6
0.365                     1.7416167871004418E-6
0.365833                  1.7180417476535412E-6
0.366667                  1.692915192526973E-6
0.3675                    1.6663508254453778E-6
0.368333                  1.638578163649425E-6
0.369167                  1.6099798356396753E-6
0.37                      1.5811886988820667E-6
0.370833                  1.552826416257884E-6
0.371667                  1.5255148812409999E-6
0.3725                    1.499922419884494E-6
0.373333                  1.4764934592166554E-6
0.374167                  1.455471721727611E-6
0.375                     1.4369472332343906E-6
0.375833                  1.420692770247315E-6
0.376667                  1.4062464891440944E-6
0.3775                    1.3930222885887857E-6
0.378333                  1.3802768168534773E-6
0.379167                  1.3672225191526108E-6
0.38                      1.3531768287335278E-6
0.380833                  1.3375449768034343E-6
0.381667                  1.3198973547933692E-6
0.3825                    1.3001049821471562E-6
0.383333                  1.278234657520268E-6
0.384167                  1.2545797895910012E-6
0.385                     1.2297536005985765E-6
0.385833                  1.2044721167537519E-6
0.386667                  1.1795487701285E-6
0.3875                    1.155918717678354E-6
0.388333                  1.1343587741641421E-6
0.389167                  1.1154680396413259E-6
0.39                      1.0996555425389316E-6
0.390833                  1.0869457189389828E-6
0.391667                  1.0770283129195155E-6
0.3925                    1.0693256572925714E-6
0.393333                  1.06299464740446E-6
0.394167                  1.0570521416384385E-6
0.395                     1.0505172313131206E-6
0.395833                  1.0424773595055003E-6
0.396667                  1.032176071101552E-6
0.3975                    1.0191445944561326E-6
0.398333                  1.0031754863313417E-6
0.399167                  9.843507211969363E-7
0.4                       9.631405100043749E-7
0.400833                  9.402427040693681E-7
0.401667                  9.165752202049456E-7
0.4025                    8.933057213207059E-7
0.403333                  8.715708462425491E-7
0.404167                  8.524214269375483E-7
0.405                     8.367527840201306E-7
0.405833                  8.250340767580444E-7
0.406667                  8.172951936023891E-7
0.4075                    8.13125864755665E-7
0.408333                  8.116753470791689E-7
0.409167                  8.117977695552601E-7
0.41                      8.122007324523943E-7
0.410833                  8.116021196244156E-7
0.411667                  8.088450623967524E-7
0.4125                    8.030295715532393E-7
0.413333                  7.935668097902837E-7
0.414167                  7.802013523681563E-7
0.415                     7.631126062266953E-7
0.415833                  7.428197091846434E-7
0.416667                  7.201805703386314E-7
0.4175                    6.96456236669625E-7
0.418333                  6.730648479912966E-7
0.419167                  6.515264332529277E-7
0.42                      6.33370817690174E-7
0.420833                  6.197625208153064E-7
0.421667                  6.113752112040014E-7
0.4225                    6.082569163744014E-7
0.423333                  6.097420363716839E-7
0.424167                  6.146058839971045E-7
0.425                     6.212411498648681E-7
0.425833                  6.279335471322833E-7
0.426667                  6.330439423179491E-7
0.4275                    6.351537106499551E-7
0.428333                  6.332035845145267E-7
0.429167                  6.265009508890284E-7
0.43                      6.148054854151659E-7
0.430833                  5.982958380107476E-7
0.431667                  5.775632275600895E-7
0.4325                    5.537169029312367E-7
0.433333                  5.282128866285375E-7
0.434167                  5.028565764943344E-7
0.435                     4.79790052177744E-7
0.435833                  4.610793330029186E-7
0.436667                  4.4847293011104176E-7
0.4375                    4.4302519224554516E-7
0.438333                  4.4470023284488694E-7
0.439167                  4.5241617846149206E-7
0.44                      4.6425629598878895E-7
0.440833                  4.779475504936466E-7
0.441667                  4.912212499346335E-7
0.4425                    5.020215347459878E-7
0.443333                  5.087394972434522E-7
0.444167                  5.101895191796856E-7
0.445                     5.056466288518934E-7
0.445833                  4.948577262339741E-7
0.446667                  4.779951625685238E-7
0.4475                    4.55767225820521E-7
0.448333                  4.2931779848999235E-7
0.449167                  4.00292860902986E-7
0.45                      3.710071935919819E-7
0.450833                  3.4420843859234606E-7
0.451667                  3.2298467691949685E-7
0.4525                    3.102725872741549E-7
0.453333                  3.0778352072831453E-7
0.454167                  3.1533874753460725E-7
0.455                     3.308199521475372E-7
0.455833                  3.510587175168724E-7
0.456667                  3.7276813069136334E-7
0.4575                    3.9299922491346667E-7
0.458333                  4.0948488549738735E-7
0.459167                  4.205326096176982E-7
0.46                      4.249531268650575E-7
0.460833                  4.2208676215228334E-7
0.461667                  4.116801328522028E-7
0.4625                    3.939513953857344E-7
0.463333                  3.6952102580454504E-7
0.464167                  3.3944675994203445E-7
0.465                     3.054675748949033E-7
0.465833                  2.6996815663710733E-7
0.466667                  2.3637235338125586E-7
0.4675                    2.0953521498216513E-7
0.468333                  1.9495550554254177E-7
0.469167                  1.9641977671467268E-7
0.47                      2.1289606053282013E-7
0.470833                  2.3932547464949513E-7
0.471667                  2.700707289884564E-7
0.4725                    3.005967869380581E-7
0.473333                  3.2780876928288667E-7
0.474167                  3.495699080109854E-7
0.475                     3.6435512968566E-7
0.475833                  3.712388955051236E-7
0.476667                  3.6967558485830143E-7
0.4775                    3.5950292968241235E-7
0.478333                  3.40905229428161E-7
0.479167                  3.143594031732034E-7
0.48                      2.8079429003553024E-7
0.480833                  2.414584093417101E-7
0.481667                  1.9816905609261278E-7
0.4825                    1.5407757674526594E-7
0.483333                  1.1512491700242218E-7
0.484167                  9.40069848982497E-8
0.485                     1.0427745624082313E-7
0.485833                  1.379550119496913E-7
0.486667                  1.798525574375484E-7
0.4875                    2.2192604112103568E-7
0.488333                  2.604547531852231E-7
0.489167                  2.9330086131411297E-7
0.49                      3.1894269768016826E-7
0.490833                  3.36428404137001E-7
0.491667                  3.451083244105776E-7
0.4925                    3.446136739784125E-7
0.493333                  3.3490177804032777E-7
0.494167                  3.161571962272462E-7
0.495                     2.8889995359200243E-7
0.495833                  2.538317960806794E-7
0.496667                  2.1183448618820257E-7
0.4975                    1.6413968455811618E-7
0.498333                  1.1199252966947843E-7
0.499167                  5.6742556632454744E-8
0.5                       2.202770583999298E-10
