<?xml version="1.0" encoding="UTF-8"?>

<cfsSimulation xmlns="http://www.cfs++.org/simulation">

  <documentation>
    <title>static output (Force Inverter)</title>
    <authors>
      <author>Fabian Wein</author>
    </authors>
    <date>2015-01-28</date>
    <keywords>
      <keyword>SIMP</keyword>
    </keywords>
    <references>standard</references>
    <isVerified>yes</isVerified>
    <description>Standard force inverter problem. This tests the handling of the adjoint pde. Difficult problem, snopt is locked in a local Mimimum.</description>
  </documentation>

  <fileFormats>
    <output>
      <hdf5 />
      <info />
    </output>
    <materialData file="mat.xml" format="xml" />
  </fileFormats>

  <domain geometryType="plane">
    <regionList>
      <region material="99lines" name="mech" />
    </regionList>
    <nodeList>
      <nodes name="load">
        <coord x="0" y="0.5"/>
      </nodes>
      <nodes name="out">
        <coord x="1.0" y="0.5"/>
      </nodes>
    </nodeList>
  </domain>

  <sequenceStep index="1">
    <analysis>
      <static/>
    </analysis>

    <pdeList>
      <mechanic subType="planeStrain">
        <regionList>
          <region name="mech" />
        </regionList>

        <bcsAndLoads>
           <fix name="left_lower"> 
              <comp dof="x"/> 
              <comp dof="y"/> 
           </fix>
           <fix name="left_upper"> 
              <comp dof="x"/> 
              <comp dof="y"/> 
           </fix>
          <force name="load">
              <comp dof="x" value="10"/>
          </force>
          <concentratedElem dof="x" name="load" stiffnessValue="0.5"/>
          <concentratedElem dof="x" name="out" stiffnessValue="0.5"/>
          
        </bcsAndLoads>
        <storeResults>
          <nodeResult type="mechDisplacement">
            <allRegions />
          </nodeResult>
          <elemResult type="mechPseudoDensity">
            <allRegions/>
          </elemResult>          
          <elemResult type="physicalPseudoDensity">
            <allRegions/>
          </elemResult>             
       </storeResults>
      </mechanic>
    </pdeList>
    
    <linearSystems>
      <system>
        <solverList>
          <cholmod />
        </solverList>
      </system>
    </linearSystems>
  </sequenceStep>

  <optimization>
    <costFunction type="output" task="minimize" multiple_excitation="false">
      <stopping queue="999" value="0.002" type="designChange" />
      <output>
        <displacement name="out">
          <comp  dof="x" value="10"/>
        </displacement>
      </output>
    </costFunction>

    <constraint type="volume" bound="upperBound" value="0.5" />

    <optimizer type="scpip" maxIterations="10"/>

    <ersatzMaterial region="mech" material="mechanic" method="simp">
      <filters>
       <filter neighborhood="maxEdge" value="1.2" type="density"/>
      </filters>

      <design name="density" initial="0.5" lower="1e-3" upper="1.0" />
      <transferFunction type="simp" application="mech" param="3"/>

      <export write="iteration" save="all" />

    </ersatzMaterial>
    <commit mode="both_cases" stride="1" />
  </optimization>
 
  
</cfsSimulation>


