   1.0000000e+02   2.8832927e+00
   1.1000000e+02   2.8750717e+00
   1.2000000e+02   2.8596717e+00
   1.3000000e+02   2.8397874e+00
   1.4000000e+02   2.8171632e+00
   1.5000000e+02   2.7929493e+00
   1.6000000e+02   2.7679143e+00
   1.7000000e+02   2.7425759e+00
   1.8000000e+02   2.7172844e+00
   1.9000000e+02   2.6922755e+00
   2.0000000e+02   2.6677066e+00
   2.1000000e+02   2.6436804e+00
   2.2000000e+02   2.6202613e+00
   2.3000000e+02   2.5974867e+00
   2.4000000e+02   2.5753749e+00
   2.5000000e+02   2.5539311e+00
   2.6000000e+02   2.5331507e+00
   2.7000000e+02   2.5130230e+00
   2.8000000e+02   2.4935326e+00
   2.9000000e+02   2.4746614e+00
   3.0000000e+02   2.4563891e+00
   3.1000000e+02   2.4386949e+00
   3.2000000e+02   2.4215570e+00
   3.3000000e+02   2.4049540e+00
   3.4000000e+02   2.3888645e+00
   3.5000000e+02   2.3732675e+00
   3.6000000e+02   2.3581428e+00
   3.7000000e+02   2.3434707e+00
   3.8000000e+02   2.3292322e+00
   3.9000000e+02   2.3154093e+00
   4.0000000e+02   2.3019846e+00
   4.1000000e+02   2.2889416e+00
   4.2000000e+02   2.2762643e+00
   4.3000000e+02   2.2639377e+00
   4.4000000e+02   2.2519475e+00
   4.5000000e+02   2.2402801e+00
   4.6000000e+02   2.2289224e+00
   4.7000000e+02   2.2178620e+00
   4.8000000e+02   2.2070873e+00
   4.9000000e+02   2.1965871e+00
   5.0000000e+02   2.1863507e+00
   5.1000000e+02   2.1763680e+00
   5.2000000e+02   2.1666295e+00
   5.3000000e+02   2.1571259e+00
   5.4000000e+02   2.1478486e+00
   5.5000000e+02   2.1387893e+00
   5.6000000e+02   2.1299401e+00
   5.7000000e+02   2.1212934e+00
   5.8000000e+02   2.1128422e+00
   5.9000000e+02   2.1045794e+00
   6.0000000e+02   2.0964987e+00
   6.1000000e+02   2.0885937e+00
   6.2000000e+02   2.0808586e+00
   6.3000000e+02   2.0732876e+00
   6.4000000e+02   2.0658753e+00
   6.5000000e+02   2.0586165e+00
   6.6000000e+02   2.0515063e+00
   6.7000000e+02   2.0445398e+00
   6.8000000e+02   2.0377126e+00
   6.9000000e+02   2.0310203e+00
   7.0000000e+02   2.0244586e+00
   7.1000000e+02   2.0180237e+00
   7.2000000e+02   2.0117116e+00
   7.3000000e+02   2.0055187e+00
   7.4000000e+02   1.9994414e+00
   7.5000000e+02   1.9934763e+00
   7.6000000e+02   1.9876202e+00
   7.7000000e+02   1.9818699e+00
   7.8000000e+02   1.9762225e+00
   7.9000000e+02   1.9706750e+00
   8.0000000e+02   1.9652246e+00
   8.1000000e+02   1.9598687e+00
   8.2000000e+02   1.9546046e+00
   8.3000000e+02   1.9494300e+00
   8.4000000e+02   1.9443423e+00
   8.5000000e+02   1.9393393e+00
   8.6000000e+02   1.9344187e+00
   8.7000000e+02   1.9295785e+00
   8.8000000e+02   1.9248165e+00
   8.9000000e+02   1.9201307e+00
   9.0000000e+02   1.9155192e+00
   9.1000000e+02   1.9109801e+00
   9.2000000e+02   1.9065117e+00
   9.3000000e+02   1.9021121e+00
   9.4000000e+02   1.8977798e+00
   9.5000000e+02   1.8935130e+00
   9.6000000e+02   1.8893103e+00
   9.7000000e+02   1.8851701e+00
   9.8000000e+02   1.8810908e+00
   9.9000000e+02   1.8770712e+00
   1.0000000e+03   1.8731098e+00
   1.0100000e+03   1.8692052e+00
   1.0200000e+03   1.8653562e+00
   1.0300000e+03   1.8615616e+00
   1.0400000e+03   1.8578201e+00
   1.0500000e+03   1.8541304e+00
   1.0600000e+03   1.8504916e+00
   1.0700000e+03   1.8469025e+00
   1.0800000e+03   1.8433619e+00
   1.0900000e+03   1.8398689e+00
   1.1000000e+03   1.8364224e+00
   1.1100000e+03   1.8330215e+00
   1.1200000e+03   1.8296652e+00
   1.1300000e+03   1.8263526e+00
   1.1400000e+03   1.8230827e+00
   1.1500000e+03   1.8198547e+00
   1.1600000e+03   1.8166678e+00
   1.1700000e+03   1.8135211e+00
   1.1800000e+03   1.8104137e+00
   1.1900000e+03   1.8073450e+00
   1.2000000e+03   1.8043141e+00
   1.2100000e+03   1.8013204e+00
   1.2200000e+03   1.7983630e+00
   1.2300000e+03   1.7954413e+00
   1.2400000e+03   1.7925547e+00
   1.2500000e+03   1.7897023e+00
   1.2600000e+03   1.7868837e+00
   1.2700000e+03   1.7840981e+00
   1.2800000e+03   1.7813449e+00
   1.2900000e+03   1.7786236e+00
   1.3000000e+03   1.7759335e+00
   1.3100000e+03   1.7732741e+00
   1.3200000e+03   1.7706449e+00
   1.3300000e+03   1.7680452e+00
   1.3400000e+03   1.7654745e+00
   1.3500000e+03   1.7629324e+00
   1.3600000e+03   1.7604184e+00
   1.3700000e+03   1.7579318e+00
   1.3800000e+03   1.7554723e+00
   1.3900000e+03   1.7530395e+00
   1.4000000e+03   1.7506327e+00
   1.4100000e+03   1.7482516e+00
   1.4200000e+03   1.7458958e+00
   1.4300000e+03   1.7435648e+00
   1.4400000e+03   1.7412582e+00
   1.4500000e+03   1.7389756e+00
   1.4600000e+03   1.7367167e+00
   1.4700000e+03   1.7344809e+00
   1.4800000e+03   1.7322679e+00
   1.4900000e+03   1.7300775e+00
   1.5000000e+03   1.7279091e+00
   1.5100000e+03   1.7257625e+00
   1.5200000e+03   1.7236372e+00
   1.5300000e+03   1.7215331e+00
   1.5400000e+03   1.7194496e+00
   1.5500000e+03   1.7173866e+00
   1.5600000e+03   1.7153436e+00
   1.5700000e+03   1.7133204e+00
   1.5800000e+03   1.7113167e+00
   1.5900000e+03   1.7093321e+00
   1.6000000e+03   1.7073665e+00
   1.6100000e+03   1.7054194e+00
   1.6200000e+03   1.7034906e+00
   1.6300000e+03   1.7015799e+00
   1.6400000e+03   1.6996869e+00
   1.6500000e+03   1.6978114e+00
   1.6600000e+03   1.6959532e+00
   1.6700000e+03   1.6941120e+00
   1.6800000e+03   1.6922875e+00
   1.6900000e+03   1.6904795e+00
   1.7000000e+03   1.6886878e+00
   1.7100000e+03   1.6869122e+00
   1.7200000e+03   1.6851523e+00
   1.7300000e+03   1.6834080e+00
   1.7400000e+03   1.6816791e+00
   1.7500000e+03   1.6799653e+00
   1.7600000e+03   1.6782664e+00
   1.7700000e+03   1.6765823e+00
   1.7800000e+03   1.6749127e+00
   1.7900000e+03   1.6732574e+00
   1.8000000e+03   1.6716163e+00
   1.8100000e+03   1.6699891e+00
   1.8200000e+03   1.6683756e+00
   1.8300000e+03   1.6667757e+00
   1.8400000e+03   1.6651892e+00
   1.8500000e+03   1.6636159e+00
   1.8600000e+03   1.6620556e+00
   1.8700000e+03   1.6605082e+00
   1.8800000e+03   1.6589734e+00
   1.8900000e+03   1.6574512e+00
   1.9000000e+03   1.6559413e+00
   1.9100000e+03   1.6544437e+00
   1.9200000e+03   1.6529581e+00
   1.9300000e+03   1.6514843e+00
   1.9400000e+03   1.6500223e+00
   1.9500000e+03   1.6485719e+00
   1.9600000e+03   1.6471329e+00
   1.9700000e+03   1.6457053e+00
   1.9800000e+03   1.6442887e+00
   1.9900000e+03   1.6428832e+00
   2.0000000e+03   1.6414886e+00
   2.0100000e+03   1.6401047e+00
   2.0200000e+03   1.6387315e+00
   2.0300000e+03   1.6373687e+00
   2.0400000e+03   1.6360163e+00
   2.0500000e+03   1.6346741e+00
   2.0600000e+03   1.6333420e+00
   2.0700000e+03   1.6320199e+00
   2.0800000e+03   1.6307077e+00
   2.0900000e+03   1.6294052e+00
   2.1000000e+03   1.6281123e+00
   2.1100000e+03   1.6268290e+00
   2.1200000e+03   1.6255551e+00
   2.1300000e+03   1.6242905e+00
   2.1400000e+03   1.6230351e+00
   2.1500000e+03   1.6217887e+00
   2.1600000e+03   1.6205514e+00
   2.1700000e+03   1.6193229e+00
   2.1800000e+03   1.6181032e+00
   2.1900000e+03   1.6168922e+00
   2.2000000e+03   1.6156897e+00
   2.2100000e+03   1.6144958e+00
   2.2200000e+03   1.6133102e+00
   2.2300000e+03   1.6121329e+00
   2.2400000e+03   1.6109638e+00
   2.2500000e+03   1.6098028e+00
   2.2600000e+03   1.6086498e+00
   2.2700000e+03   1.6075048e+00
   2.2800000e+03   1.6063676e+00
   2.2900000e+03   1.6052382e+00
   2.3000000e+03   1.6041164e+00
   2.3100000e+03   1.6030022e+00
   2.3200000e+03   1.6018956e+00
   2.3300000e+03   1.6007963e+00
   2.3400000e+03   1.5997044e+00
   2.3500000e+03   1.5986198e+00
   2.3600000e+03   1.5975424e+00
   2.3700000e+03   1.5964721e+00
   2.3800000e+03   1.5954088e+00
   2.3900000e+03   1.5943525e+00
   2.4000000e+03   1.5933031e+00
   2.4100000e+03   1.5922606e+00
   2.4200000e+03   1.5912247e+00
   2.4300000e+03   1.5901956e+00
   2.4400000e+03   1.5891731e+00
   2.4500000e+03   1.5881571e+00
   2.4600000e+03   1.5871476e+00
   2.4700000e+03   1.5861445e+00
   2.4800000e+03   1.5851478e+00
   2.4900000e+03   1.5841573e+00
   2.5000000e+03   1.5831731e+00
   2.5100000e+03   1.5821950e+00
   2.5200000e+03   1.5812230e+00
   2.5300000e+03   1.5802571e+00
   2.5400000e+03   1.5792972e+00
   2.5500000e+03   1.5783431e+00
   2.5600000e+03   1.5773950e+00
   2.5700000e+03   1.5764526e+00
   2.5800000e+03   1.5755160e+00
   2.5900000e+03   1.5745850e+00
   2.6000000e+03   1.5736597e+00
   2.6100000e+03   1.5727400e+00
   2.6200000e+03   1.5718258e+00
   2.6300000e+03   1.5709171e+00
   2.6400000e+03   1.5700138e+00
   2.6500000e+03   1.5691159e+00
   2.6600000e+03   1.5682233e+00
   2.6700000e+03   1.5673360e+00
   2.6800000e+03   1.5664539e+00
   2.6900000e+03   1.5655770e+00
   2.7000000e+03   1.5647052e+00
   2.7100000e+03   1.5638384e+00
   2.7200000e+03   1.5629767e+00
   2.7300000e+03   1.5621200e+00
   2.7400000e+03   1.5612682e+00
   2.7500000e+03   1.5604213e+00
   2.7600000e+03   1.5595793e+00
   2.7700000e+03   1.5587420e+00
   2.7800000e+03   1.5579095e+00
   2.7900000e+03   1.5570817e+00
   2.8000000e+03   1.5562586e+00
   2.8100000e+03   1.5554402e+00
   2.8200000e+03   1.5546263e+00
   2.8300000e+03   1.5538170e+00
   2.8400000e+03   1.5530121e+00
   2.8500000e+03   1.5522118e+00
   2.8600000e+03   1.5514158e+00
   2.8700000e+03   1.5506243e+00
   2.8800000e+03   1.5498371e+00
   2.8900000e+03   1.5490542e+00
   2.9000000e+03   1.5482756e+00
   2.9100000e+03   1.5475013e+00
   2.9200000e+03   1.5467311e+00
   2.9300000e+03   1.5459651e+00
   2.9400000e+03   1.5452032e+00
   2.9500000e+03   1.5444454e+00
   2.9600000e+03   1.5436917e+00
   2.9700000e+03   1.5429420e+00
   2.9800000e+03   1.5421963e+00
   2.9900000e+03   1.5414546e+00
   3.0000000e+03   1.5407167e+00
   3.0100000e+03   1.5399828e+00
   3.0200000e+03   1.5392527e+00
   3.0300000e+03   1.5385265e+00
   3.0400000e+03   1.5378040e+00
   3.0500000e+03   1.5370853e+00
   3.0600000e+03   1.5363703e+00
   3.0700000e+03   1.5356590e+00
   3.0800000e+03   1.5349514e+00
   3.0900000e+03   1.5342474e+00
   3.1000000e+03   1.5335471e+00
   3.1100000e+03   1.5328503e+00
   3.1200000e+03   1.5321571e+00
   3.1300000e+03   1.5314673e+00
   3.1400000e+03   1.5307811e+00
   3.1500000e+03   1.5300984e+00
   3.1600000e+03   1.5294190e+00
   3.1700000e+03   1.5287431e+00
   3.1800000e+03   1.5280706e+00
   3.1900000e+03   1.5274014e+00
   3.2000000e+03   1.5267356e+00
   3.2100000e+03   1.5260730e+00
   3.2200000e+03   1.5254138e+00
   3.2300000e+03   1.5247577e+00
   3.2400000e+03   1.5241049e+00
   3.2500000e+03   1.5234553e+00
   3.2600000e+03   1.5228089e+00
   3.2700000e+03   1.5221656e+00
   3.2800000e+03   1.5215255e+00
   3.2900000e+03   1.5208884e+00
   3.3000000e+03   1.5202545e+00
   3.3100000e+03   1.5196236e+00
   3.3200000e+03   1.5189957e+00
   3.3300000e+03   1.5183708e+00
   3.3400000e+03   1.5177489e+00
   3.3500000e+03   1.5171299e+00
   3.3600000e+03   1.5165139e+00
   3.3700000e+03   1.5159009e+00
   3.3800000e+03   1.5152907e+00
   3.3900000e+03   1.5146833e+00
   3.4000000e+03   1.5140789e+00
   3.4100000e+03   1.5134772e+00
   3.4200000e+03   1.5128784e+00
   3.4300000e+03   1.5122824e+00
   3.4400000e+03   1.5116891e+00
   3.4500000e+03   1.5110986e+00
   3.4600000e+03   1.5105108e+00
   3.4700000e+03   1.5099257e+00
   3.4800000e+03   1.5093433e+00
   3.4900000e+03   1.5087635e+00
   3.5000000e+03   1.5081864e+00
   3.5100000e+03   1.5076120e+00
   3.5200000e+03   1.5070401e+00
   3.5300000e+03   1.5064708e+00
   3.5400000e+03   1.5059041e+00
   3.5500000e+03   1.5053400e+00
   3.5600000e+03   1.5047784e+00
   3.5700000e+03   1.5042193e+00
   3.5800000e+03   1.5036627e+00
   3.5900000e+03   1.5031086e+00
   3.6000000e+03   1.5025569e+00
   3.6100000e+03   1.5020077e+00
   3.6200000e+03   1.5014609e+00
   3.6300000e+03   1.5009166e+00
   3.6400000e+03   1.5003746e+00
   3.6500000e+03   1.4998350e+00
   3.6600000e+03   1.4992978e+00
   3.6700000e+03   1.4987629e+00
   3.6800000e+03   1.4982303e+00
   3.6900000e+03   1.4977001e+00
   3.7000000e+03   1.4971721e+00
   3.7100000e+03   1.4966464e+00
   3.7200000e+03   1.4961230e+00
   3.7300000e+03   1.4956019e+00
   3.7400000e+03   1.4950830e+00
   3.7500000e+03   1.4945662e+00
   3.7600000e+03   1.4940517e+00
   3.7700000e+03   1.4935394e+00
   3.7800000e+03   1.4930293e+00
   3.7900000e+03   1.4925213e+00
   3.8000000e+03   1.4920155e+00
   3.8100000e+03   1.4915118e+00
   3.8200000e+03   1.4910102e+00
   3.8300000e+03   1.4905107e+00
   3.8400000e+03   1.4900133e+00
   3.8500000e+03   1.4895179e+00
   3.8600000e+03   1.4890247e+00
   3.8700000e+03   1.4885334e+00
   3.8800000e+03   1.4880442e+00
   3.8900000e+03   1.4875571e+00
   3.9000000e+03   1.4870719e+00
   3.9100000e+03   1.4865887e+00
   3.9200000e+03   1.4861075e+00
   3.9300000e+03   1.4856283e+00
   3.9400000e+03   1.4851510e+00
   3.9500000e+03   1.4846757e+00
   3.9600000e+03   1.4842023e+00
   3.9700000e+03   1.4837308e+00
   3.9800000e+03   1.4832612e+00
   3.9900000e+03   1.4827935e+00
   4.0000000e+03   1.4823277e+00
