0.0000e+00 1.0000e+01 4.0960e-14  # vgs vds sigma
0.0000e+00 2.0000e+01 4.0960e-14
0.0000e+00 3.0000e+01 4.0960e-14
0.0000e+00 4.0000e+01 4.0960e-14
0.0000e+00 5.0000e+01 4.0960e-14
0.0000e+00 6.0000e+01 4.0960e-14
0.0000e+00 7.0000e+01 4.0960e-14

2.5000e-02 1.0000e+01 4.0960e-14
2.5000e-02 2.0000e+01 4.0960e-14
2.5000e-02 3.0000e+01 4.0960e-14
2.5000e-02 4.0000e+01 4.0960e-14
2.5000e-02 5.0000e+01 4.0960e-14
2.5000e-02 6.0000e+01 4.0960e-14
2.5000e-02 7.0000e+01 4.0960e-14

5.0000e-02 1.0000e+01 4.0960e-14
5.0000e-02 2.0000e+01 4.0960e-14
5.0000e-02 3.0000e+01 4.0960e-14
5.0000e-02 4.0000e+01 4.0960e-14
5.0000e-02 5.0000e+01 4.0960e-14
5.0000e-02 6.0000e+01 4.0960e-14
5.0000e-02 7.0000e+01 4.0960e-14

7.5000e-02 1.0000e+01 4.0960e-14
7.5000e-02 2.0000e+01 4.0960e-14
7.5000e-02 3.0000e+01 4.0960e-14
7.5000e-02 4.0000e+01 4.0960e-14
7.5000e-02 5.0000e+01 4.0960e-14
7.5000e-02 6.0000e+01 4.0960e-14
7.5000e-02 7.0000e+01 4.0960e-14

1.0000e-01 1.0000e+01 4.0960e-14
1.0000e-01 2.0000e+01 4.0960e-14
1.0000e-01 3.0000e+01 4.0960e-14
1.0000e-01 4.0000e+01 4.0960e-14
1.0000e-01 5.0000e+01 4.0960e-14
1.0000e-01 6.0000e+01 4.0960e-14
1.0000e-01 7.0000e+01 4.0960e-14

1.2500e-01 1.0000e+01 4.0960e-14
1.2500e-01 2.0000e+01 4.0960e-14
1.2500e-01 3.0000e+01 4.0960e-14
1.2500e-01 4.0000e+01 4.0960e-14
1.2500e-01 5.0000e+01 4.0960e-14
1.2500e-01 6.0000e+01 4.0960e-14
1.2500e-01 7.0000e+01 4.0960e-14

1.5000e-01 1.0000e+01 4.0960e-14
1.5000e-01 2.0000e+01 4.0960e-14
1.5000e-01 3.0000e+01 4.0960e-14
1.5000e-01 4.0000e+01 4.0960e-14
1.5000e-01 5.0000e+01 4.0960e-14
1.5000e-01 6.0000e+01 4.0960e-14
1.5000e-01 7.0000e+01 4.0960e-14

1.7500e-01 1.0000e+01 4.0960e-14
1.7500e-01 2.0000e+01 4.0960e-14
1.7500e-01 3.0000e+01 4.0960e-14
1.7500e-01 4.0000e+01 4.0960e-14
1.7500e-01 5.0000e+01 4.0960e-14
1.7500e-01 6.0000e+01 4.0960e-14
1.7500e-01 7.0000e+01 4.0960e-14

2.0000e-01 1.0000e+01 4.0960e-14
2.0000e-01 2.0000e+01 4.0960e-14
2.0000e-01 3.0000e+01 4.0960e-14
2.0000e-01 4.0000e+01 4.0960e-14
2.0000e-01 5.0000e+01 4.0960e-14
2.0000e-01 6.0000e+01 4.0960e-14
2.0000e-01 7.0000e+01 4.0960e-14

2.2500e-01 1.0000e+01 4.0960e-14
2.2500e-01 2.0000e+01 4.0960e-14
2.2500e-01 3.0000e+01 4.0960e-14
2.2500e-01 4.0000e+01 4.0960e-14
2.2500e-01 5.0000e+01 4.0960e-14
2.2500e-01 6.0000e+01 4.0960e-14
2.2500e-01 7.0000e+01 4.0960e-14

2.5000e-01 1.0000e+01 4.0960e-14
2.5000e-01 2.0000e+01 4.0960e-14
2.5000e-01 3.0000e+01 4.0960e-14
2.5000e-01 4.0000e+01 4.0960e-14
2.5000e-01 5.0000e+01 4.0960e-14
2.5000e-01 6.0000e+01 4.0960e-14
2.5000e-01 7.0000e+01 4.0960e-14

2.7500e-01 1.0000e+01 4.0960e-14
2.7500e-01 2.0000e+01 4.0960e-14
2.7500e-01 3.0000e+01 4.0960e-14
2.7500e-01 4.0000e+01 4.0960e-14
2.7500e-01 5.0000e+01 4.0960e-14
2.7500e-01 6.0000e+01 4.0960e-14
2.7500e-01 7.0000e+01 4.0960e-14

3.0000e-01 1.0000e+01 4.0960e-14
3.0000e-01 2.0000e+01 4.0960e-14
3.0000e-01 3.0000e+01 4.0960e-14
3.0000e-01 4.0000e+01 4.0960e-14
3.0000e-01 5.0000e+01 4.0960e-14
3.0000e-01 6.0000e+01 4.0960e-14
3.0000e-01 7.0000e+01 4.0960e-14

3.2500e-01 1.0000e+01 4.0960e-14
3.2500e-01 2.0000e+01 4.0960e-14
3.2500e-01 3.0000e+01 4.0960e-14
3.2500e-01 4.0000e+01 4.0960e-14
3.2500e-01 5.0000e+01 4.0960e-14
3.2500e-01 6.0000e+01 4.0960e-14
3.2500e-01 7.0000e+01 4.0960e-14

3.5000e-01 1.0000e+01 4.0960e-14
3.5000e-01 2.0000e+01 4.0960e-14
3.5000e-01 3.0000e+01 4.0960e-14
3.5000e-01 4.0000e+01 4.0960e-14
3.5000e-01 5.0000e+01 4.0960e-14
3.5000e-01 6.0000e+01 4.0960e-14
3.5000e-01 7.0000e+01 4.0960e-14

3.7500e-01 1.0000e+01 4.6340e-14
3.7500e-01 2.0000e+01 4.0960e-14
3.7500e-01 3.0000e+01 4.0960e-14
3.7500e-01 4.0000e+01 4.0960e-14
3.7500e-01 5.0000e+01 4.0960e-14
3.7500e-01 6.0000e+01 4.0960e-14
3.7500e-01 7.0000e+01 4.0960e-14

4.0000e-01 1.0000e+01 4.6340e-14
4.0000e-01 2.0000e+01 4.0960e-14
4.0000e-01 3.0000e+01 4.0960e-14
4.0000e-01 4.0000e+01 4.0960e-14
4.0000e-01 5.0000e+01 4.0960e-14
4.0000e-01 6.0000e+01 4.0960e-14
4.0000e-01 7.0000e+01 4.0960e-14

4.2500e-01 1.0000e+01 4.6340e-14
4.2500e-01 2.0000e+01 4.0960e-14
4.2500e-01 3.0000e+01 4.0960e-14
4.2500e-01 4.0000e+01 4.0960e-14
4.2500e-01 5.0000e+01 4.0960e-14
4.2500e-01 6.0000e+01 4.0960e-14
4.2500e-01 7.0000e+01 4.0960e-14

4.5000e-01 1.0000e+01 4.6340e-14
4.5000e-01 2.0000e+01 5.1720e-14
4.5000e-01 3.0000e+01 4.0960e-14
4.5000e-01 4.0000e+01 4.0960e-14
4.5000e-01 5.0000e+01 4.0960e-14
4.5000e-01 6.0000e+01 4.0960e-14
4.5000e-01 7.0000e+01 4.0960e-14

4.7500e-01 1.0000e+01 4.6340e-14
4.7500e-01 2.0000e+01 5.1720e-14
4.7500e-01 3.0000e+01 4.0960e-14
4.7500e-01 4.0000e+01 4.0960e-14
4.7500e-01 5.0000e+01 4.0960e-14
4.7500e-01 6.0000e+01 4.0960e-14
4.7500e-01 7.0000e+01 4.0960e-14

5.0000e-01 1.0000e+01 5.1720e-14
5.0000e-01 2.0000e+01 5.1720e-14
5.0000e-01 3.0000e+01 6.2480e-14
5.0000e-01 4.0000e+01 6.2480e-14
5.0000e-01 5.0000e+01 6.2480e-14
5.0000e-01 6.0000e+01 4.0960e-14
5.0000e-01 7.0000e+01 4.0960e-14

5.2500e-01 1.0000e+01 5.7100e-14
5.2500e-01 2.0000e+01 5.1720e-14
5.2500e-01 3.0000e+01 6.2480e-14
5.2500e-01 4.0000e+01 6.2480e-14
5.2500e-01 5.0000e+01 6.2480e-14
5.2500e-01 6.0000e+01 4.0960e-14
5.2500e-01 7.0000e+01 4.0960e-14

5.5000e-01 1.0000e+01 6.2480e-14
5.5000e-01 2.0000e+01 6.2480e-14
5.5000e-01 3.0000e+01 6.2480e-14
5.5000e-01 4.0000e+01 6.2480e-14
5.5000e-01 5.0000e+01 6.2480e-14
5.5000e-01 6.0000e+01 8.3999e-14
5.5000e-01 7.0000e+01 8.3999e-14

5.7500e-01 1.0000e+01 6.7860e-14
5.7500e-01 2.0000e+01 7.3239e-14
5.7500e-01 3.0000e+01 6.2480e-14
5.7500e-01 4.0000e+01 6.2480e-14
5.7500e-01 5.0000e+01 6.2480e-14
5.7500e-01 6.0000e+01 8.3999e-14
5.7500e-01 7.0000e+01 8.3999e-14

6.0000e-01 1.0000e+01 7.8619e-14
6.0000e-01 2.0000e+01 8.3999e-14
6.0000e-01 3.0000e+01 8.3999e-14
6.0000e-01 4.0000e+01 8.3999e-14
6.0000e-01 5.0000e+01 8.3999e-14
6.0000e-01 6.0000e+01 8.3999e-14
6.0000e-01 7.0000e+01 8.3999e-14

6.2500e-01 1.0000e+01 9.4759e-14
6.2500e-01 2.0000e+01 9.4759e-14
6.2500e-01 3.0000e+01 8.3999e-14
6.2500e-01 4.0000e+01 1.0552e-13
6.2500e-01 5.0000e+01 1.0552e-13
6.2500e-01 6.0000e+01 8.3999e-14
6.2500e-01 7.0000e+01 1.2704e-13

6.5000e-01 1.0000e+01 1.1628e-13
6.5000e-01 2.0000e+01 1.1628e-13
6.5000e-01 3.0000e+01 1.0552e-13
6.5000e-01 4.0000e+01 1.2704e-13
6.5000e-01 5.0000e+01 1.2704e-13
6.5000e-01 6.0000e+01 1.2704e-13
6.5000e-01 7.0000e+01 1.2704e-13

6.7500e-01 1.0000e+01 1.4318e-13
6.7500e-01 2.0000e+01 1.4856e-13
6.7500e-01 3.0000e+01 1.4856e-13
6.7500e-01 4.0000e+01 1.4856e-13
6.7500e-01 5.0000e+01 1.4856e-13
6.7500e-01 6.0000e+01 1.7008e-13
6.7500e-01 7.0000e+01 1.7008e-13

7.0000e-01 1.0000e+01 1.8622e-13
7.0000e-01 2.0000e+01 1.8084e-13
7.0000e-01 3.0000e+01 1.9160e-13
7.0000e-01 4.0000e+01 1.9160e-13
7.0000e-01 5.0000e+01 1.9160e-13
7.0000e-01 6.0000e+01 2.1312e-13
7.0000e-01 7.0000e+01 2.1312e-13

7.2500e-01 1.0000e+01 2.4540e-13
7.2500e-01 2.0000e+01 2.4540e-13
7.2500e-01 3.0000e+01 2.5616e-13
7.2500e-01 4.0000e+01 2.5616e-13
7.2500e-01 5.0000e+01 2.5616e-13
7.2500e-01 6.0000e+01 2.5616e-13
7.2500e-01 7.0000e+01 2.9920e-13

7.5000e-01 1.0000e+01 3.2609e-13
7.5000e-01 2.0000e+01 3.3147e-13
7.5000e-01 3.0000e+01 3.2071e-13
7.5000e-01 4.0000e+01 3.4223e-13
7.5000e-01 5.0000e+01 3.4223e-13
7.5000e-01 6.0000e+01 3.8527e-13
7.5000e-01 7.0000e+01 4.2831e-13

7.7500e-01 1.0000e+01 4.4983e-13
7.7500e-01 2.0000e+01 4.4983e-13
7.7500e-01 3.0000e+01 4.4983e-13
7.7500e-01 4.0000e+01 4.4983e-13
7.7500e-01 5.0000e+01 4.7135e-13
7.7500e-01 6.0000e+01 5.1439e-13
7.7500e-01 7.0000e+01 5.5743e-13

8.0000e-01 1.0000e+01 6.1661e-13
8.0000e-01 2.0000e+01 6.2199e-13
8.0000e-01 3.0000e+01 6.2199e-13
8.0000e-01 4.0000e+01 6.4351e-13
8.0000e-01 5.0000e+01 6.6503e-13
8.0000e-01 6.0000e+01 6.8655e-13
8.0000e-01 7.0000e+01 7.7263e-13

8.2500e-01 1.0000e+01 8.6947e-13
8.2500e-01 2.0000e+01 8.6947e-13
8.2500e-01 3.0000e+01 8.8022e-13
8.2500e-01 4.0000e+01 8.8022e-13
8.2500e-01 5.0000e+01 9.2326e-13
8.2500e-01 6.0000e+01 9.8782e-13
8.2500e-01 7.0000e+01 1.1169e-12

8.5000e-01 1.0000e+01 1.2245e-12
8.5000e-01 2.0000e+01 1.2245e-12
8.5000e-01 3.0000e+01 1.2461e-12
8.5000e-01 4.0000e+01 1.2461e-12
8.5000e-01 5.0000e+01 1.2891e-12
8.5000e-01 6.0000e+01 1.3752e-12
8.5000e-01 7.0000e+01 1.5473e-12

8.7500e-01 1.0000e+01 1.7410e-12
8.7500e-01 2.0000e+01 1.7518e-12
8.7500e-01 3.0000e+01 1.7625e-12
8.7500e-01 4.0000e+01 1.7840e-12
8.7500e-01 5.0000e+01 1.8486e-12
8.7500e-01 6.0000e+01 1.9777e-12
8.7500e-01 7.0000e+01 2.2360e-12

9.0000e-01 1.0000e+01 2.4942e-12
9.0000e-01 2.0000e+01 2.5050e-12
9.0000e-01 3.0000e+01 2.5157e-12
9.0000e-01 4.0000e+01 2.5588e-12
9.0000e-01 5.0000e+01 2.6448e-12
9.0000e-01 6.0000e+01 2.8385e-12
9.0000e-01 7.0000e+01 3.1828e-12

9.2500e-01 1.0000e+01 3.5863e-12
9.2500e-01 2.0000e+01 3.6025e-12
9.2500e-01 3.0000e+01 3.6132e-12
9.2500e-01 4.0000e+01 3.6778e-12
9.2500e-01 5.0000e+01 3.8069e-12
9.2500e-01 6.0000e+01 4.0436e-12
9.2500e-01 7.0000e+01 4.6031e-12

9.5000e-01 1.0000e+01 5.1895e-12
9.5000e-01 2.0000e+01 5.2057e-12
9.5000e-01 3.0000e+01 5.2272e-12
9.5000e-01 4.0000e+01 5.3133e-12
9.5000e-01 5.0000e+01 5.4854e-12
9.5000e-01 6.0000e+01 5.8513e-12
9.5000e-01 7.0000e+01 6.6690e-12

9.7500e-01 1.0000e+01 7.5298e-12
9.7500e-01 2.0000e+01 7.5513e-12
9.7500e-01 3.0000e+01 7.5943e-12
9.7500e-01 4.0000e+01 7.7235e-12
9.7500e-01 5.0000e+01 7.9817e-12
9.7500e-01 6.0000e+01 8.5197e-12
9.7500e-01 7.0000e+01 9.6817e-12

1.0000e+00 1.0000e+01 1.0968e-11
1.0000e+00 2.0000e+01 1.0994e-11
1.0000e+00 3.0000e+01 1.1081e-11
1.0000e+00 4.0000e+01 1.1253e-11
1.0000e+00 5.0000e+01 1.1619e-11
1.0000e+00 6.0000e+01 1.2436e-11
1.0000e+00 7.0000e+01 1.4072e-11

1.0250e+00 1.0000e+01 1.6030e-11
1.0250e+00 2.0000e+01 1.6073e-11
1.0250e+00 3.0000e+01 1.6181e-11
1.0250e+00 4.0000e+01 1.6439e-11
1.0250e+00 5.0000e+01 1.6977e-11
1.0250e+00 6.0000e+01 1.8160e-11
1.0250e+00 7.0000e+01 2.0614e-11

1.0500e+00 1.0000e+01 2.3508e-11
1.0500e+00 2.0000e+01 2.3573e-11
1.0500e+00 3.0000e+01 2.3734e-11
1.0500e+00 4.0000e+01 2.4100e-11
1.0500e+00 5.0000e+01 2.4896e-11
1.0500e+00 6.0000e+01 2.6639e-11
1.0500e+00 7.0000e+01 3.0211e-11

1.0750e+00 1.0000e+01 3.4575e-11
1.0750e+00 2.0000e+01 3.4666e-11
1.0750e+00 3.0000e+01 3.4924e-11
1.0750e+00 4.0000e+01 3.5462e-11
1.0750e+00 5.0000e+01 3.6624e-11
1.0750e+00 6.0000e+01 3.9164e-11
1.0750e+00 7.0000e+01 4.4414e-11

1.1000e+00 1.0000e+01 5.0994e-11
1.1000e+00 2.0000e+01 5.1129e-11
1.1000e+00 3.0000e+01 5.1494e-11
1.1000e+00 4.0000e+01 5.2312e-11
1.1000e+00 5.0000e+01 5.4034e-11
1.1000e+00 6.0000e+01 5.7800e-11
1.1000e+00 7.0000e+01 6.5504e-11

1.1250e+00 1.0000e+01 7.5408e-11
1.1250e+00 2.0000e+01 7.5607e-11
1.1250e+00 3.0000e+01 7.6156e-11
1.1250e+00 4.0000e+01 7.7339e-11
1.1250e+00 5.0000e+01 7.9900e-11
1.1250e+00 6.0000e+01 8.5431e-11
1.1250e+00 7.0000e+01 9.6879e-11

1.1500e+00 1.0000e+01 1.1179e-10
1.1500e+00 2.0000e+01 1.1208e-10
1.1500e+00 3.0000e+01 1.1289e-10
1.1500e+00 4.0000e+01 1.1465e-10
1.1500e+00 5.0000e+01 1.1844e-10
1.1500e+00 6.0000e+01 1.2666e-10
1.1500e+00 7.0000e+01 1.4366e-10

1.1750e+00 1.0000e+01 1.6611e-10
1.1750e+00 2.0000e+01 1.6654e-10
1.1750e+00 3.0000e+01 1.6774e-10
1.1750e+00 4.0000e+01 1.7039e-10
1.1750e+00 5.0000e+01 1.7601e-10
1.1750e+00 6.0000e+01 1.8821e-10
1.1750e+00 7.0000e+01 2.1343e-10

1.2000e+00 1.0000e+01 2.4736e-10
1.2000e+00 2.0000e+01 2.4800e-10
1.2000e+00 3.0000e+01 2.4982e-10
1.2000e+00 4.0000e+01 2.5374e-10
1.2000e+00 5.0000e+01 2.6211e-10
1.2000e+00 6.0000e+01 2.8031e-10
1.2000e+00 7.0000e+01 3.1784e-10

1.2250e+00 1.0000e+01 3.6913e-10
1.2250e+00 2.0000e+01 3.7011e-10
1.2250e+00 3.0000e+01 3.7280e-10
1.2250e+00 4.0000e+01 3.7866e-10
1.2250e+00 5.0000e+01 3.9114e-10
1.2250e+00 6.0000e+01 4.1830e-10
1.2250e+00 7.0000e+01 4.7429e-10

1.2500e+00 1.0000e+01 5.5192e-10
1.2500e+00 2.0000e+01 5.5340e-10
1.2500e+00 3.0000e+01 5.5742e-10
1.2500e+00 4.0000e+01 5.6620e-10
1.2500e+00 5.0000e+01 5.8486e-10
1.2500e+00 6.0000e+01 6.2544e-10
1.2500e+00 7.0000e+01 7.0916e-10

1.2750e+00 1.0000e+01 8.2677e-10
1.2750e+00 2.0000e+01 8.2899e-10
1.2750e+00 3.0000e+01 8.3502e-10
1.2750e+00 4.0000e+01 8.4817e-10
1.2750e+00 5.0000e+01 8.7615e-10
1.2750e+00 6.0000e+01 9.3696e-10
1.2750e+00 7.0000e+01 1.0622e-09

1.3000e+00 1.0000e+01 1.2406e-09
1.3000e+00 2.0000e+01 1.2440e-09
1.3000e+00 3.0000e+01 1.2531e-09
1.3000e+00 4.0000e+01 1.2728e-09
1.3000e+00 5.0000e+01 1.3148e-09
1.3000e+00 6.0000e+01 1.4060e-09
1.3000e+00 7.0000e+01 1.5940e-09

1.3250e+00 1.0000e+01 1.8646e-09
1.3250e+00 2.0000e+01 1.8698e-09
1.3250e+00 3.0000e+01 1.8835e-09
1.3250e+00 4.0000e+01 1.9131e-09
1.3250e+00 5.0000e+01 1.9762e-09
1.3250e+00 6.0000e+01 2.1132e-09
1.3250e+00 7.0000e+01 2.3956e-09

1.3500e+00 1.0000e+01 2.8070e-09
1.3500e+00 2.0000e+01 2.8148e-09
1.3500e+00 3.0000e+01 2.8354e-09
1.3500e+00 4.0000e+01 2.8801e-09
1.3500e+00 5.0000e+01 2.9750e-09
1.3500e+00 6.0000e+01 3.1813e-09
1.3500e+00 7.0000e+01 3.6063e-09

1.3750e+00 1.0000e+01 4.2316e-09
1.3750e+00 2.0000e+01 4.2435e-09
1.3750e+00 3.0000e+01 4.2746e-09
1.3750e+00 4.0000e+01 4.3418e-09
1.3750e+00 5.0000e+01 4.4850e-09
1.3750e+00 6.0000e+01 4.7959e-09
1.3750e+00 7.0000e+01 5.4362e-09

1.4000e+00 1.0000e+01 6.3882e-09
1.4000e+00 2.0000e+01 6.4060e-09
1.4000e+00 3.0000e+01 6.4530e-09
1.4000e+00 4.0000e+01 6.5549e-09
1.4000e+00 5.0000e+01 6.7711e-09
1.4000e+00 6.0000e+01 7.2403e-09
1.4000e+00 7.0000e+01 8.2065e-09

1.4250e+00 1.0000e+01 9.6556e-09
1.4250e+00 2.0000e+01 9.6826e-09
1.4250e+00 3.0000e+01 9.7537e-09
1.4250e+00 4.0000e+01 9.9078e-09
1.4250e+00 5.0000e+01 1.0235e-08
1.4250e+00 6.0000e+01 1.0943e-08
1.4250e+00 7.0000e+01 1.2403e-08

1.4500e+00 1.0000e+01 1.4611e-08
1.4500e+00 2.0000e+01 1.4652e-08
1.4500e+00 3.0000e+01 1.4759e-08
1.4500e+00 4.0000e+01 1.4993e-08
1.4500e+00 5.0000e+01 1.5487e-08
1.4500e+00 6.0000e+01 1.6560e-08
1.4500e+00 7.0000e+01 1.8768e-08

1.4750e+00 1.0000e+01 2.2130e-08
1.4750e+00 2.0000e+01 2.2193e-08
1.4750e+00 3.0000e+01 2.2356e-08
1.4750e+00 4.0000e+01 2.2710e-08
1.4750e+00 5.0000e+01 2.3459e-08
1.4750e+00 6.0000e+01 2.5082e-08
1.4750e+00 7.0000e+01 2.8425e-08

1.5000e+00 1.0000e+01 3.3547e-08
1.5000e+00 2.0000e+01 3.3643e-08
1.5000e+00 3.0000e+01 3.3891e-08
1.5000e+00 4.0000e+01 3.4427e-08
1.5000e+00 5.0000e+01 3.5562e-08
1.5000e+00 6.0000e+01 3.8023e-08
1.5000e+00 7.0000e+01 4.3088e-08

1.5250e+00 1.0000e+01 5.0885e-08
1.5250e+00 2.0000e+01 5.1031e-08
1.5250e+00 3.0000e+01 5.1407e-08
1.5250e+00 4.0000e+01 5.2221e-08
1.5250e+00 5.0000e+01 5.3942e-08
1.5250e+00 6.0000e+01 5.7674e-08
1.5250e+00 7.0000e+01 6.5354e-08

1.5500e+00 1.0000e+01 7.7208e-08
1.5500e+00 2.0000e+01 7.7429e-08
1.5500e+00 3.0000e+01 7.8001e-08
1.5500e+00 4.0000e+01 7.9235e-08
1.5500e+00 5.0000e+01 8.1847e-08
1.5500e+00 6.0000e+01 8.7507e-08
1.5500e+00 7.0000e+01 9.9154e-08

1.5750e+00 1.0000e+01 1.1714e-07
1.5750e+00 2.0000e+01 1.1747e-07
1.5750e+00 3.0000e+01 1.1834e-07
1.5750e+00 4.0000e+01 1.2021e-07
1.5750e+00 5.0000e+01 1.2418e-07
1.5750e+00 6.0000e+01 1.3276e-07
1.5750e+00 7.0000e+01 1.5042e-07

1.6000e+00 1.0000e+01 1.7760e-07
1.6000e+00 2.0000e+01 1.7812e-07
1.6000e+00 3.0000e+01 1.7943e-07
1.6000e+00 4.0000e+01 1.8227e-07
1.6000e+00 5.0000e+01 1.8828e-07
1.6000e+00 6.0000e+01 2.0129e-07
1.6000e+00 7.0000e+01 2.2805e-07

1.6250e+00 1.0000e+01 2.6892e-07
1.6250e+00 2.0000e+01 2.6970e-07
1.6250e+00 3.0000e+01 2.7169e-07
1.6250e+00 4.0000e+01 2.7599e-07
1.6250e+00 5.0000e+01 2.8509e-07
1.6250e+00 6.0000e+01 3.0478e-07
1.6250e+00 7.0000e+01 3.4529e-07

1.6500e+00 1.0000e+01 4.0625e-07
1.6500e+00 2.0000e+01 4.0743e-07
1.6500e+00 3.0000e+01 4.1044e-07
1.6500e+00 4.0000e+01 4.1694e-07
1.6500e+00 5.0000e+01 4.3068e-07
1.6500e+00 6.0000e+01 4.6041e-07
1.6500e+00 7.0000e+01 5.2157e-07

1.6750e+00 1.0000e+01 6.1152e-07
1.6750e+00 2.0000e+01 6.1330e-07
1.6750e+00 3.0000e+01 6.1783e-07
1.6750e+00 4.0000e+01 6.2761e-07
1.6750e+00 5.0000e+01 6.4828e-07
1.6750e+00 6.0000e+01 6.9302e-07
1.6750e+00 7.0000e+01 7.8503e-07

1.7000e+00 1.0000e+01 9.1573e-07
1.7000e+00 2.0000e+01 9.1839e-07
1.7000e+00 3.0000e+01 9.2517e-07
1.7000e+00 4.0000e+01 9.3981e-07
1.7000e+00 5.0000e+01 9.7075e-07
1.7000e+00 6.0000e+01 1.0377e-06
1.7000e+00 7.0000e+01 1.1754e-06

1.7250e+00 1.0000e+01 1.3614e-06
1.7250e+00 2.0000e+01 1.3653e-06
1.7250e+00 3.0000e+01 1.3754e-06
1.7250e+00 4.0000e+01 1.3971e-06
1.7250e+00 5.0000e+01 1.4431e-06
1.7250e+00 6.0000e+01 1.5426e-06
1.7250e+00 7.0000e+01 1.7472e-06

1.7500e+00 1.0000e+01 2.0045e-06
1.7500e+00 2.0000e+01 2.0103e-06
1.7500e+00 3.0000e+01 2.0251e-06
1.7500e+00 4.0000e+01 2.0571e-06
1.7500e+00 5.0000e+01 2.1248e-06
1.7500e+00 6.0000e+01 2.2712e-06
1.7500e+00 7.0000e+01 2.5722e-06

1.7750e+00 1.0000e+01 2.9156e-06
1.7750e+00 2.0000e+01 2.9240e-06
1.7750e+00 3.0000e+01 2.9456e-06
1.7750e+00 4.0000e+01 2.9921e-06
1.7750e+00 5.0000e+01 3.0904e-06
1.7750e+00 6.0000e+01 3.3031e-06
1.7750e+00 7.0000e+01 3.7406e-06

1.8000e+00 1.0000e+01 4.1781e-06
1.8000e+00 2.0000e+01 4.1901e-06
1.8000e+00 3.0000e+01 4.2208e-06
1.8000e+00 4.0000e+01 4.2874e-06
1.8000e+00 5.0000e+01 4.4281e-06
1.8000e+00 6.0000e+01 4.7326e-06
1.8000e+00 7.0000e+01 5.3590e-06

1.8250e+00 1.0000e+01 5.8843e-06
1.8250e+00 2.0000e+01 5.9011e-06
1.8250e+00 3.0000e+01 5.9443e-06
1.8250e+00 4.0000e+01 6.0378e-06
1.8250e+00 5.0000e+01 6.2357e-06
1.8250e+00 6.0000e+01 6.6640e-06
1.8250e+00 7.0000e+01 7.5452e-06

1.8500e+00 1.0000e+01 8.1292e-06
1.8500e+00 2.0000e+01 8.1524e-06
1.8500e+00 3.0000e+01 8.2118e-06
1.8500e+00 4.0000e+01 8.3407e-06
1.8500e+00 5.0000e+01 8.6136e-06
1.8500e+00 6.0000e+01 9.2045e-06
1.8500e+00 7.0000e+01 1.0420e-05

1.8750e+00 1.0000e+01 1.1003e-05
1.8750e+00 2.0000e+01 1.1035e-05
1.8750e+00 3.0000e+01 1.1115e-05
1.8750e+00 4.0000e+01 1.1289e-05
1.8750e+00 5.0000e+01 1.1657e-05
1.8750e+00 6.0000e+01 1.2456e-05
1.8750e+00 7.0000e+01 1.4098e-05

1.9000e+00 1.0000e+01 1.4587e-05
1.9000e+00 2.0000e+01 1.4628e-05
1.9000e+00 3.0000e+01 1.4733e-05
1.9000e+00 4.0000e+01 1.4963e-05
1.9000e+00 5.0000e+01 1.5450e-05
1.9000e+00 6.0000e+01 1.6506e-05
1.9000e+00 7.0000e+01 1.8679e-05

1.9250e+00 1.0000e+01 1.8943e-05
1.9250e+00 2.0000e+01 1.8995e-05
1.9250e+00 3.0000e+01 1.9131e-05
1.9250e+00 4.0000e+01 1.9427e-05
1.9250e+00 5.0000e+01 2.0061e-05
1.9250e+00 6.0000e+01 2.1425e-05
1.9250e+00 7.0000e+01 2.4243e-05

1.9500e+00 1.0000e+01 2.4120e-05
1.9500e+00 2.0000e+01 2.4187e-05
1.9500e+00 3.0000e+01 2.4363e-05
1.9500e+00 4.0000e+01 2.4724e-05
1.9500e+00 5.0000e+01 2.5537e-05
1.9500e+00 6.0000e+01 2.7271e-05
1.9500e+00 7.0000e+01 3.0842e-05

1.9750e+00 1.0000e+01 3.0150e-05
1.9750e+00 2.0000e+01 3.0235e-05
1.9750e+00 3.0000e+01 3.0453e-05
1.9750e+00 4.0000e+01 3.0954e-05
1.9750e+00 5.0000e+01 3.1907e-05
1.9750e+00 6.0000e+01 3.4073e-05
1.9750e+00 7.0000e+01 3.8527e-05

2.0000e+00 1.0000e+01 3.7053e-05
2.0000e+00 2.0000e+01 3.7156e-05
2.0000e+00 3.0000e+01 3.7422e-05
2.0000e+00 4.0000e+01 3.7985e-05
2.0000e+00 5.0000e+01 3.9218e-05
2.0000e+00 6.0000e+01 4.1852e-05
2.0000e+00 7.0000e+01 4.7290e-05

2.0250e+00 1.0000e+01 4.4833e-05
2.0250e+00 2.0000e+01 4.4958e-05
2.0250e+00 3.0000e+01 4.5277e-05
2.0250e+00 4.0000e+01 4.5959e-05
2.0250e+00 5.0000e+01 4.7421e-05
2.0250e+00 6.0000e+01 5.0597e-05
2.0250e+00 7.0000e+01 5.7166e-05

2.0500e+00 1.0000e+01 5.3488e-05
2.0500e+00 2.0000e+01 5.3637e-05
2.0500e+00 3.0000e+01 5.3968e-05
2.0500e+00 4.0000e+01 5.4788e-05
2.0500e+00 5.0000e+01 5.6546e-05
2.0500e+00 6.0000e+01 6.0328e-05
2.0500e+00 7.0000e+01 6.8103e-05

2.0750e+00 1.0000e+01 6.3011e-05
2.0750e+00 2.0000e+01 6.3186e-05
2.0750e+00 3.0000e+01 6.3625e-05
2.0750e+00 4.0000e+01 6.4526e-05
2.0750e+00 5.0000e+01 6.6583e-05
2.0750e+00 6.0000e+01 7.1025e-05
2.0750e+00 7.0000e+01 8.0114e-05

2.1000e+00 1.0000e+01 7.3386e-05
2.1000e+00 2.0000e+01 7.3590e-05
2.1000e+00 3.0000e+01 7.4087e-05
2.1000e+00 4.0000e+01 7.5147e-05
2.1000e+00 5.0000e+01 7.7504e-05
2.1000e+00 6.0000e+01 8.2616e-05
2.1000e+00 7.0000e+01 9.3163e-05

2.1250e+00 1.0000e+01 8.4597e-05
2.1250e+00 2.0000e+01 8.4832e-05
2.1250e+00 3.0000e+01 8.5397e-05
2.1250e+00 4.0000e+01 8.6606e-05
2.1250e+00 5.0000e+01 8.9296e-05
2.1250e+00 6.0000e+01 9.5142e-05
2.1250e+00 7.0000e+01 1.0722e-04

2.1500e+00 1.0000e+01 9.6625e-05
2.1500e+00 2.0000e+01 9.6893e-05
2.1500e+00 3.0000e+01 9.7528e-05
2.1500e+00 4.0000e+01 9.8893e-05
2.1500e+00 5.0000e+01 1.0193e-04
2.1500e+00 6.0000e+01 1.0858e-04
2.1500e+00 7.0000e+01 1.2224e-04

2.1750e+00 1.0000e+01 1.0945e-04
2.1750e+00 2.0000e+01 1.0975e-04
2.1750e+00 3.0000e+01 1.1046e-04
2.1750e+00 4.0000e+01 1.1198e-04
2.1750e+00 5.0000e+01 1.1539e-04
2.1750e+00 6.0000e+01 1.2283e-04
2.1750e+00 7.0000e+01 1.3820e-04

2.2000e+00 1.0000e+01 1.2304e-04
2.2000e+00 2.0000e+01 1.2338e-04
2.2000e+00 3.0000e+01 1.2417e-04
2.2000e+00 4.0000e+01 1.2586e-04
2.2000e+00 5.0000e+01 1.2964e-04
2.2000e+00 6.0000e+01 1.3794e-04
2.2000e+00 7.0000e+01 1.5506e-04

2.2250e+00 1.0000e+01 1.3739e-04
2.2250e+00 2.0000e+01 1.3777e-04
2.2250e+00 3.0000e+01 1.3863e-04
2.2250e+00 4.0000e+01 1.4049e-04
2.2250e+00 5.0000e+01 1.4466e-04
2.2250e+00 6.0000e+01 1.5383e-04
2.2250e+00 7.0000e+01 1.7278e-04

2.2500e+00 1.0000e+01 1.5247e-04
2.2500e+00 2.0000e+01 1.5289e-04
2.2500e+00 3.0000e+01 1.5383e-04
2.2500e+00 4.0000e+01 1.5586e-04
2.2500e+00 5.0000e+01 1.6042e-04
2.2500e+00 6.0000e+01 1.7049e-04
2.2500e+00 7.0000e+01 1.9132e-04

2.2750e+00 1.0000e+01 1.6826e-04
2.2750e+00 2.0000e+01 1.6872e-04
2.2750e+00 3.0000e+01 1.6973e-04
2.2750e+00 4.0000e+01 1.7193e-04
2.2750e+00 5.0000e+01 1.7690e-04
2.2750e+00 6.0000e+01 1.8789e-04
2.2750e+00 7.0000e+01 2.1065e-04

2.3000e+00 1.0000e+01 1.8473e-04
2.3000e+00 2.0000e+01 1.8524e-04
2.3000e+00 3.0000e+01 1.8633e-04
2.3000e+00 4.0000e+01 1.8870e-04
2.3000e+00 5.0000e+01 1.9408e-04
2.3000e+00 6.0000e+01 2.0600e-04
2.3000e+00 7.0000e+01 2.3073e-04

2.3250e+00 1.0000e+01 2.0187e-04
2.3250e+00 2.0000e+01 2.0242e-04
2.3250e+00 3.0000e+01 2.0359e-04
2.3250e+00 4.0000e+01 2.0613e-04
2.3250e+00 5.0000e+01 2.1192e-04
2.3250e+00 6.0000e+01 2.2479e-04
2.3250e+00 7.0000e+01 2.5152e-04

2.3500e+00 1.0000e+01 2.1966e-04
2.3500e+00 2.0000e+01 2.2025e-04
2.3500e+00 3.0000e+01 2.2150e-04
2.3500e+00 4.0000e+01 2.2420e-04
2.3500e+00 5.0000e+01 2.3040e-04
2.3500e+00 6.0000e+01 2.4423e-04
2.3500e+00 7.0000e+01 2.7299e-04

2.3750e+00 1.0000e+01 2.3807e-04
2.3750e+00 2.0000e+01 2.3871e-04
2.3750e+00 3.0000e+01 2.4003e-04
2.3750e+00 4.0000e+01 2.4290e-04
2.3750e+00 5.0000e+01 2.4951e-04
2.3750e+00 6.0000e+01 2.6429e-04
2.3750e+00 7.0000e+01 2.9510e-04

2.4000e+00 1.0000e+01 2.5709e-04
2.4000e+00 2.0000e+01 2.5778e-04
2.4000e+00 3.0000e+01 2.5916e-04
2.4000e+00 4.0000e+01 2.6219e-04
2.4000e+00 5.0000e+01 2.6922e-04
2.4000e+00 6.0000e+01 2.8496e-04
2.4000e+00 7.0000e+01 3.1783e-04

2.4250e+00 1.0000e+01 2.7670e-04
2.4250e+00 2.0000e+01 2.7743e-04
2.4250e+00 3.0000e+01 2.7888e-04
2.4250e+00 4.0000e+01 2.8207e-04
2.4250e+00 5.0000e+01 2.8950e-04
2.4250e+00 6.0000e+01 3.0621e-04
2.4250e+00 7.0000e+01 3.4115e-04

2.4500e+00 1.0000e+01 2.9687e-04
2.4500e+00 2.0000e+01 2.9765e-04
2.4500e+00 3.0000e+01 2.9917e-04
2.4500e+00 4.0000e+01 3.0251e-04
2.4500e+00 5.0000e+01 3.1034e-04
2.4500e+00 6.0000e+01 3.2801e-04
2.4500e+00 7.0000e+01 3.6501e-04

2.4750e+00 1.0000e+01 3.1759e-04
2.4750e+00 2.0000e+01 3.1842e-04
2.4750e+00 3.0000e+01 3.2001e-04
2.4750e+00 4.0000e+01 3.2349e-04
2.4750e+00 5.0000e+01 3.3171e-04
2.4750e+00 6.0000e+01 3.5035e-04
2.4750e+00 7.0000e+01 3.8942e-04

2.5000e+00 1.0000e+01 3.3887e-04
2.5000e+00 2.0000e+01 3.3972e-04
2.5000e+00 3.0000e+01 3.4148e-04
2.5000e+00 4.0000e+01 3.4501e-04
2.5000e+00 5.0000e+01 3.5361e-04
2.5000e+00 6.0000e+01 3.7321e-04
2.5000e+00 7.0000e+01 4.1432e-04

2.5250e+00 1.0000e+01 3.6062e-04
2.5250e+00 2.0000e+01 3.6165e-04
2.5250e+00 3.0000e+01 3.6320e-04
2.5250e+00 4.0000e+01 3.6702e-04
2.5250e+00 5.0000e+01 3.7600e-04
2.5250e+00 6.0000e+01 3.9656e-04
2.5250e+00 7.0000e+01 4.3971e-04

2.5500e+00 1.0000e+01 3.8289e-04
2.5500e+00 2.0000e+01 3.8394e-04
2.5500e+00 3.0000e+01 3.8558e-04
2.5500e+00 4.0000e+01 3.8953e-04
2.5500e+00 5.0000e+01 3.9888e-04
2.5500e+00 6.0000e+01 4.2038e-04
2.5500e+00 7.0000e+01 4.6558e-04

2.5750e+00 1.0000e+01 4.0568e-04
2.5750e+00 2.0000e+01 4.0664e-04
2.5750e+00 3.0000e+01 4.0845e-04
2.5750e+00 4.0000e+01 4.1252e-04
2.5750e+00 5.0000e+01 4.2221e-04
2.5750e+00 6.0000e+01 4.4463e-04
2.5750e+00 7.0000e+01 4.9185e-04

2.6000e+00 1.0000e+01 4.2893e-04
2.6000e+00 2.0000e+01 4.2991e-04
2.6000e+00 3.0000e+01 4.3178e-04
2.6000e+00 4.0000e+01 4.3587e-04
2.6000e+00 5.0000e+01 4.4607e-04
2.6000e+00 6.0000e+01 4.6934e-04
2.6000e+00 7.0000e+01 5.1855e-04

2.6250e+00 1.0000e+01 4.5264e-04
2.6250e+00 2.0000e+01 4.5368e-04
2.6250e+00 3.0000e+01 4.5556e-04
2.6250e+00 4.0000e+01 4.5976e-04
2.6250e+00 5.0000e+01 4.7013e-04
2.6250e+00 6.0000e+01 4.9445e-04
2.6250e+00 7.0000e+01 5.4562e-04

2.6500e+00 1.0000e+01 4.7678e-04
2.6500e+00 2.0000e+01 4.7788e-04
2.6500e+00 3.0000e+01 4.7980e-04
2.6500e+00 4.0000e+01 4.8408e-04
2.6500e+00 5.0000e+01 4.9487e-04
2.6500e+00 6.0000e+01 5.1997e-04
2.6500e+00 7.0000e+01 5.7312e-04

2.6750e+00 1.0000e+01 5.0137e-04
2.6750e+00 2.0000e+01 5.0251e-04
2.6750e+00 3.0000e+01 5.0448e-04
2.6750e+00 4.0000e+01 5.0883e-04
2.6750e+00 5.0000e+01 5.1994e-04
2.6750e+00 6.0000e+01 5.4588e-04
2.6750e+00 7.0000e+01 6.0100e-04

2.7000e+00 1.0000e+01 5.2635e-04
2.7000e+00 2.0000e+01 5.2752e-04
2.7000e+00 3.0000e+01 5.2956e-04
2.7000e+00 4.0000e+01 5.3398e-04
2.7000e+00 5.0000e+01 5.4539e-04
2.7000e+00 6.0000e+01 5.7219e-04
2.7000e+00 7.0000e+01 6.2902e-04

2.7250e+00 1.0000e+01 5.5177e-04
2.7250e+00 2.0000e+01 5.5302e-04
2.7250e+00 3.0000e+01 5.5505e-04
2.7250e+00 4.0000e+01 5.5953e-04
2.7250e+00 5.0000e+01 5.7120e-04
2.7250e+00 6.0000e+01 5.9884e-04
2.7250e+00 7.0000e+01 6.5752e-04

2.7500e+00 1.0000e+01 5.7758e-04
2.7500e+00 2.0000e+01 5.7885e-04
2.7500e+00 3.0000e+01 5.8093e-04
2.7500e+00 4.0000e+01 5.8546e-04
2.7500e+00 5.0000e+01 5.9744e-04
2.7500e+00 6.0000e+01 6.2582e-04
2.7500e+00 7.0000e+01 6.8636e-04

2.7750e+00 1.0000e+01 6.0379e-04
2.7750e+00 2.0000e+01 6.0509e-04
2.7750e+00 3.0000e+01 6.0719e-04
2.7750e+00 4.0000e+01 6.1177e-04
2.7750e+00 5.0000e+01 6.2397e-04
2.7750e+00 6.0000e+01 6.5318e-04
2.7750e+00 7.0000e+01 7.1549e-04

2.8000e+00 1.0000e+01 6.3036e-04
2.8000e+00 2.0000e+01 6.3171e-04
2.8000e+00 3.0000e+01 6.3383e-04
2.8000e+00 4.0000e+01 6.3844e-04
2.8000e+00 5.0000e+01 6.5091e-04
2.8000e+00 6.0000e+01 6.8070e-04
2.8000e+00 7.0000e+01 7.4491e-04

2.8250e+00 1.0000e+01 6.5727e-04
2.8250e+00 2.0000e+01 6.5869e-04
2.8250e+00 3.0000e+01 6.6083e-04
2.8250e+00 4.0000e+01 6.6546e-04
2.8250e+00 5.0000e+01 6.7810e-04
2.8250e+00 6.0000e+01 7.0866e-04
2.8250e+00 7.0000e+01 7.7462e-04

2.8500e+00 1.0000e+01 6.8459e-04
2.8500e+00 2.0000e+01 6.8603e-04
2.8500e+00 3.0000e+01 6.8818e-04
2.8500e+00 4.0000e+01 6.9283e-04
2.8500e+00 5.0000e+01 7.0530e-04
2.8500e+00 6.0000e+01 7.3696e-04
2.8500e+00 7.0000e+01 8.0459e-04

2.8750e+00 1.0000e+01 7.1216e-04
2.8750e+00 2.0000e+01 7.1371e-04
2.8750e+00 3.0000e+01 7.1587e-04
2.8750e+00 4.0000e+01 7.2053e-04
2.8750e+00 5.0000e+01 7.3346e-04
2.8750e+00 6.0000e+01 7.6554e-04
2.8750e+00 7.0000e+01 8.3481e-04

2.9000e+00 1.0000e+01 7.4003e-04
2.9000e+00 2.0000e+01 7.4173e-04
2.9000e+00 3.0000e+01 7.4390e-04
2.9000e+00 4.0000e+01 7.4856e-04
2.9000e+00 5.0000e+01 7.6183e-04
2.9000e+00 6.0000e+01 7.9441e-04
2.9000e+00 7.0000e+01 8.6528e-04

2.9250e+00 1.0000e+01 7.6832e-04
2.9250e+00 2.0000e+01 7.7008e-04
2.9250e+00 3.0000e+01 7.7225e-04
2.9250e+00 4.0000e+01 7.7690e-04
2.9250e+00 5.0000e+01 7.9016e-04
2.9250e+00 6.0000e+01 8.2355e-04
2.9250e+00 7.0000e+01 8.9599e-04

2.9500e+00 1.0000e+01 7.9695e-04
2.9500e+00 2.0000e+01 7.9874e-04
2.9500e+00 3.0000e+01 8.0092e-04
2.9500e+00 4.0000e+01 8.0556e-04
2.9500e+00 5.0000e+01 8.1892e-04
2.9500e+00 6.0000e+01 8.5297e-04
2.9500e+00 7.0000e+01 9.2692e-04

2.9750e+00 1.0000e+01 8.2587e-04
2.9750e+00 2.0000e+01 8.2771e-04
2.9750e+00 3.0000e+01 8.2989e-04
2.9750e+00 4.0000e+01 8.3451e-04
2.9750e+00 5.0000e+01 8.4802e-04
2.9750e+00 6.0000e+01 8.8264e-04
2.9750e+00 7.0000e+01 9.5806e-04

3.0000e+00 1.0000e+01 8.5510e-04
3.0000e+00 2.0000e+01 8.5699e-04
3.0000e+00 3.0000e+01 8.5916e-04
3.0000e+00 4.0000e+01 8.6375e-04
3.0000e+00 5.0000e+01 8.7738e-04
3.0000e+00 6.0000e+01 9.1257e-04
3.0000e+00 7.0000e+01 9.8941e-04

3.0250e+00 1.0000e+01 8.8461e-04
3.0250e+00 2.0000e+01 8.8656e-04
3.0250e+00 3.0000e+01 8.8873e-04
3.0250e+00 4.0000e+01 8.9328e-04
3.0250e+00 5.0000e+01 9.0700e-04
3.0250e+00 6.0000e+01 9.4275e-04
3.0250e+00 7.0000e+01 1.0210e-03

3.0500e+00 1.0000e+01 9.1442e-04
3.0500e+00 2.0000e+01 9.1641e-04
3.0500e+00 3.0000e+01 9.1858e-04
3.0500e+00 4.0000e+01 9.2309e-04
3.0500e+00 5.0000e+01 9.3689e-04
3.0500e+00 6.0000e+01 9.7317e-04
3.0500e+00 7.0000e+01 1.0527e-03

3.0750e+00 1.0000e+01 9.4450e-04
3.0750e+00 2.0000e+01 9.4654e-04
3.0750e+00 3.0000e+01 9.4870e-04
3.0750e+00 4.0000e+01 9.5317e-04
3.0750e+00 5.0000e+01 9.6703e-04
3.0750e+00 6.0000e+01 1.0038e-03
3.0750e+00 7.0000e+01 1.0846e-03

3.1000e+00 1.0000e+01 9.7485e-04
3.1000e+00 2.0000e+01 9.7694e-04
3.1000e+00 3.0000e+01 9.7909e-04
3.1000e+00 4.0000e+01 9.8351e-04
3.1000e+00 5.0000e+01 9.9742e-04
3.1000e+00 6.0000e+01 1.0347e-03
3.1000e+00 7.0000e+01 1.1167e-03

3.1250e+00 1.0000e+01 1.0055e-03
3.1250e+00 2.0000e+01 1.0076e-03
3.1250e+00 3.0000e+01 1.0098e-03
3.1250e+00 4.0000e+01 1.0141e-03
3.1250e+00 5.0000e+01 1.0281e-03
3.1250e+00 6.0000e+01 1.0658e-03
3.1250e+00 7.0000e+01 1.1489e-03

3.1500e+00 1.0000e+01 1.0363e-03
3.1500e+00 2.0000e+01 1.0385e-03
3.1500e+00 3.0000e+01 1.0407e-03
3.1500e+00 4.0000e+01 1.0450e-03
3.1500e+00 5.0000e+01 1.0589e-03
3.1500e+00 6.0000e+01 1.0971e-03
3.1500e+00 7.0000e+01 1.1813e-03

3.1750e+00 1.0000e+01 1.0675e-03
3.1750e+00 2.0000e+01 1.0697e-03
3.1750e+00 3.0000e+01 1.0717e-03
3.1750e+00 4.0000e+01 1.0761e-03
3.1750e+00 5.0000e+01 1.0901e-03
3.1750e+00 6.0000e+01 1.1286e-03
3.1750e+00 7.0000e+01 1.2139e-03

3.2000e+00 1.0000e+01 1.0988e-03
3.2000e+00 2.0000e+01 1.1011e-03
3.2000e+00 3.0000e+01 1.1031e-03
3.2000e+00 4.0000e+01 1.1074e-03
3.2000e+00 5.0000e+01 1.1214e-03
3.2000e+00 6.0000e+01 1.1603e-03
3.2000e+00 7.0000e+01 1.2466e-03

3.2250e+00 1.0000e+01 1.1304e-03
3.2250e+00 2.0000e+01 1.1328e-03
3.2250e+00 3.0000e+01 1.1348e-03
3.2250e+00 4.0000e+01 1.1390e-03
3.2250e+00 5.0000e+01 1.1530e-03
3.2250e+00 6.0000e+01 1.1923e-03
3.2250e+00 7.0000e+01 1.2795e-03

3.2500e+00 1.0000e+01 1.1623e-03
3.2500e+00 2.0000e+01 1.1647e-03
3.2500e+00 3.0000e+01 1.1667e-03
3.2500e+00 4.0000e+01 1.1708e-03
3.2500e+00 5.0000e+01 1.1848e-03
3.2500e+00 6.0000e+01 1.2244e-03
3.2500e+00 7.0000e+01 1.3125e-03

3.2750e+00 1.0000e+01 1.1943e-03
3.2750e+00 2.0000e+01 1.1968e-03
3.2750e+00 3.0000e+01 1.1988e-03
3.2750e+00 4.0000e+01 1.2028e-03
3.2750e+00 5.0000e+01 1.2168e-03
3.2750e+00 6.0000e+01 1.2567e-03
3.2750e+00 7.0000e+01 1.3457e-03

3.3000e+00 1.0000e+01 1.2266e-03
3.3000e+00 2.0000e+01 1.2291e-03
3.3000e+00 3.0000e+01 1.2311e-03
3.3000e+00 4.0000e+01 1.2351e-03
3.3000e+00 5.0000e+01 1.2490e-03
3.3000e+00 6.0000e+01 1.2892e-03
3.3000e+00 7.0000e+01 1.3790e-03

3.3250e+00 1.0000e+01 1.2591e-03
3.3250e+00 2.0000e+01 1.2617e-03
3.3250e+00 3.0000e+01 1.2636e-03
3.3250e+00 4.0000e+01 1.2675e-03
3.3250e+00 5.0000e+01 1.2814e-03
3.3250e+00 6.0000e+01 1.3219e-03
3.3250e+00 7.0000e+01 1.4125e-03

3.3500e+00 1.0000e+01 1.2918e-03
3.3500e+00 2.0000e+01 1.2944e-03
3.3500e+00 3.0000e+01 1.2964e-03
3.3500e+00 4.0000e+01 1.3002e-03
3.3500e+00 5.0000e+01 1.3140e-03
3.3500e+00 6.0000e+01 1.3548e-03
3.3500e+00 7.0000e+01 1.4460e-03

3.3750e+00 1.0000e+01 1.3247e-03
3.3750e+00 2.0000e+01 1.3274e-03
3.3750e+00 3.0000e+01 1.3293e-03
3.3750e+00 4.0000e+01 1.3331e-03
3.3750e+00 5.0000e+01 1.3468e-03
3.3750e+00 6.0000e+01 1.3878e-03
3.3750e+00 7.0000e+01 1.4798e-03

3.4000e+00 1.0000e+01 1.3578e-03
3.4000e+00 2.0000e+01 1.3605e-03
3.4000e+00 3.0000e+01 1.3625e-03
3.4000e+00 4.0000e+01 1.3661e-03
3.4000e+00 5.0000e+01 1.3798e-03
3.4000e+00 6.0000e+01 1.4210e-03
3.4000e+00 7.0000e+01 1.5136e-03

3.4250e+00 1.0000e+01 1.3911e-03
3.4250e+00 2.0000e+01 1.3939e-03
3.4250e+00 3.0000e+01 1.3958e-03
3.4250e+00 4.0000e+01 1.3994e-03
3.4250e+00 5.0000e+01 1.4131e-03
3.4250e+00 6.0000e+01 1.4544e-03
3.4250e+00 7.0000e+01 1.5476e-03

3.4500e+00 1.0000e+01 1.4246e-03
3.4500e+00 2.0000e+01 1.4274e-03
3.4500e+00 3.0000e+01 1.4293e-03
3.4500e+00 4.0000e+01 1.4329e-03
3.4500e+00 5.0000e+01 1.4464e-03
3.4500e+00 6.0000e+01 1.4880e-03
3.4500e+00 7.0000e+01 1.5817e-03

3.4750e+00 1.0000e+01 1.4582e-03
3.4750e+00 2.0000e+01 1.4612e-03
3.4750e+00 3.0000e+01 1.4631e-03
3.4750e+00 4.0000e+01 1.4665e-03
3.4750e+00 5.0000e+01 1.4800e-03
3.4750e+00 6.0000e+01 1.5217e-03
3.4750e+00 7.0000e+01 1.6160e-03

3.5000e+00 1.0000e+01 1.4921e-03
3.5000e+00 2.0000e+01 1.4951e-03
3.5000e+00 3.0000e+01 1.4970e-03
3.5000e+00 4.0000e+01 1.5003e-03
3.5000e+00 5.0000e+01 1.5138e-03
3.5000e+00 6.0000e+01 1.5556e-03
3.5000e+00 7.0000e+01 1.6503e-03

3.5250e+00 1.0000e+01 1.5261e-03
3.5250e+00 2.0000e+01 1.5292e-03
3.5250e+00 3.0000e+01 1.5310e-03
3.5250e+00 4.0000e+01 1.5343e-03
3.5250e+00 5.0000e+01 1.5477e-03
3.5250e+00 6.0000e+01 1.5897e-03
3.5250e+00 7.0000e+01 1.6848e-03

3.5500e+00 1.0000e+01 1.5603e-03
3.5500e+00 2.0000e+01 1.5634e-03
3.5500e+00 3.0000e+01 1.5653e-03
3.5500e+00 4.0000e+01 1.5685e-03
3.5500e+00 5.0000e+01 1.5818e-03
3.5500e+00 6.0000e+01 1.6239e-03
3.5500e+00 7.0000e+01 1.7194e-03

3.5750e+00 1.0000e+01 1.5947e-03
3.5750e+00 2.0000e+01 1.5978e-03
3.5750e+00 3.0000e+01 1.5997e-03
3.5750e+00 4.0000e+01 1.6029e-03
3.5750e+00 5.0000e+01 1.6161e-03
3.5750e+00 6.0000e+01 1.6582e-03
3.5750e+00 7.0000e+01 1.7540e-03

3.6000e+00 1.0000e+01 1.6292e-03
3.6000e+00 2.0000e+01 1.6324e-03
3.6000e+00 3.0000e+01 1.6343e-03
3.6000e+00 4.0000e+01 1.6373e-03
3.6000e+00 5.0000e+01 1.6505e-03
3.6000e+00 6.0000e+01 1.6927e-03
3.6000e+00 7.0000e+01 1.7888e-03

3.6250e+00 1.0000e+01 1.6638e-03
3.6250e+00 2.0000e+01 1.6671e-03
3.6250e+00 3.0000e+01 1.6690e-03
3.6250e+00 4.0000e+01 1.6720e-03
3.6250e+00 5.0000e+01 1.6850e-03
3.6250e+00 6.0000e+01 1.7273e-03
3.6250e+00 7.0000e+01 1.8237e-03

3.6500e+00 1.0000e+01 1.6986e-03
3.6500e+00 2.0000e+01 1.7020e-03
3.6500e+00 3.0000e+01 1.7039e-03
3.6500e+00 4.0000e+01 1.7068e-03
3.6500e+00 5.0000e+01 1.7198e-03
3.6500e+00 6.0000e+01 1.7621e-03
3.6500e+00 7.0000e+01 1.8586e-03

3.6750e+00 1.0000e+01 1.7336e-03
3.6750e+00 2.0000e+01 1.7371e-03
3.6750e+00 3.0000e+01 1.7390e-03
3.6750e+00 4.0000e+01 1.7418e-03
3.6750e+00 5.0000e+01 1.7547e-03
3.6750e+00 6.0000e+01 1.7970e-03
3.6750e+00 7.0000e+01 1.8937e-03

3.7000e+00 1.0000e+01 1.7687e-03
3.7000e+00 2.0000e+01 1.7723e-03
3.7000e+00 3.0000e+01 1.7742e-03
3.7000e+00 4.0000e+01 1.7770e-03
3.7000e+00 5.0000e+01 1.7898e-03
3.7000e+00 6.0000e+01 1.8320e-03
3.7000e+00 7.0000e+01 1.9289e-03

3.7250e+00 1.0000e+01 1.8040e-03
3.7250e+00 2.0000e+01 1.8076e-03
3.7250e+00 3.0000e+01 1.8095e-03
3.7250e+00 4.0000e+01 1.8123e-03
3.7250e+00 5.0000e+01 1.8250e-03
3.7250e+00 6.0000e+01 1.8672e-03
3.7250e+00 7.0000e+01 1.9641e-03

3.7500e+00 1.0000e+01 1.8394e-03
3.7500e+00 2.0000e+01 1.8431e-03
3.7500e+00 3.0000e+01 1.8450e-03
3.7500e+00 4.0000e+01 1.8478e-03
3.7500e+00 5.0000e+01 1.8603e-03
3.7500e+00 6.0000e+01 1.9025e-03
3.7500e+00 7.0000e+01 1.9994e-03

3.7750e+00 1.0000e+01 1.8750e-03
3.7750e+00 2.0000e+01 1.8787e-03
3.7750e+00 3.0000e+01 1.8807e-03
3.7750e+00 4.0000e+01 1.8833e-03
3.7750e+00 5.0000e+01 1.8959e-03
3.7750e+00 6.0000e+01 1.9380e-03
3.7750e+00 7.0000e+01 2.0348e-03

3.8000e+00 1.0000e+01 1.9106e-03
3.8000e+00 2.0000e+01 1.9145e-03
3.8000e+00 3.0000e+01 1.9165e-03
3.8000e+00 4.0000e+01 1.9191e-03
3.8000e+00 5.0000e+01 1.9315e-03
3.8000e+00 6.0000e+01 1.9736e-03
3.8000e+00 7.0000e+01 2.0703e-03

3.8250e+00 1.0000e+01 1.9464e-03
3.8250e+00 2.0000e+01 1.9504e-03
3.8250e+00 3.0000e+01 1.9524e-03
3.8250e+00 4.0000e+01 1.9550e-03
3.8250e+00 5.0000e+01 1.9673e-03
3.8250e+00 6.0000e+01 2.0093e-03
3.8250e+00 7.0000e+01 2.1058e-03

3.8500e+00 1.0000e+01 1.9824e-03
3.8500e+00 2.0000e+01 1.9865e-03
3.8500e+00 3.0000e+01 1.9884e-03
3.8500e+00 4.0000e+01 1.9910e-03
3.8500e+00 5.0000e+01 2.0032e-03
3.8500e+00 6.0000e+01 2.0451e-03
3.8500e+00 7.0000e+01 2.1415e-03

3.8750e+00 1.0000e+01 2.0184e-03
3.8750e+00 2.0000e+01 2.0226e-03
3.8750e+00 3.0000e+01 2.0246e-03
3.8750e+00 4.0000e+01 2.0271e-03
3.8750e+00 5.0000e+01 2.0393e-03
3.8750e+00 6.0000e+01 2.0811e-03
3.8750e+00 7.0000e+01 2.1772e-03

3.9000e+00 1.0000e+01 2.0546e-03
3.9000e+00 2.0000e+01 2.0589e-03
3.9000e+00 3.0000e+01 2.0609e-03
3.9000e+00 4.0000e+01 2.0634e-03
3.9000e+00 5.0000e+01 2.0755e-03
3.9000e+00 6.0000e+01 2.1172e-03
3.9000e+00 7.0000e+01 2.2130e-03

3.9250e+00 1.0000e+01 2.0909e-03
3.9250e+00 2.0000e+01 2.0953e-03
3.9250e+00 3.0000e+01 2.0974e-03
3.9250e+00 4.0000e+01 2.0998e-03
3.9250e+00 5.0000e+01 2.1119e-03
3.9250e+00 6.0000e+01 2.1534e-03
3.9250e+00 7.0000e+01 2.2488e-03

3.9500e+00 1.0000e+01 2.1273e-03
3.9500e+00 2.0000e+01 2.1318e-03
3.9500e+00 3.0000e+01 2.1339e-03
3.9500e+00 4.0000e+01 2.1363e-03
3.9500e+00 5.0000e+01 2.1483e-03
3.9500e+00 6.0000e+01 2.1897e-03
3.9500e+00 7.0000e+01 2.2847e-03

3.9750e+00 1.0000e+01 2.1638e-03
3.9750e+00 2.0000e+01 2.1685e-03
3.9750e+00 3.0000e+01 2.1706e-03
3.9750e+00 4.0000e+01 2.1730e-03
3.9750e+00 5.0000e+01 2.1849e-03
3.9750e+00 6.0000e+01 2.2261e-03
3.9750e+00 7.0000e+01 2.3207e-03

4.0000e+00 1.0000e+01 2.2004e-03
4.0000e+00 2.0000e+01 2.2052e-03
4.0000e+00 3.0000e+01 2.2074e-03
4.0000e+00 4.0000e+01 2.2098e-03
4.0000e+00 5.0000e+01 2.2216e-03
4.0000e+00 6.0000e+01 2.2626e-03
4.0000e+00 7.0000e+01 2.3568e-03

4.0250e+00 1.0000e+01 2.2370e-03
4.0250e+00 2.0000e+01 2.2421e-03
4.0250e+00 3.0000e+01 2.2443e-03
4.0250e+00 4.0000e+01 2.2467e-03
4.0250e+00 5.0000e+01 2.2584e-03
4.0250e+00 6.0000e+01 2.2993e-03
4.0250e+00 7.0000e+01 2.3929e-03

4.0500e+00 1.0000e+01 2.2738e-03
4.0500e+00 2.0000e+01 2.2791e-03
4.0500e+00 3.0000e+01 2.2813e-03
4.0500e+00 4.0000e+01 2.2837e-03
4.0500e+00 5.0000e+01 2.2953e-03
4.0500e+00 6.0000e+01 2.3360e-03
4.0500e+00 7.0000e+01 2.4291e-03

4.0750e+00 1.0000e+01 2.3107e-03
4.0750e+00 2.0000e+01 2.3162e-03
4.0750e+00 3.0000e+01 2.3185e-03
4.0750e+00 4.0000e+01 2.3208e-03
4.0750e+00 5.0000e+01 2.3324e-03
4.0750e+00 6.0000e+01 2.3728e-03
4.0750e+00 7.0000e+01 2.4653e-03

4.1000e+00 1.0000e+01 2.3476e-03
4.1000e+00 2.0000e+01 2.3534e-03
4.1000e+00 3.0000e+01 2.3557e-03
4.1000e+00 4.0000e+01 2.3580e-03
4.1000e+00 5.0000e+01 2.3696e-03
4.1000e+00 6.0000e+01 2.4098e-03
4.1000e+00 7.0000e+01 2.5017e-03

4.1250e+00 1.0000e+01 2.3846e-03
4.1250e+00 2.0000e+01 2.3907e-03
4.1250e+00 3.0000e+01 2.3930e-03
4.1250e+00 4.0000e+01 2.3954e-03
4.1250e+00 5.0000e+01 2.4068e-03
4.1250e+00 6.0000e+01 2.4468e-03
4.1250e+00 7.0000e+01 2.5380e-03

4.1500e+00 1.0000e+01 2.4217e-03
4.1500e+00 2.0000e+01 2.4281e-03
4.1500e+00 3.0000e+01 2.4305e-03
4.1500e+00 4.0000e+01 2.4329e-03
4.1500e+00 5.0000e+01 2.4442e-03
4.1500e+00 6.0000e+01 2.4839e-03
4.1500e+00 7.0000e+01 2.5745e-03

4.1750e+00 1.0000e+01 2.4588e-03
4.1750e+00 2.0000e+01 2.4655e-03
4.1750e+00 3.0000e+01 2.4680e-03
4.1750e+00 4.0000e+01 2.4698e-03
4.1750e+00 5.0000e+01 2.4817e-03
4.1750e+00 6.0000e+01 2.5211e-03
4.1750e+00 7.0000e+01 2.6109e-03

4.2000e+00 1.0000e+01 2.4959e-03
4.2000e+00 2.0000e+01 2.5031e-03
4.2000e+00 3.0000e+01 2.5056e-03
4.2000e+00 4.0000e+01 2.5082e-03
4.2000e+00 5.0000e+01 2.5193e-03
4.2000e+00 6.0000e+01 2.5584e-03
4.2000e+00 7.0000e+01 2.6475e-03

4.2250e+00 1.0000e+01 2.5330e-03
4.2250e+00 2.0000e+01 2.5408e-03
4.2250e+00 3.0000e+01 2.5434e-03
4.2250e+00 4.0000e+01 2.5457e-03
4.2250e+00 5.0000e+01 2.5569e-03
4.2250e+00 6.0000e+01 2.5957e-03
4.2250e+00 7.0000e+01 2.6840e-03

4.2500e+00 1.0000e+01 2.5702e-03
4.2500e+00 2.0000e+01 2.5785e-03
4.2500e+00 3.0000e+01 2.5812e-03
4.2500e+00 4.0000e+01 2.5836e-03
4.2500e+00 5.0000e+01 2.5947e-03
4.2500e+00 6.0000e+01 2.6332e-03
4.2500e+00 7.0000e+01 2.7206e-03

4.2750e+00 1.0000e+01 2.6073e-03
4.2750e+00 2.0000e+01 2.6164e-03
4.2750e+00 3.0000e+01 2.6191e-03
4.2750e+00 4.0000e+01 2.6216e-03
4.2750e+00 5.0000e+01 2.6326e-03
4.2750e+00 6.0000e+01 2.6707e-03
4.2750e+00 7.0000e+01 2.7573e-03

4.3000e+00 1.0000e+01 2.6443e-03
4.3000e+00 2.0000e+01 2.6543e-03
4.3000e+00 3.0000e+01 2.6571e-03
4.3000e+00 4.0000e+01 2.6591e-03
4.3000e+00 5.0000e+01 2.6706e-03
4.3000e+00 6.0000e+01 2.7083e-03
4.3000e+00 7.0000e+01 2.7940e-03

4.3250e+00 1.0000e+01 2.6812e-03
4.3250e+00 2.0000e+01 2.6923e-03
4.3250e+00 3.0000e+01 2.6952e-03
4.3250e+00 4.0000e+01 2.6980e-03
4.3250e+00 5.0000e+01 2.7086e-03
4.3250e+00 6.0000e+01 2.7460e-03
4.3250e+00 7.0000e+01 2.8307e-03

4.3500e+00 1.0000e+01 2.7180e-03
4.3500e+00 2.0000e+01 2.7304e-03
4.3500e+00 3.0000e+01 2.7333e-03
4.3500e+00 4.0000e+01 2.7362e-03
4.3500e+00 5.0000e+01 2.7467e-03
4.3500e+00 6.0000e+01 2.7837e-03
4.3500e+00 7.0000e+01 2.8675e-03

4.3750e+00 1.0000e+01 2.7545e-03
4.3750e+00 2.0000e+01 2.7686e-03
4.3750e+00 3.0000e+01 2.7716e-03
4.3750e+00 4.0000e+01 2.7745e-03
4.3750e+00 5.0000e+01 2.7849e-03
4.3750e+00 6.0000e+01 2.8215e-03
4.3750e+00 7.0000e+01 2.9043e-03

4.4000e+00 1.0000e+01 2.7907e-03
4.4000e+00 2.0000e+01 2.8068e-03
4.4000e+00 3.0000e+01 2.8099e-03
4.4000e+00 4.0000e+01 2.8129e-03
4.4000e+00 5.0000e+01 2.8232e-03
4.4000e+00 6.0000e+01 2.8594e-03
4.4000e+00 7.0000e+01 2.9411e-03

4.4250e+00 1.0000e+01 2.8266e-03
4.4250e+00 2.0000e+01 2.8451e-03
4.4250e+00 3.0000e+01 2.8483e-03
4.4250e+00 4.0000e+01 2.8513e-03
4.4250e+00 5.0000e+01 2.8616e-03
4.4250e+00 6.0000e+01 2.8973e-03
4.4250e+00 7.0000e+01 2.9779e-03

4.4500e+00 1.0000e+01 2.8619e-03
4.4500e+00 2.0000e+01 2.8834e-03
4.4500e+00 3.0000e+01 2.8868e-03
4.4500e+00 4.0000e+01 2.8898e-03
4.4500e+00 5.0000e+01 2.9000e-03
4.4500e+00 6.0000e+01 2.9353e-03
4.4500e+00 7.0000e+01 3.0148e-03

4.4750e+00 1.0000e+01 2.8966e-03
4.4750e+00 2.0000e+01 2.9218e-03
4.4750e+00 3.0000e+01 2.9253e-03
4.4750e+00 4.0000e+01 2.9284e-03
4.4750e+00 5.0000e+01 2.9385e-03
4.4750e+00 6.0000e+01 2.9733e-03
4.4750e+00 7.0000e+01 3.0517e-03

4.5000e+00 1.0000e+01 2.9304e-03
4.5000e+00 2.0000e+01 2.9603e-03
4.5000e+00 3.0000e+01 2.9640e-03
4.5000e+00 4.0000e+01 2.9671e-03
4.5000e+00 5.0000e+01 2.9771e-03
4.5000e+00 6.0000e+01 3.0114e-03
4.5000e+00 7.0000e+01 3.0886e-03

4.5250e+00 1.0000e+01 2.9632e-03
4.5250e+00 2.0000e+01 2.9988e-03
4.5250e+00 3.0000e+01 3.0026e-03
4.5250e+00 4.0000e+01 3.0058e-03
4.5250e+00 5.0000e+01 3.0158e-03
4.5250e+00 6.0000e+01 3.0495e-03
4.5250e+00 7.0000e+01 3.1255e-03

4.5500e+00 1.0000e+01 2.9947e-03
4.5500e+00 2.0000e+01 3.0373e-03
4.5500e+00 3.0000e+01 3.0414e-03
4.5500e+00 4.0000e+01 3.0446e-03
4.5500e+00 5.0000e+01 3.0545e-03
4.5500e+00 6.0000e+01 3.0877e-03
4.5500e+00 7.0000e+01 3.1625e-03

4.5750e+00 1.0000e+01 3.0248e-03
4.5750e+00 2.0000e+01 3.0758e-03
4.5750e+00 3.0000e+01 3.0802e-03
4.5750e+00 4.0000e+01 3.0835e-03
4.5750e+00 5.0000e+01 3.0933e-03
4.5750e+00 6.0000e+01 3.1259e-03
4.5750e+00 7.0000e+01 3.1994e-03

4.6000e+00 1.0000e+01 3.0531e-03
4.6000e+00 2.0000e+01 3.1144e-03
4.6000e+00 3.0000e+01 3.1190e-03
4.6000e+00 4.0000e+01 3.1224e-03
4.6000e+00 5.0000e+01 3.1321e-03
4.6000e+00 6.0000e+01 3.1642e-03
4.6000e+00 7.0000e+01 3.2364e-03

4.6250e+00 1.0000e+01 3.0795e-03
4.6250e+00 2.0000e+01 3.1530e-03
4.6250e+00 3.0000e+01 3.1579e-03
4.6250e+00 4.0000e+01 3.1614e-03
4.6250e+00 5.0000e+01 3.1710e-03
4.6250e+00 6.0000e+01 3.2025e-03
4.6250e+00 7.0000e+01 3.2734e-03

4.6500e+00 1.0000e+01 3.1041e-03
4.6500e+00 2.0000e+01 3.1915e-03
4.6500e+00 3.0000e+01 3.1969e-03
4.6500e+00 4.0000e+01 3.2004e-03
4.6500e+00 5.0000e+01 3.2099e-03
4.6500e+00 6.0000e+01 3.2409e-03
4.6500e+00 7.0000e+01 3.3104e-03

4.6750e+00 1.0000e+01 3.1267e-03
4.6750e+00 2.0000e+01 3.2300e-03
4.6750e+00 3.0000e+01 3.2359e-03
4.6750e+00 4.0000e+01 3.2395e-03
4.6750e+00 5.0000e+01 3.2489e-03
4.6750e+00 6.0000e+01 3.2793e-03
4.6750e+00 7.0000e+01 3.3474e-03

4.7000e+00 1.0000e+01 3.1475e-03
4.7000e+00 2.0000e+01 3.2685e-03
4.7000e+00 3.0000e+01 3.2749e-03
4.7000e+00 4.0000e+01 3.2787e-03
4.7000e+00 5.0000e+01 3.2880e-03
4.7000e+00 6.0000e+01 3.3177e-03
4.7000e+00 7.0000e+01 3.3845e-03

4.7250e+00 1.0000e+01 3.1666e-03
4.7250e+00 2.0000e+01 3.3068e-03
4.7250e+00 3.0000e+01 3.3139e-03
4.7250e+00 4.0000e+01 3.3179e-03
4.7250e+00 5.0000e+01 3.3270e-03
4.7250e+00 6.0000e+01 3.3561e-03
4.7250e+00 7.0000e+01 3.4215e-03

4.7500e+00 1.0000e+01 3.1842e-03
4.7500e+00 2.0000e+01 3.3451e-03
4.7500e+00 3.0000e+01 3.3530e-03
4.7500e+00 4.0000e+01 3.3571e-03
4.7500e+00 5.0000e+01 3.3662e-03
4.7500e+00 6.0000e+01 3.3946e-03
4.7500e+00 7.0000e+01 3.4586e-03

4.7750e+00 1.0000e+01 3.2003e-03
4.7750e+00 2.0000e+01 3.3831e-03
4.7750e+00 3.0000e+01 3.3920e-03
4.7750e+00 4.0000e+01 3.3964e-03
4.7750e+00 5.0000e+01 3.4053e-03
4.7750e+00 6.0000e+01 3.4331e-03
4.7750e+00 7.0000e+01 3.4957e-03

4.8000e+00 1.0000e+01 3.2152e-03
4.8000e+00 2.0000e+01 3.4209e-03
4.8000e+00 3.0000e+01 3.4311e-03
4.8000e+00 4.0000e+01 3.4357e-03
4.8000e+00 5.0000e+01 3.4445e-03
4.8000e+00 6.0000e+01 3.4716e-03
4.8000e+00 7.0000e+01 3.5328e-03

4.8250e+00 1.0000e+01 3.2291e-03
4.8250e+00 2.0000e+01 3.4584e-03
4.8250e+00 3.0000e+01 3.4701e-03
4.8250e+00 4.0000e+01 3.4750e-03
4.8250e+00 5.0000e+01 3.4838e-03
4.8250e+00 6.0000e+01 3.5102e-03
4.8250e+00 7.0000e+01 3.5699e-03

4.8500e+00 1.0000e+01 3.2420e-03
4.8500e+00 2.0000e+01 3.4955e-03
4.8500e+00 3.0000e+01 3.5091e-03
4.8500e+00 4.0000e+01 3.5143e-03
4.8500e+00 5.0000e+01 3.5230e-03
4.8500e+00 6.0000e+01 3.5488e-03
4.8500e+00 7.0000e+01 3.6070e-03

4.8750e+00 1.0000e+01 3.2540e-03
4.8750e+00 2.0000e+01 3.5321e-03
4.8750e+00 3.0000e+01 3.5480e-03
4.8750e+00 4.0000e+01 3.5536e-03
4.8750e+00 5.0000e+01 3.5623e-03
4.8750e+00 6.0000e+01 3.5874e-03
4.8750e+00 7.0000e+01 3.6442e-03

4.9000e+00 1.0000e+01 3.2653e-03
4.9000e+00 2.0000e+01 3.5681e-03
4.9000e+00 3.0000e+01 3.5868e-03
4.9000e+00 4.0000e+01 3.5929e-03
4.9000e+00 5.0000e+01 3.6016e-03
4.9000e+00 6.0000e+01 3.6260e-03
4.9000e+00 7.0000e+01 3.6813e-03

4.9250e+00 1.0000e+01 3.2760e-03
4.9250e+00 2.0000e+01 3.6033e-03
4.9250e+00 3.0000e+01 3.6254e-03
4.9250e+00 4.0000e+01 3.6322e-03
4.9250e+00 5.0000e+01 3.6409e-03
4.9250e+00 6.0000e+01 3.6647e-03
4.9250e+00 7.0000e+01 3.7185e-03

4.9500e+00 1.0000e+01 3.2860e-03
4.9500e+00 2.0000e+01 3.6375e-03
4.9500e+00 3.0000e+01 3.6639e-03
4.9500e+00 4.0000e+01 3.6715e-03
4.9500e+00 5.0000e+01 3.6802e-03
4.9500e+00 6.0000e+01 3.7034e-03
4.9500e+00 7.0000e+01 3.7558e-03

4.9750e+00 1.0000e+01 3.2956e-03
4.9750e+00 2.0000e+01 3.6706e-03
4.9750e+00 3.0000e+01 3.7022e-03
4.9750e+00 4.0000e+01 3.7107e-03
4.9750e+00 5.0000e+01 3.7195e-03
4.9750e+00 6.0000e+01 3.7420e-03
4.9750e+00 7.0000e+01 3.7930e-03

5.0000e+00 1.0000e+01 3.3046e-03
5.0000e+00 2.0000e+01 3.7024e-03
5.0000e+00 3.0000e+01 3.7401e-03
5.0000e+00 4.0000e+01 3.7498e-03
5.0000e+00 5.0000e+01 3.7588e-03
5.0000e+00 6.0000e+01 3.7807e-03
5.0000e+00 7.0000e+01 3.8303e-03

5.0250e+00 1.0000e+01 3.3133e-03
5.0250e+00 2.0000e+01 3.7326e-03
5.0250e+00 3.0000e+01 3.7776e-03
5.0250e+00 4.0000e+01 3.7887e-03
5.0250e+00 5.0000e+01 3.7981e-03
5.0250e+00 6.0000e+01 3.8194e-03
5.0250e+00 7.0000e+01 3.8676e-03

5.0500e+00 1.0000e+01 3.3216e-03
5.0500e+00 2.0000e+01 3.7611e-03
5.0500e+00 3.0000e+01 3.8146e-03
5.0500e+00 4.0000e+01 3.8275e-03
5.0500e+00 5.0000e+01 3.8373e-03
5.0500e+00 6.0000e+01 3.8581e-03
5.0500e+00 7.0000e+01 3.9049e-03

5.0750e+00 1.0000e+01 3.3295e-03
5.0750e+00 2.0000e+01 3.7879e-03
5.0750e+00 3.0000e+01 3.8509e-03
5.0750e+00 4.0000e+01 3.8661e-03
5.0750e+00 5.0000e+01 3.8764e-03
5.0750e+00 6.0000e+01 3.8968e-03
5.0750e+00 7.0000e+01 3.9423e-03

5.1000e+00 1.0000e+01 3.3371e-03
5.1000e+00 2.0000e+01 3.8128e-03
5.1000e+00 3.0000e+01 3.8865e-03
5.1000e+00 4.0000e+01 3.9044e-03
5.1000e+00 5.0000e+01 3.9154e-03
5.1000e+00 6.0000e+01 3.9354e-03
5.1000e+00 7.0000e+01 3.9797e-03

5.1250e+00 1.0000e+01 3.3444e-03
5.1250e+00 2.0000e+01 3.8358e-03
5.1250e+00 3.0000e+01 3.9211e-03
5.1250e+00 4.0000e+01 3.9424e-03
5.1250e+00 5.0000e+01 3.9542e-03
5.1250e+00 6.0000e+01 3.9740e-03
5.1250e+00 7.0000e+01 4.0171e-03

5.1500e+00 1.0000e+01 3.3515e-03
5.1500e+00 2.0000e+01 3.8570e-03
5.1500e+00 3.0000e+01 3.9546e-03
5.1500e+00 4.0000e+01 3.9798e-03
5.1500e+00 5.0000e+01 3.9929e-03
5.1500e+00 6.0000e+01 4.0126e-03
5.1500e+00 7.0000e+01 4.0545e-03

5.1750e+00 1.0000e+01 3.3583e-03
5.1750e+00 2.0000e+01 3.8772e-03
5.1750e+00 3.0000e+01 3.9867e-03
5.1750e+00 4.0000e+01 4.0167e-03
5.1750e+00 5.0000e+01 4.0313e-03
5.1750e+00 6.0000e+01 4.0510e-03
5.1750e+00 7.0000e+01 4.0919e-03

5.2000e+00 1.0000e+01 3.3649e-03
5.2000e+00 2.0000e+01 3.8953e-03
5.2000e+00 3.0000e+01 4.0173e-03
5.2000e+00 4.0000e+01 4.0529e-03
5.2000e+00 5.0000e+01 4.0694e-03
5.2000e+00 6.0000e+01 4.0893e-03
5.2000e+00 7.0000e+01 4.1293e-03

5.2250e+00 1.0000e+01 3.3713e-03
5.2250e+00 2.0000e+01 3.9120e-03
5.2250e+00 3.0000e+01 4.0462e-03
5.2250e+00 4.0000e+01 4.0882e-03
5.2250e+00 5.0000e+01 4.1071e-03
5.2250e+00 6.0000e+01 4.1274e-03
5.2250e+00 7.0000e+01 4.1666e-03

5.2500e+00 1.0000e+01 3.3775e-03
5.2500e+00 2.0000e+01 3.9279e-03
5.2500e+00 3.0000e+01 4.0733e-03
5.2500e+00 4.0000e+01 4.1224e-03
5.2500e+00 5.0000e+01 4.1442e-03
5.2500e+00 6.0000e+01 4.1654e-03
5.2500e+00 7.0000e+01 4.2039e-03

5.2750e+00 1.0000e+01 3.3835e-03
5.2750e+00 2.0000e+01 3.9427e-03
5.2750e+00 3.0000e+01 4.0987e-03
5.2750e+00 4.0000e+01 4.1553e-03
5.2750e+00 5.0000e+01 4.1807e-03
5.2750e+00 6.0000e+01 4.2030e-03
5.2750e+00 7.0000e+01 4.2411e-03

5.3000e+00 1.0000e+01 3.3893e-03
5.3000e+00 2.0000e+01 3.9564e-03
5.3000e+00 3.0000e+01 4.1222e-03
5.3000e+00 4.0000e+01 4.1868e-03
5.3000e+00 5.0000e+01 4.2165e-03
5.3000e+00 6.0000e+01 4.2402e-03
5.3000e+00 7.0000e+01 4.2782e-03

5.3250e+00 1.0000e+01 3.3950e-03
5.3250e+00 2.0000e+01 3.9693e-03
5.3250e+00 3.0000e+01 4.1440e-03
5.3250e+00 4.0000e+01 4.2167e-03
5.3250e+00 5.0000e+01 4.2512e-03
5.3250e+00 6.0000e+01 4.2770e-03
5.3250e+00 7.0000e+01 4.3151e-03

5.3500e+00 1.0000e+01 3.4006e-03
5.3500e+00 2.0000e+01 3.9815e-03
5.3500e+00 3.0000e+01 4.1642e-03
5.3500e+00 4.0000e+01 4.2449e-03
5.3500e+00 5.0000e+01 4.2848e-03
5.3500e+00 6.0000e+01 4.3132e-03
5.3500e+00 7.0000e+01 4.3517e-03

5.3750e+00 1.0000e+01 3.4060e-03
5.3750e+00 2.0000e+01 3.9930e-03
5.3750e+00 3.0000e+01 4.1829e-03
5.3750e+00 4.0000e+01 4.2714e-03
5.3750e+00 5.0000e+01 4.3171e-03
5.3750e+00 6.0000e+01 4.3486e-03
5.3750e+00 7.0000e+01 4.3881e-03

5.4000e+00 1.0000e+01 3.4113e-03
5.4000e+00 2.0000e+01 4.0039e-03
5.4000e+00 3.0000e+01 4.2003e-03
5.4000e+00 4.0000e+01 4.2960e-03
5.4000e+00 5.0000e+01 4.3479e-03
5.4000e+00 6.0000e+01 4.3831e-03
5.4000e+00 7.0000e+01 4.4240e-03

5.4250e+00 1.0000e+01 3.4164e-03
5.4250e+00 2.0000e+01 4.0143e-03
5.4250e+00 3.0000e+01 4.2165e-03
5.4250e+00 4.0000e+01 4.3188e-03
5.4250e+00 5.0000e+01 4.3771e-03
5.4250e+00 6.0000e+01 4.4165e-03
5.4250e+00 7.0000e+01 4.4594e-03

5.4500e+00 1.0000e+01 3.4215e-03
5.4500e+00 2.0000e+01 4.0242e-03
5.4500e+00 3.0000e+01 4.2316e-03
5.4500e+00 4.0000e+01 4.3400e-03
5.4500e+00 5.0000e+01 4.4045e-03
5.4500e+00 6.0000e+01 4.4487e-03
5.4500e+00 7.0000e+01 4.4941e-03

5.4750e+00 1.0000e+01 3.4264e-03
5.4750e+00 2.0000e+01 4.0337e-03
5.4750e+00 3.0000e+01 4.2458e-03
5.4750e+00 4.0000e+01 4.3597e-03
5.4750e+00 5.0000e+01 4.4302e-03
5.4750e+00 6.0000e+01 4.4794e-03
5.4750e+00 7.0000e+01 4.5279e-03

5.5000e+00 1.0000e+01 3.4313e-03
5.5000e+00 2.0000e+01 4.0428e-03
5.5000e+00 3.0000e+01 4.2590e-03
5.5000e+00 4.0000e+01 4.3780e-03
5.5000e+00 5.0000e+01 4.4542e-03
5.5000e+00 6.0000e+01 4.5086e-03
5.5000e+00 7.0000e+01 4.5608e-03

5.5250e+00 1.0000e+01 3.4360e-03
5.5250e+00 2.0000e+01 4.0515e-03
5.5250e+00 3.0000e+01 4.2716e-03
5.5250e+00 4.0000e+01 4.3950e-03
5.5250e+00 5.0000e+01 4.4764e-03
5.5250e+00 6.0000e+01 4.5362e-03
5.5250e+00 7.0000e+01 4.5925e-03

5.5500e+00 1.0000e+01 3.4406e-03
5.5500e+00 2.0000e+01 4.0599e-03
5.5500e+00 3.0000e+01 4.2834e-03
5.5500e+00 4.0000e+01 4.4108e-03
5.5500e+00 5.0000e+01 4.4971e-03
5.5500e+00 6.0000e+01 4.5620e-03
5.5500e+00 7.0000e+01 4.6229e-03

5.5750e+00 1.0000e+01 3.4452e-03
5.5750e+00 2.0000e+01 4.0680e-03
5.5750e+00 3.0000e+01 4.2947e-03
5.5750e+00 4.0000e+01 4.4257e-03
5.5750e+00 5.0000e+01 4.5164e-03
5.5750e+00 6.0000e+01 4.5862e-03
5.5750e+00 7.0000e+01 4.6519e-03

5.6000e+00 1.0000e+01 3.4497e-03
5.6000e+00 2.0000e+01 4.0759e-03
5.6000e+00 3.0000e+01 4.3054e-03
5.6000e+00 4.0000e+01 4.4397e-03
5.6000e+00 5.0000e+01 4.5343e-03
5.6000e+00 6.0000e+01 4.6088e-03
5.6000e+00 7.0000e+01 4.6793e-03

5.6250e+00 1.0000e+01 3.4540e-03
5.6250e+00 2.0000e+01 4.0834e-03
5.6250e+00 3.0000e+01 4.3156e-03
5.6250e+00 4.0000e+01 4.4528e-03
5.6250e+00 5.0000e+01 4.5510e-03
5.6250e+00 6.0000e+01 4.6298e-03
5.6250e+00 7.0000e+01 4.7051e-03

5.6500e+00 1.0000e+01 3.4584e-03
5.6500e+00 2.0000e+01 4.0908e-03
5.6500e+00 3.0000e+01 4.3254e-03
5.6500e+00 4.0000e+01 4.4654e-03
5.6500e+00 5.0000e+01 4.5667e-03
5.6500e+00 6.0000e+01 4.6494e-03
5.6500e+00 7.0000e+01 4.7293e-03

5.6750e+00 1.0000e+01 3.4627e-03
5.6750e+00 2.0000e+01 4.0979e-03
5.6750e+00 3.0000e+01 4.3348e-03
5.6750e+00 4.0000e+01 4.4772e-03
5.6750e+00 5.0000e+01 4.5814e-03
5.6750e+00 6.0000e+01 4.6676e-03
5.6750e+00 7.0000e+01 4.7519e-03

5.7000e+00 1.0000e+01 3.4669e-03
5.7000e+00 2.0000e+01 4.1049e-03
5.7000e+00 3.0000e+01 4.3438e-03
5.7000e+00 4.0000e+01 4.4884e-03
5.7000e+00 5.0000e+01 4.5953e-03
5.7000e+00 6.0000e+01 4.6847e-03
5.7000e+00 7.0000e+01 4.7731e-03

5.7250e+00 1.0000e+01 3.4710e-03
5.7250e+00 2.0000e+01 4.1116e-03
5.7250e+00 3.0000e+01 4.3525e-03
5.7250e+00 4.0000e+01 4.4991e-03
5.7250e+00 5.0000e+01 4.6084e-03
5.7250e+00 6.0000e+01 4.7008e-03
5.7250e+00 7.0000e+01 4.7928e-03

5.7500e+00 1.0000e+01 3.4750e-03
5.7500e+00 2.0000e+01 4.1182e-03
5.7500e+00 3.0000e+01 4.3609e-03
5.7500e+00 4.0000e+01 4.5094e-03
5.7500e+00 5.0000e+01 4.6200e-03
5.7500e+00 6.0000e+01 4.7159e-03
5.7500e+00 7.0000e+01 4.8114e-03

5.7750e+00 1.0000e+01 3.4790e-03
5.7750e+00 2.0000e+01 4.1246e-03
5.7750e+00 3.0000e+01 4.3691e-03
5.7750e+00 4.0000e+01 4.5192e-03
5.7750e+00 5.0000e+01 4.6328e-03
5.7750e+00 6.0000e+01 4.7301e-03
5.7750e+00 7.0000e+01 4.8287e-03

5.8000e+00 1.0000e+01 3.4829e-03
5.8000e+00 2.0000e+01 4.1309e-03
5.8000e+00 3.0000e+01 4.3769e-03
5.8000e+00 4.0000e+01 4.5287e-03
5.8000e+00 5.0000e+01 4.6441e-03
5.8000e+00 6.0000e+01 4.7436e-03
5.8000e+00 7.0000e+01 4.8450e-03

5.8250e+00 1.0000e+01 3.4867e-03
5.8250e+00 2.0000e+01 4.1370e-03
5.8250e+00 3.0000e+01 4.3845e-03
5.8250e+00 4.0000e+01 4.5378e-03
5.8250e+00 5.0000e+01 4.6549e-03
5.8250e+00 6.0000e+01 4.7564e-03
5.8250e+00 7.0000e+01 4.8604e-03

5.8500e+00 1.0000e+01 3.4905e-03
5.8500e+00 2.0000e+01 4.1430e-03
5.8500e+00 3.0000e+01 4.3920e-03
5.8500e+00 4.0000e+01 4.5466e-03
5.8500e+00 5.0000e+01 4.6652e-03
5.8500e+00 6.0000e+01 4.7686e-03
5.8500e+00 7.0000e+01 4.8749e-03

5.8750e+00 1.0000e+01 3.4943e-03
5.8750e+00 2.0000e+01 4.1488e-03
5.8750e+00 3.0000e+01 4.3992e-03
5.8750e+00 4.0000e+01 4.5551e-03
5.8750e+00 5.0000e+01 4.6752e-03
5.8750e+00 6.0000e+01 4.7803e-03
5.8750e+00 7.0000e+01 4.8887e-03

5.9000e+00 1.0000e+01 3.4980e-03
5.9000e+00 2.0000e+01 4.1546e-03
5.9000e+00 3.0000e+01 4.4062e-03
5.9000e+00 4.0000e+01 4.5633e-03
5.9000e+00 5.0000e+01 4.6848e-03
5.9000e+00 6.0000e+01 4.7914e-03
5.9000e+00 7.0000e+01 4.9018e-03

5.9250e+00 1.0000e+01 3.5016e-03
5.9250e+00 2.0000e+01 4.1602e-03
5.9250e+00 3.0000e+01 4.4130e-03
5.9250e+00 4.0000e+01 4.5713e-03
5.9250e+00 5.0000e+01 4.6940e-03
5.9250e+00 6.0000e+01 4.8020e-03
5.9250e+00 7.0000e+01 4.9143e-03

5.9500e+00 1.0000e+01 3.5052e-03
5.9500e+00 2.0000e+01 4.1657e-03
5.9500e+00 3.0000e+01 4.4197e-03
5.9500e+00 4.0000e+01 4.5790e-03
5.9500e+00 5.0000e+01 4.7029e-03
5.9500e+00 6.0000e+01 4.8123e-03
5.9500e+00 7.0000e+01 4.9263e-03

5.9750e+00 1.0000e+01 3.5088e-03
5.9750e+00 2.0000e+01 4.1711e-03
5.9750e+00 3.0000e+01 4.4262e-03
5.9750e+00 4.0000e+01 4.5866e-03
5.9750e+00 5.0000e+01 4.7116e-03
5.9750e+00 6.0000e+01 4.8221e-03
5.9750e+00 7.0000e+01 4.9377e-03

6.0000e+00 1.0000e+01 3.5123e-03
6.0000e+00 2.0000e+01 4.1764e-03
6.0000e+00 3.0000e+01 4.4326e-03
6.0000e+00 4.0000e+01 4.5939e-03
6.0000e+00 5.0000e+01 4.7199e-03
6.0000e+00 6.0000e+01 4.8317e-03
6.0000e+00 7.0000e+01 4.9487e-03

6.0250e+00 1.0000e+01 3.5158e-03
6.0250e+00 2.0000e+01 4.1816e-03
6.0250e+00 3.0000e+01 4.4388e-03
6.0250e+00 4.0000e+01 4.6011e-03
6.0250e+00 5.0000e+01 4.7281e-03
6.0250e+00 6.0000e+01 4.8410e-03
6.0250e+00 7.0000e+01 4.9593e-03

6.0500e+00 1.0000e+01 3.5192e-03
6.0500e+00 2.0000e+01 4.1867e-03
6.0500e+00 3.0000e+01 4.4450e-03
6.0500e+00 4.0000e+01 4.6081e-03
6.0500e+00 5.0000e+01 4.7360e-03
6.0500e+00 6.0000e+01 4.8501e-03
6.0500e+00 7.0000e+01 4.9695e-03

6.0750e+00 1.0000e+01 3.5226e-03
6.0750e+00 2.0000e+01 4.1918e-03
6.0750e+00 3.0000e+01 4.4510e-03
6.0750e+00 4.0000e+01 4.6149e-03
6.0750e+00 5.0000e+01 4.7437e-03
6.0750e+00 6.0000e+01 4.8587e-03
6.0750e+00 7.0000e+01 4.9794e-03

6.1000e+00 1.0000e+01 3.5259e-03
6.1000e+00 2.0000e+01 4.1967e-03
6.1000e+00 3.0000e+01 4.4569e-03
6.1000e+00 4.0000e+01 4.6216e-03
6.1000e+00 5.0000e+01 4.7512e-03
6.1000e+00 6.0000e+01 4.8672e-03
6.1000e+00 7.0000e+01 4.9892e-03

6.1250e+00 1.0000e+01 3.5292e-03
6.1250e+00 2.0000e+01 4.2016e-03
6.1250e+00 3.0000e+01 4.4626e-03
6.1250e+00 4.0000e+01 4.6281e-03
6.1250e+00 5.0000e+01 4.7586e-03
6.1250e+00 6.0000e+01 4.8756e-03
6.1250e+00 7.0000e+01 4.9982e-03

6.1500e+00 1.0000e+01 3.5325e-03
6.1500e+00 2.0000e+01 4.2064e-03
6.1500e+00 3.0000e+01 4.4682e-03
6.1500e+00 4.0000e+01 4.6345e-03
6.1500e+00 5.0000e+01 4.7657e-03
6.1500e+00 6.0000e+01 4.8837e-03
6.1500e+00 7.0000e+01 5.0071e-03

6.1750e+00 1.0000e+01 3.5357e-03
6.1750e+00 2.0000e+01 4.2112e-03
6.1750e+00 3.0000e+01 4.4738e-03
6.1750e+00 4.0000e+01 4.6407e-03
6.1750e+00 5.0000e+01 4.7727e-03
6.1750e+00 6.0000e+01 4.8913e-03
6.1750e+00 7.0000e+01 5.0159e-03

6.2000e+00 1.0000e+01 3.5389e-03
6.2000e+00 2.0000e+01 4.2158e-03
6.2000e+00 3.0000e+01 4.4792e-03
6.2000e+00 4.0000e+01 4.6470e-03
6.2000e+00 5.0000e+01 4.7796e-03
6.2000e+00 6.0000e+01 4.8987e-03
6.2000e+00 7.0000e+01 5.0246e-03

6.2250e+00 1.0000e+01 3.5421e-03
6.2250e+00 2.0000e+01 4.2204e-03
6.2250e+00 3.0000e+01 4.4848e-03
6.2250e+00 4.0000e+01 4.6530e-03
6.2250e+00 5.0000e+01 4.7863e-03
6.2250e+00 6.0000e+01 4.9064e-03
6.2250e+00 7.0000e+01 5.0328e-03

6.2500e+00 1.0000e+01 3.5452e-03
6.2500e+00 2.0000e+01 4.2249e-03
6.2500e+00 3.0000e+01 4.4899e-03
6.2500e+00 4.0000e+01 4.6588e-03
6.2500e+00 5.0000e+01 4.7929e-03
6.2500e+00 6.0000e+01 4.9137e-03
6.2500e+00 7.0000e+01 5.0409e-03

6.2750e+00 1.0000e+01 3.5483e-03
6.2750e+00 2.0000e+01 4.2294e-03
6.2750e+00 3.0000e+01 4.4951e-03
6.2750e+00 4.0000e+01 4.6647e-03
6.2750e+00 5.0000e+01 4.7994e-03
6.2750e+00 6.0000e+01 4.9207e-03
6.2750e+00 7.0000e+01 5.0489e-03

6.3000e+00 1.0000e+01 3.5514e-03
6.3000e+00 2.0000e+01 4.2338e-03
6.3000e+00 3.0000e+01 4.5002e-03
6.3000e+00 4.0000e+01 4.6705e-03
6.3000e+00 5.0000e+01 4.8058e-03
6.3000e+00 6.0000e+01 4.9276e-03
6.3000e+00 7.0000e+01 5.0568e-03

6.3250e+00 1.0000e+01 3.5544e-03
6.3250e+00 2.0000e+01 4.2382e-03
6.3250e+00 3.0000e+01 4.5053e-03
6.3250e+00 4.0000e+01 4.6762e-03
6.3250e+00 5.0000e+01 4.8122e-03
6.3250e+00 6.0000e+01 4.9344e-03
6.3250e+00 7.0000e+01 5.0643e-03

6.3500e+00 1.0000e+01 3.5574e-03
6.3500e+00 2.0000e+01 4.2425e-03
6.3500e+00 3.0000e+01 4.5104e-03
6.3500e+00 4.0000e+01 4.6818e-03
6.3500e+00 5.0000e+01 4.8181e-03
6.3500e+00 6.0000e+01 4.9411e-03
6.3500e+00 7.0000e+01 5.0716e-03

6.3750e+00 1.0000e+01 3.5604e-03
6.3750e+00 2.0000e+01 4.2467e-03
6.3750e+00 3.0000e+01 4.5152e-03
6.3750e+00 4.0000e+01 4.6872e-03
6.3750e+00 5.0000e+01 4.8241e-03
6.3750e+00 6.0000e+01 4.9476e-03
6.3750e+00 7.0000e+01 5.0786e-03

6.4000e+00 1.0000e+01 3.5634e-03
6.4000e+00 2.0000e+01 4.2509e-03
6.4000e+00 3.0000e+01 4.5200e-03
6.4000e+00 4.0000e+01 4.6925e-03
6.4000e+00 5.0000e+01 4.8301e-03
6.4000e+00 6.0000e+01 4.9541e-03
6.4000e+00 7.0000e+01 5.0858e-03

6.4250e+00 1.0000e+01 3.5663e-03
6.4250e+00 2.0000e+01 4.2551e-03
6.4250e+00 3.0000e+01 4.5249e-03
6.4250e+00 4.0000e+01 4.6979e-03
6.4250e+00 5.0000e+01 4.8359e-03
6.4250e+00 6.0000e+01 4.9601e-03
6.4250e+00 7.0000e+01 5.0929e-03

6.4500e+00 1.0000e+01 3.5692e-03
6.4500e+00 2.0000e+01 4.2592e-03
6.4500e+00 3.0000e+01 4.5297e-03
6.4500e+00 4.0000e+01 4.7031e-03
6.4500e+00 5.0000e+01 4.8416e-03
6.4500e+00 6.0000e+01 4.9668e-03
6.4500e+00 7.0000e+01 5.0999e-03

6.4750e+00 1.0000e+01 3.5720e-03
6.4750e+00 2.0000e+01 4.2632e-03
6.4750e+00 3.0000e+01 4.5342e-03
6.4750e+00 4.0000e+01 4.7082e-03
6.4750e+00 5.0000e+01 4.8473e-03
6.4750e+00 6.0000e+01 4.9729e-03
6.4750e+00 7.0000e+01 5.1068e-03

6.5000e+00 1.0000e+01 3.5749e-03
6.5000e+00 2.0000e+01 4.2672e-03
6.5000e+00 3.0000e+01 4.5388e-03
6.5000e+00 4.0000e+01 4.7134e-03
6.5000e+00 5.0000e+01 4.8529e-03
6.5000e+00 6.0000e+01 4.9790e-03
6.5000e+00 7.0000e+01 5.1135e-03

6.5250e+00 1.0000e+01 3.5777e-03
6.5250e+00 2.0000e+01 4.2712e-03
6.5250e+00 3.0000e+01 4.5435e-03
6.5250e+00 4.0000e+01 4.7184e-03
6.5250e+00 5.0000e+01 4.8584e-03
6.5250e+00 6.0000e+01 4.9850e-03
6.5250e+00 7.0000e+01 5.1200e-03

6.5500e+00 1.0000e+01 3.5805e-03
6.5500e+00 2.0000e+01 4.2751e-03
6.5500e+00 3.0000e+01 4.5479e-03
6.5500e+00 4.0000e+01 4.7235e-03
6.5500e+00 5.0000e+01 4.8640e-03
6.5500e+00 6.0000e+01 4.9909e-03
6.5500e+00 7.0000e+01 5.1265e-03

6.5750e+00 1.0000e+01 3.5832e-03
6.5750e+00 2.0000e+01 4.2790e-03
6.5750e+00 3.0000e+01 4.5524e-03
6.5750e+00 4.0000e+01 4.7284e-03
6.5750e+00 5.0000e+01 4.8693e-03
6.5750e+00 6.0000e+01 4.9967e-03
6.5750e+00 7.0000e+01 5.1329e-03

6.6000e+00 1.0000e+01 3.5860e-03
6.6000e+00 2.0000e+01 4.2829e-03
6.6000e+00 3.0000e+01 4.5567e-03
6.6000e+00 4.0000e+01 4.7330e-03
6.6000e+00 5.0000e+01 4.8745e-03
6.6000e+00 6.0000e+01 5.0024e-03
6.6000e+00 7.0000e+01 5.1392e-03

6.6250e+00 1.0000e+01 3.5887e-03
6.6250e+00 2.0000e+01 4.2867e-03
6.6250e+00 3.0000e+01 4.5611e-03
6.6250e+00 4.0000e+01 4.7379e-03
6.6250e+00 5.0000e+01 4.8797e-03
6.6250e+00 6.0000e+01 5.0080e-03
6.6250e+00 7.0000e+01 5.1454e-03

6.6500e+00 1.0000e+01 3.5914e-03
6.6500e+00 2.0000e+01 4.2904e-03
6.6500e+00 3.0000e+01 4.5654e-03
6.6500e+00 4.0000e+01 4.7427e-03
6.6500e+00 5.0000e+01 4.8849e-03
6.6500e+00 6.0000e+01 5.0137e-03
6.6500e+00 7.0000e+01 5.1516e-03

6.6750e+00 1.0000e+01 3.5941e-03
6.6750e+00 2.0000e+01 4.2941e-03
6.6750e+00 3.0000e+01 4.5696e-03
6.6750e+00 4.0000e+01 4.7474e-03
6.6750e+00 5.0000e+01 4.8902e-03
6.6750e+00 6.0000e+01 5.0194e-03
6.6750e+00 7.0000e+01 5.1577e-03

6.7000e+00 1.0000e+01 3.5967e-03
6.7000e+00 2.0000e+01 4.2978e-03
6.7000e+00 3.0000e+01 4.5739e-03
6.7000e+00 4.0000e+01 4.7520e-03
6.7000e+00 5.0000e+01 4.8952e-03
6.7000e+00 6.0000e+01 5.0247e-03
6.7000e+00 7.0000e+01 5.1636e-03

6.7250e+00 1.0000e+01 3.5993e-03
6.7250e+00 2.0000e+01 4.3015e-03
6.7250e+00 3.0000e+01 4.5780e-03
6.7250e+00 4.0000e+01 4.7566e-03
6.7250e+00 5.0000e+01 4.9001e-03
6.7250e+00 6.0000e+01 5.0300e-03
6.7250e+00 7.0000e+01 5.1696e-03

6.7500e+00 1.0000e+01 3.6019e-03
6.7500e+00 2.0000e+01 4.3051e-03
6.7500e+00 3.0000e+01 4.5821e-03
6.7500e+00 4.0000e+01 4.7612e-03
6.7500e+00 5.0000e+01 4.9051e-03
6.7500e+00 6.0000e+01 5.0354e-03
6.7500e+00 7.0000e+01 5.1754e-03

6.7750e+00 1.0000e+01 3.6045e-03
6.7750e+00 2.0000e+01 4.3087e-03
6.7750e+00 3.0000e+01 4.5862e-03
6.7750e+00 4.0000e+01 4.7657e-03
6.7750e+00 5.0000e+01 4.9100e-03
6.7750e+00 6.0000e+01 5.0407e-03
6.7750e+00 7.0000e+01 5.1812e-03

6.8000e+00 1.0000e+01 3.6071e-03
6.8000e+00 2.0000e+01 4.3122e-03
6.8000e+00 3.0000e+01 4.5903e-03
6.8000e+00 4.0000e+01 4.7701e-03
6.8000e+00 5.0000e+01 4.9149e-03
6.8000e+00 6.0000e+01 5.0459e-03
6.8000e+00 7.0000e+01 5.1870e-03

6.8250e+00 1.0000e+01 3.6096e-03
6.8250e+00 2.0000e+01 4.3158e-03
6.8250e+00 3.0000e+01 4.5943e-03
6.8250e+00 4.0000e+01 4.7746e-03
6.8250e+00 5.0000e+01 4.9197e-03
6.8250e+00 6.0000e+01 5.0511e-03
6.8250e+00 7.0000e+01 5.1926e-03

6.8500e+00 1.0000e+01 3.6122e-03
6.8500e+00 2.0000e+01 4.3192e-03
6.8500e+00 3.0000e+01 4.5983e-03
6.8500e+00 4.0000e+01 4.7790e-03
6.8500e+00 5.0000e+01 4.9245e-03
6.8500e+00 6.0000e+01 5.0562e-03
6.8500e+00 7.0000e+01 5.1983e-03

6.8750e+00 1.0000e+01 3.6147e-03
6.8750e+00 2.0000e+01 4.3227e-03
6.8750e+00 3.0000e+01 4.6022e-03
6.8750e+00 4.0000e+01 4.7836e-03
6.8750e+00 5.0000e+01 4.9291e-03
6.8750e+00 6.0000e+01 5.0612e-03
6.8750e+00 7.0000e+01 5.2037e-03

6.9000e+00 1.0000e+01 3.6172e-03
6.9000e+00 2.0000e+01 4.3261e-03
6.9000e+00 3.0000e+01 4.6061e-03
6.9000e+00 4.0000e+01 4.7876e-03
6.9000e+00 5.0000e+01 4.9337e-03
6.9000e+00 6.0000e+01 5.0663e-03
6.9000e+00 7.0000e+01 5.2094e-03

6.9250e+00 1.0000e+01 3.6196e-03
6.9250e+00 2.0000e+01 4.3295e-03
6.9250e+00 3.0000e+01 4.6100e-03
6.9250e+00 4.0000e+01 4.7920e-03
6.9250e+00 5.0000e+01 4.9384e-03
6.9250e+00 6.0000e+01 5.0712e-03
6.9250e+00 7.0000e+01 5.2148e-03

6.9500e+00 1.0000e+01 3.6221e-03
6.9500e+00 2.0000e+01 4.3329e-03
6.9500e+00 3.0000e+01 4.6139e-03
6.9500e+00 4.0000e+01 4.7960e-03
6.9500e+00 5.0000e+01 4.9429e-03
6.9500e+00 6.0000e+01 5.0762e-03
6.9500e+00 7.0000e+01 5.2203e-03

6.9750e+00 1.0000e+01 3.6245e-03
6.9750e+00 2.0000e+01 4.3363e-03
6.9750e+00 3.0000e+01 4.6177e-03
6.9750e+00 4.0000e+01 4.8002e-03
6.9750e+00 5.0000e+01 4.9475e-03
6.9750e+00 6.0000e+01 5.0810e-03
6.9750e+00 7.0000e+01 5.2256e-03

7.0000e+00 1.0000e+01 3.6269e-03
7.0000e+00 2.0000e+01 4.3396e-03
7.0000e+00 3.0000e+01 4.6214e-03
7.0000e+00 4.0000e+01 4.8044e-03
7.0000e+00 5.0000e+01 4.9520e-03
7.0000e+00 6.0000e+01 5.0859e-03
7.0000e+00 7.0000e+01 5.2310e-03
