   1.0000000e+02  -1.4651778e+03
   1.1000000e+02  -6.3208564e+02
   1.2000000e+02   1.2945598e+02
   1.3000000e+02   8.3017922e+02
   1.4000000e+02   1.4784806e+03
   1.5000000e+02   2.0810657e+03
   1.6000000e+02   2.6433838e+03
   1.7000000e+02   3.1699306e+03
   1.8000000e+02   3.6644639e+03
   1.9000000e+02   4.1301606e+03
   2.0000000e+02   4.5697339e+03
   2.1000000e+02   4.9855219e+03
   2.2000000e+02   5.3795555e+03
   2.3000000e+02   5.7536117e+03
   2.4000000e+02   6.1092552e+03
   2.5000000e+02   6.4478721e+03
   2.6000000e+02   6.7706966e+03
   2.7000000e+02   7.0788334e+03
   2.8000000e+02   7.3732755e+03
   2.9000000e+02   7.6549189e+03
   3.0000000e+02   7.9245757e+03
   3.1000000e+02   8.1829841e+03
   3.2000000e+02   8.4308174e+03
   3.3000000e+02   8.6686917e+03
   3.4000000e+02   8.8971723e+03
   3.5000000e+02   9.1167789e+03
   3.6000000e+02   9.3279910e+03
   3.7000000e+02   9.5312517e+03
   3.8000000e+02   9.7269712e+03
   3.9000000e+02   9.9155305e+03
   4.0000000e+02   1.0097284e+04
   4.1000000e+02   1.0272561e+04
   4.2000000e+02   1.0441669e+04
   4.3000000e+02   1.0604897e+04
   4.4000000e+02   1.0762513e+04
   4.5000000e+02   1.0914770e+04
   4.6000000e+02   1.1061905e+04
   4.7000000e+02   1.1204141e+04
   4.8000000e+02   1.1341686e+04
   4.9000000e+02   1.1474739e+04
   5.0000000e+02   1.1603486e+04
   5.1000000e+02   1.1728102e+04
   5.2000000e+02   1.1848753e+04
   5.3000000e+02   1.1965598e+04
   5.4000000e+02   1.2078784e+04
   5.5000000e+02   1.2188453e+04
   5.6000000e+02   1.2294740e+04
   5.7000000e+02   1.2397770e+04
   5.8000000e+02   1.2497665e+04
   5.9000000e+02   1.2594540e+04
   6.0000000e+02   1.2688504e+04
   6.1000000e+02   1.2779662e+04
   6.2000000e+02   1.2868112e+04
   6.3000000e+02   1.2953950e+04
   6.4000000e+02   1.3037265e+04
   6.5000000e+02   1.3118145e+04
   6.6000000e+02   1.3196671e+04
   6.7000000e+02   1.3272923e+04
   6.8000000e+02   1.3346975e+04
   6.9000000e+02   1.3418901e+04
   7.0000000e+02   1.3488768e+04
   7.1000000e+02   1.3556644e+04
   7.2000000e+02   1.3622592e+04
   7.3000000e+02   1.3686673e+04
   7.4000000e+02   1.3748945e+04
   7.5000000e+02   1.3809465e+04
   7.6000000e+02   1.3868286e+04
   7.7000000e+02   1.3925460e+04
   7.8000000e+02   1.3981036e+04
   7.9000000e+02   1.4035064e+04
   8.0000000e+02   1.4087588e+04
   8.1000000e+02   1.4138654e+04
   8.2000000e+02   1.4188303e+04
   8.3000000e+02   1.4236577e+04
   8.4000000e+02   1.4283516e+04
   8.5000000e+02   1.4329157e+04
   8.6000000e+02   1.4373538e+04
   8.7000000e+02   1.4416694e+04
   8.8000000e+02   1.4458659e+04
   8.9000000e+02   1.4499466e+04
   9.0000000e+02   1.4539147e+04
   9.1000000e+02   1.4577734e+04
   9.2000000e+02   1.4615255e+04
   9.3000000e+02   1.4651739e+04
   9.4000000e+02   1.4687215e+04
   9.5000000e+02   1.4721710e+04
   9.6000000e+02   1.4755248e+04
   9.7000000e+02   1.4787856e+04
   9.8000000e+02   1.4819557e+04
   9.9000000e+02   1.4850376e+04
   1.0000000e+03   1.4880334e+04
   1.0100000e+03   1.4909455e+04
   1.0200000e+03   1.4937759e+04
   1.0300000e+03   1.4965267e+04
   1.0400000e+03   1.4992000e+04
   1.0500000e+03   1.5017977e+04
   1.0600000e+03   1.5043216e+04
   1.0700000e+03   1.5067736e+04
   1.0800000e+03   1.5091554e+04
   1.0900000e+03   1.5114689e+04
   1.1000000e+03   1.5137156e+04
   1.1100000e+03   1.5158972e+04
   1.1200000e+03   1.5180152e+04
   1.1300000e+03   1.5200713e+04
   1.1400000e+03   1.5220667e+04
   1.1500000e+03   1.5240031e+04
   1.1600000e+03   1.5258818e+04
   1.1700000e+03   1.5277042e+04
   1.1800000e+03   1.5294716e+04
   1.1900000e+03   1.5311852e+04
   1.2000000e+03   1.5328463e+04
   1.2100000e+03   1.5344562e+04
   1.2200000e+03   1.5360160e+04
   1.2300000e+03   1.5375269e+04
   1.2400000e+03   1.5389900e+04
   1.2500000e+03   1.5404063e+04
   1.2600000e+03   1.5417770e+04
   1.2700000e+03   1.5431030e+04
   1.2800000e+03   1.5443854e+04
   1.2900000e+03   1.5456252e+04
   1.3000000e+03   1.5468232e+04
   1.3100000e+03   1.5479805e+04
   1.3200000e+03   1.5490978e+04
   1.3300000e+03   1.5501762e+04
   1.3400000e+03   1.5512164e+04
   1.3500000e+03   1.5522193e+04
   1.3600000e+03   1.5531857e+04
   1.3700000e+03   1.5541165e+04
   1.3800000e+03   1.5550122e+04
   1.3900000e+03   1.5558738e+04
   1.4000000e+03   1.5567020e+04
   1.4100000e+03   1.5574974e+04
   1.4200000e+03   1.5582608e+04
   1.4300000e+03   1.5589928e+04
   1.4400000e+03   1.5596941e+04
   1.4500000e+03   1.5603654e+04
   1.4600000e+03   1.5610073e+04
   1.4700000e+03   1.5616205e+04
   1.4800000e+03   1.5622054e+04
   1.4900000e+03   1.5627627e+04
   1.5000000e+03   1.5632930e+04
   1.5100000e+03   1.5637969e+04
   1.5200000e+03   1.5642748e+04
   1.5300000e+03   1.5647274e+04
   1.5400000e+03   1.5651551e+04
   1.5500000e+03   1.5655584e+04
   1.5600000e+03   1.5659379e+04
   1.5700000e+03   1.5662941e+04
   1.5800000e+03   1.5666273e+04
   1.5900000e+03   1.5669382e+04
   1.6000000e+03   1.5672270e+04
   1.6100000e+03   1.5674944e+04
   1.6200000e+03   1.5677406e+04
   1.6300000e+03   1.5679662e+04
   1.6400000e+03   1.5681716e+04
   1.6500000e+03   1.5683571e+04
   1.6600000e+03   1.5685232e+04
   1.6700000e+03   1.5686702e+04
   1.6800000e+03   1.5687985e+04
   1.6900000e+03   1.5689085e+04
   1.7000000e+03   1.5690006e+04
   1.7100000e+03   1.5690750e+04
   1.7200000e+03   1.5691323e+04
   1.7300000e+03   1.5691726e+04
   1.7400000e+03   1.5691964e+04
   1.7500000e+03   1.5692039e+04
   1.7600000e+03   1.5691955e+04
   1.7700000e+03   1.5691715e+04
   1.7800000e+03   1.5691321e+04
   1.7900000e+03   1.5690778e+04
   1.8000000e+03   1.5690087e+04
   1.8100000e+03   1.5689253e+04
   1.8200000e+03   1.5688276e+04
   1.8300000e+03   1.5687161e+04
   1.8400000e+03   1.5685910e+04
   1.8500000e+03   1.5684525e+04
   1.8600000e+03   1.5683010e+04
   1.8700000e+03   1.5681366e+04
   1.8800000e+03   1.5679596e+04
   1.8900000e+03   1.5677703e+04
   1.9000000e+03   1.5675689e+04
   1.9100000e+03   1.5673556e+04
   1.9200000e+03   1.5671306e+04
   1.9300000e+03   1.5668943e+04
   1.9400000e+03   1.5666467e+04
   1.9500000e+03   1.5663881e+04
   1.9600000e+03   1.5661188e+04
   1.9700000e+03   1.5658389e+04
   1.9800000e+03   1.5655486e+04
   1.9900000e+03   1.5652482e+04
   2.0000000e+03   1.5649377e+04
   2.0100000e+03   1.5646175e+04
   2.0200000e+03   1.5642877e+04
   2.0300000e+03   1.5639485e+04
   2.0400000e+03   1.5636000e+04
   2.0500000e+03   1.5632425e+04
   2.0600000e+03   1.5628761e+04
   2.0700000e+03   1.5625009e+04
   2.0800000e+03   1.5621172e+04
   2.0900000e+03   1.5617252e+04
   2.1000000e+03   1.5613248e+04
   2.1100000e+03   1.5609165e+04
   2.1200000e+03   1.5605001e+04
   2.1300000e+03   1.5600761e+04
   2.1400000e+03   1.5596444e+04
   2.1500000e+03   1.5592052e+04
   2.1600000e+03   1.5587587e+04
   2.1700000e+03   1.5583050e+04
   2.1800000e+03   1.5578442e+04
   2.1900000e+03   1.5573765e+04
   2.2000000e+03   1.5569020e+04
   2.2100000e+03   1.5564209e+04
   2.2200000e+03   1.5559332e+04
   2.2300000e+03   1.5554391e+04
   2.2400000e+03   1.5549388e+04
   2.2500000e+03   1.5544323e+04
   2.2600000e+03   1.5539197e+04
   2.2700000e+03   1.5534012e+04
   2.2800000e+03   1.5528768e+04
   2.2900000e+03   1.5523468e+04
   2.3000000e+03   1.5518112e+04
   2.3100000e+03   1.5512701e+04
   2.3200000e+03   1.5507236e+04
   2.3300000e+03   1.5501718e+04
   2.3400000e+03   1.5496149e+04
   2.3500000e+03   1.5490528e+04
   2.3600000e+03   1.5484858e+04
   2.3700000e+03   1.5479140e+04
   2.3800000e+03   1.5473373e+04
   2.3900000e+03   1.5467560e+04
   2.4000000e+03   1.5461700e+04
   2.4100000e+03   1.5455795e+04
   2.4200000e+03   1.5449847e+04
   2.4300000e+03   1.5443854e+04
   2.4400000e+03   1.5437820e+04
   2.4500000e+03   1.5431744e+04
   2.4600000e+03   1.5425627e+04
   2.4700000e+03   1.5419469e+04
   2.4800000e+03   1.5413273e+04
   2.4900000e+03   1.5407038e+04
   2.5000000e+03   1.5400766e+04
   2.5100000e+03   1.5394457e+04
   2.5200000e+03   1.5388111e+04
   2.5300000e+03   1.5381730e+04
   2.5400000e+03   1.5375315e+04
   2.5500000e+03   1.5368865e+04
   2.5600000e+03   1.5362382e+04
   2.5700000e+03   1.5355867e+04
   2.5800000e+03   1.5349319e+04
   2.5900000e+03   1.5342740e+04
   2.6000000e+03   1.5336131e+04
   2.6100000e+03   1.5329491e+04
   2.6200000e+03   1.5322823e+04
   2.6300000e+03   1.5316125e+04
   2.6400000e+03   1.5309399e+04
   2.6500000e+03   1.5302646e+04
   2.6600000e+03   1.5295865e+04
   2.6700000e+03   1.5289058e+04
   2.6800000e+03   1.5282226e+04
   2.6900000e+03   1.5275368e+04
   2.7000000e+03   1.5268485e+04
   2.7100000e+03   1.5261578e+04
   2.7200000e+03   1.5254647e+04
   2.7300000e+03   1.5247693e+04
   2.7400000e+03   1.5240716e+04
   2.7500000e+03   1.5233718e+04
   2.7600000e+03   1.5226697e+04
   2.7700000e+03   1.5219656e+04
   2.7800000e+03   1.5212593e+04
   2.7900000e+03   1.5205511e+04
   2.8000000e+03   1.5198409e+04
   2.8100000e+03   1.5191287e+04
   2.8200000e+03   1.5184146e+04
   2.8300000e+03   1.5176987e+04
   2.8400000e+03   1.5169811e+04
   2.8500000e+03   1.5162616e+04
   2.8600000e+03   1.5155404e+04
   2.8700000e+03   1.5148176e+04
   2.8800000e+03   1.5140931e+04
   2.8900000e+03   1.5133670e+04
   2.9000000e+03   1.5126394e+04
   2.9100000e+03   1.5119103e+04
   2.9200000e+03   1.5111796e+04
   2.9300000e+03   1.5104476e+04
   2.9400000e+03   1.5097141e+04
   2.9500000e+03   1.5089792e+04
   2.9600000e+03   1.5082431e+04
   2.9700000e+03   1.5075056e+04
   2.9800000e+03   1.5067669e+04
   2.9900000e+03   1.5060269e+04
   3.0000000e+03   1.5052857e+04
   3.0100000e+03   1.5045434e+04
   3.0200000e+03   1.5037999e+04
   3.0300000e+03   1.5030554e+04
   3.0400000e+03   1.5023097e+04
   3.0500000e+03   1.5015631e+04
   3.0600000e+03   1.5008154e+04
   3.0700000e+03   1.5000667e+04
   3.0800000e+03   1.4993171e+04
   3.0900000e+03   1.4985666e+04
   3.1000000e+03   1.4978152e+04
   3.1100000e+03   1.4970629e+04
   3.1200000e+03   1.4963098e+04
   3.1300000e+03   1.4955558e+04
   3.1400000e+03   1.4948011e+04
   3.1500000e+03   1.4940456e+04
   3.1600000e+03   1.4932894e+04
   3.1700000e+03   1.4925325e+04
   3.1800000e+03   1.4917749e+04
   3.1900000e+03   1.4910167e+04
   3.2000000e+03   1.4902578e+04
   3.2100000e+03   1.4894983e+04
   3.2200000e+03   1.4887382e+04
   3.2300000e+03   1.4879776e+04
   3.2400000e+03   1.4872164e+04
   3.2500000e+03   1.4864547e+04
   3.2600000e+03   1.4856925e+04
   3.2700000e+03   1.4849299e+04
   3.2800000e+03   1.4841668e+04
   3.2900000e+03   1.4834032e+04
   3.3000000e+03   1.4826393e+04
   3.3100000e+03   1.4818749e+04
   3.3200000e+03   1.4811102e+04
   3.3300000e+03   1.4803451e+04
   3.3400000e+03   1.4795797e+04
   3.3500000e+03   1.4788140e+04
   3.3600000e+03   1.4780480e+04
   3.3700000e+03   1.4772817e+04
   3.3800000e+03   1.4765151e+04
   3.3900000e+03   1.4757483e+04
   3.4000000e+03   1.4749813e+04
   3.4100000e+03   1.4742141e+04
   3.4200000e+03   1.4734467e+04
   3.4300000e+03   1.4726791e+04
   3.4400000e+03   1.4719114e+04
   3.4500000e+03   1.4711435e+04
   3.4600000e+03   1.4703755e+04
   3.4700000e+03   1.4696074e+04
   3.4800000e+03   1.4688392e+04
   3.4900000e+03   1.4680710e+04
   3.5000000e+03   1.4673026e+04
   3.5100000e+03   1.4665343e+04
   3.5200000e+03   1.4657659e+04
   3.5300000e+03   1.4649974e+04
   3.5400000e+03   1.4642290e+04
   3.5500000e+03   1.4634606e+04
   3.5600000e+03   1.4626922e+04
   3.5700000e+03   1.4619238e+04
   3.5800000e+03   1.4611555e+04
   3.5900000e+03   1.4603873e+04
   3.6000000e+03   1.4596191e+04
   3.6100000e+03   1.4588510e+04
   3.6200000e+03   1.4580830e+04
   3.6300000e+03   1.4573152e+04
   3.6400000e+03   1.4565474e+04
   3.6500000e+03   1.4557798e+04
   3.6600000e+03   1.4550124e+04
   3.6700000e+03   1.4542451e+04
   3.6800000e+03   1.4534780e+04
   3.6900000e+03   1.4527110e+04
   3.7000000e+03   1.4519443e+04
   3.7100000e+03   1.4511777e+04
   3.7200000e+03   1.4504114e+04
   3.7300000e+03   1.4496453e+04
   3.7400000e+03   1.4488794e+04
   3.7500000e+03   1.4481138e+04
   3.7600000e+03   1.4473484e+04
   3.7700000e+03   1.4465833e+04
   3.7800000e+03   1.4458185e+04
   3.7900000e+03   1.4450539e+04
   3.8000000e+03   1.4442897e+04
   3.8100000e+03   1.4435257e+04
   3.8200000e+03   1.4427621e+04
   3.8300000e+03   1.4419988e+04
   3.8400000e+03   1.4412358e+04
   3.8500000e+03   1.4404731e+04
   3.8600000e+03   1.4397108e+04
   3.8700000e+03   1.4389489e+04
   3.8800000e+03   1.4381873e+04
   3.8900000e+03   1.4374261e+04
   3.9000000e+03   1.4366652e+04
   3.9100000e+03   1.4359048e+04
   3.9200000e+03   1.4351447e+04
   3.9300000e+03   1.4343851e+04
   3.9400000e+03   1.4336258e+04
   3.9500000e+03   1.4328670e+04
   3.9600000e+03   1.4321086e+04
   3.9700000e+03   1.4313506e+04
   3.9800000e+03   1.4305930e+04
   3.9900000e+03   1.4298359e+04
   4.0000000e+03   1.4290793e+04
