$MeshFormat
2.2 0 8
$EndMeshFormat
$PhysicalNames
2
1 2 "dombnd"
2 1 "fluid"
$EndPhysicalNames
$Nodes
961
1 -0.15 -0.15 0
2 0.15 -0.15 0
3 0.15 0.15 0
4 -0.15 0.15 0
5 -0.1400000000000177 -0.15 0
6 -0.1300000000000463 -0.15 0
7 -0.1200000000000624 -0.15 0
8 -0.1100000000000872 -0.15 0
9 -0.1000000000001157 -0.15 0
10 -0.09000000000014431 -0.15 0
11 -0.08000000000017289 -0.15 0
12 -0.07000000000020146 -0.15 0
13 -0.06000000000023002 -0.15 0
14 -0.05000000000025857 -0.15 0
15 -0.04000000000028715 -0.15 0
16 -0.03000000000031029 -0.15 0
17 -0.02000000000033889 -0.15 0
18 -0.01000000000036746 -0.15 0
19 -3.905764600631301e-13 -0.15 0
20 0.009999999999628639 -0.15 0
21 0.01999999999965574 -0.15 0
22 0.02999999999968428 -0.15 0
23 0.03999999999971282 -0.15 0
24 0.04999999999974139 -0.15 0
25 0.05999999999976774 -0.15 0
26 0.06999999999979234 -0.15 0
27 0.07999999999982232 -0.15 0
28 0.08999999999984692 -0.15 0
29 0.09999999999986972 -0.15 0
30 0.1099999999998958 -0.15 0
31 0.1199999999999164 -0.15 0
32 0.1299999999999428 -0.15 0
33 0.1399999999999714 -0.15 0
34 0.15 -0.1400000000000177 0
35 0.15 -0.1300000000000463 0
36 0.15 -0.1200000000000624 0
37 0.15 -0.1100000000000872 0
38 0.15 -0.1000000000001157 0
39 0.15 -0.09000000000014431 0
40 0.15 -0.08000000000017289 0
41 0.15 -0.07000000000020146 0
42 0.15 -0.06000000000023002 0
43 0.15 -0.05000000000025857 0
44 0.15 -0.04000000000028715 0
45 0.15 -0.03000000000031029 0
46 0.15 -0.02000000000033889 0
47 0.15 -0.01000000000036746 0
48 0.15 -3.905764600631301e-13 0
49 0.15 0.009999999999628639 0
50 0.15 0.01999999999965574 0
51 0.15 0.02999999999968428 0
52 0.15 0.03999999999971282 0
53 0.15 0.04999999999974139 0
54 0.15 0.05999999999976774 0
55 0.15 0.06999999999979234 0
56 0.15 0.07999999999982232 0
57 0.15 0.08999999999984692 0
58 0.15 0.09999999999986972 0
59 0.15 0.1099999999998958 0
60 0.15 0.1199999999999164 0
61 0.15 0.1299999999999428 0
62 0.15 0.1399999999999714 0
63 0.1400000000000177 0.15 0
64 0.1300000000000463 0.15 0
65 0.1200000000000624 0.15 0
66 0.1100000000000872 0.15 0
67 0.1000000000001157 0.15 0
68 0.09000000000014431 0.15 0
69 0.08000000000017289 0.15 0
70 0.07000000000020146 0.15 0
71 0.06000000000023002 0.15 0
72 0.05000000000025857 0.15 0
73 0.04000000000028715 0.15 0
74 0.03000000000031029 0.15 0
75 0.02000000000033889 0.15 0
76 0.01000000000036746 0.15 0
77 3.905764600631301e-13 0.15 0
78 -0.009999999999628639 0.15 0
79 -0.01999999999965574 0.15 0
80 -0.02999999999968428 0.15 0
81 -0.03999999999971282 0.15 0
82 -0.04999999999974139 0.15 0
83 -0.05999999999976774 0.15 0
84 -0.06999999999979234 0.15 0
85 -0.07999999999982232 0.15 0
86 -0.08999999999984692 0.15 0
87 -0.09999999999986972 0.15 0
88 -0.1099999999998958 0.15 0
89 -0.1199999999999164 0.15 0
90 -0.1299999999999428 0.15 0
91 -0.1399999999999714 0.15 0
92 -0.15 0.1400000000000177 0
93 -0.15 0.1300000000000463 0
94 -0.15 0.1200000000000624 0
95 -0.15 0.1100000000000872 0
96 -0.15 0.1000000000001157 0
97 -0.15 0.09000000000014431 0
98 -0.15 0.08000000000017289 0
99 -0.15 0.07000000000020146 0
100 -0.15 0.06000000000023002 0
101 -0.15 0.05000000000025857 0
102 -0.15 0.04000000000028715 0
103 -0.15 0.03000000000031029 0
104 -0.15 0.02000000000033889 0
105 -0.15 0.01000000000036746 0
106 -0.15 3.905764600631301e-13 0
107 -0.15 -0.009999999999628639 0
108 -0.15 -0.01999999999965574 0
109 -0.15 -0.02999999999968428 0
110 -0.15 -0.03999999999971282 0
111 -0.15 -0.04999999999974139 0
112 -0.15 -0.05999999999976774 0
113 -0.15 -0.06999999999979234 0
114 -0.15 -0.07999999999982232 0
115 -0.15 -0.08999999999984692 0
116 -0.15 -0.09999999999986972 0
117 -0.15 -0.1099999999998958 0
118 -0.15 -0.1199999999999164 0
119 -0.15 -0.1299999999999428 0
120 -0.15 -0.1399999999999714 0
121 -0.1400000000000161 -0.139999999999973 0
122 -0.1400000000000146 -0.1299999999999462 0
123 -0.1400000000000131 -0.1199999999999213 0
124 -0.1400000000000115 -0.1099999999999021 0
125 -0.1400000000000099 -0.09999999999987794 0
126 -0.1400000000000084 -0.08999999999985683 0
127 -0.1400000000000069 -0.07999999999983402 0
128 -0.1400000000000053 -0.06999999999980594 0
129 -0.1400000000000038 -0.05999999999978314 0
130 -0.1400000000000022 -0.04999999999975865 0
131 -0.1400000000000008 -0.03999999999973198 0
132 -0.1399999999999992 -0.02999999999970515 0
133 -0.1399999999999976 -0.01999999999967848 0
134 -0.1399999999999961 -0.009999999999653272 0
135 -0.1399999999999945 3.645417301356702e-13 0
136 -0.139999999999993 0.01000000000034285 0
137 -0.1399999999999915 0.02000000000031611 0
138 -0.1399999999999899 0.03000000000028943 0
139 -0.1399999999999884 0.04000000000026802 0
140 -0.1399999999999868 0.05000000000024132 0
141 -0.1399999999999852 0.0600000000002146 0
142 -0.1399999999999837 0.07000000000018783 0
143 -0.1399999999999822 0.08000000000016122 0
144 -0.1399999999999806 0.09000000000013442 0
145 -0.1399999999999791 0.1000000000001075 0
146 -0.1399999999999775 0.1100000000000808 0
147 -0.139999999999976 0.1200000000000575 0
148 -0.1399999999999744 0.1300000000000429 0
149 -0.139999999999973 0.1400000000000162 0
150 -0.1300000000000429 -0.1399999999999745 0
151 -0.1300000000000394 -0.1299999999999497 0
152 -0.130000000000036 -0.1199999999999262 0
153 -0.1300000000000325 -0.1099999999999085 0
154 -0.130000000000029 -0.09999999999988612 0
155 -0.1300000000000256 -0.08999999999986678 0
156 -0.1300000000000222 -0.07999999999984569 0
157 -0.1300000000000187 -0.0699999999998196 0
158 -0.1300000000000153 -0.05999999999979855 0
159 -0.1300000000000118 -0.04999999999977586 0
160 -0.1300000000000083 -0.03999999999975112 0
161 -0.1300000000000049 -0.029999999999726 0
162 -0.1300000000000014 -0.01999999999970126 0
163 -0.129999999999998 -0.009999999999677892 0
164 -0.1299999999999946 3.385070002082102e-13 0
165 -0.1299999999999911 0.01000000000031823 0
166 -0.1299999999999876 0.02000000000029335 0
167 -0.1299999999999842 0.03000000000026858 0
168 -0.1299999999999807 0.04000000000024886 0
169 -0.1299999999999773 0.05000000000022408 0
170 -0.1299999999999739 0.0600000000001992 0
171 -0.1299999999999704 0.0700000000001742 0
172 -0.129999999999967 0.08000000000014952 0
173 -0.1299999999999635 0.09000000000012445 0
174 -0.12999999999996 0.1000000000000994 0
175 -0.1299999999999566 0.1100000000000744 0
176 -0.1299999999999532 0.1200000000000526 0
177 -0.1299999999999497 0.1300000000000394 0
178 -0.1299999999999463 0.1400000000000147 0
179 -0.1200000000000575 -0.139999999999976 0
180 -0.1200000000000526 -0.1299999999999531 0
181 -0.1200000000000478 -0.119999999999931 0
182 -0.1200000000000429 -0.1099999999999149 0
183 -0.120000000000038 -0.09999999999989431 0
184 -0.1200000000000332 -0.08999999999987664 0
185 -0.1200000000000283 -0.07999999999985738 0
186 -0.1200000000000234 -0.06999999999983325 0
187 -0.1200000000000186 -0.059999999999814 0
188 -0.1200000000000137 -0.04999999999979312 0
189 -0.1200000000000088 -0.03999999999977027 0
190 -0.120000000000004 -0.02999999999974687 0
191 -0.1199999999999991 -0.01999999999972403 0
192 -0.1199999999999943 -0.009999999999702525 0
193 -0.1199999999999894 3.124722702807503e-13 0
194 -0.1199999999999845 0.01000000000029359 0
195 -0.1199999999999797 0.02000000000027057 0
196 -0.1199999999999748 0.0300000000002477 0
197 -0.1199999999999699 0.04000000000022971 0
198 -0.1199999999999651 0.05000000000020685 0
199 -0.1199999999999602 0.0600000000001838 0
200 -0.1199999999999553 0.07000000000016054 0
201 -0.1199999999999505 0.08000000000013785 0
202 -0.1199999999999456 0.09000000000011457 0
203 -0.1199999999999407 0.1000000000000912 0
204 -0.1199999999999359 0.110000000000068 0
205 -0.119999999999931 0.1200000000000478 0
206 -0.1199999999999262 0.1300000000000359 0
207 -0.1199999999999213 0.1400000000000131 0
208 -0.1100000000000808 -0.1399999999999776 0
209 -0.1100000000000744 -0.1299999999999565 0
210 -0.110000000000068 -0.1199999999999359 0
211 -0.1100000000000616 -0.1099999999999213 0
212 -0.1100000000000553 -0.09999999999990253 0
213 -0.1100000000000489 -0.08999999999988659 0
214 -0.1100000000000425 -0.07999999999986908 0
215 -0.1100000000000361 -0.06999999999984684 0
216 -0.1100000000000297 -0.05999999999982938 0
217 -0.1100000000000234 -0.04999999999981034 0
218 -0.110000000000017 -0.0399999999997894 0
219 -0.1100000000000106 -0.02999999999976773 0
220 -0.1100000000000042 -0.01999999999974683 0
221 -0.1099999999999978 -0.009999999999727137 0
222 -0.1099999999999915 2.864236625654826e-13 0
223 -0.1099999999999851 0.01000000000026896 0
224 -0.1099999999999787 0.02000000000024781 0
225 -0.1099999999999723 0.03000000000022682 0
226 -0.1099999999999659 0.04000000000021058 0
227 -0.1099999999999596 0.05000000000018963 0
228 -0.1099999999999532 0.06000000000016838 0
229 -0.1099999999999468 0.07000000000014692 0
230 -0.1099999999999404 0.08000000000012614 0
231 -0.109999999999934 0.09000000000010464 0
232 -0.1099999999999277 0.1000000000000829 0
233 -0.1099999999999213 0.1100000000000617 0
234 -0.1099999999999149 0.1200000000000429 0
235 -0.1099999999999085 0.1300000000000325 0
236 -0.1099999999999021 0.1400000000000115 0
237 -0.1000000000001075 -0.1399999999999791 0
238 -0.1000000000000993 -0.12999999999996 0
239 -0.1000000000000911 -0.1199999999999407 0
240 -0.1000000000000829 -0.1099999999999276 0
241 -0.1000000000000748 -0.09999999999991074 0
242 -0.1000000000000666 -0.08999999999989652 0
243 -0.1000000000000583 -0.07999999999988075 0
244 -0.1000000000000501 -0.06999999999986049 0
245 -0.1000000000000419 -0.05999999999984478 0
246 -0.1000000000000337 -0.0499999999998276 0
247 -0.1000000000000255 -0.03999999999980856 0
248 -0.1000000000000174 -0.02999999999978861 0
249 -0.1000000000000091 -0.01999999999976959 0
250 -0.1000000000000009 -0.009999999999751777 0
251 -0.09999999999999273 2.603819937441187e-13 0
252 -0.09999999999998452 0.01000000000024433 0
253 -0.0999999999999763 0.02000000000022503 0
254 -0.09999999999996814 0.03000000000020596 0
255 -0.09999999999995991 0.04000000000019145 0
256 -0.09999999999995171 0.05000000000017238 0
257 -0.09999999999994348 0.060000000000153 0
258 -0.09999999999993534 0.07000000000013325 0
259 -0.09999999999992712 0.08000000000011448 0
260 -0.0999999999999189 0.09000000000009473 0
261 -0.09999999999991073 0.1000000000000748 0
262 -0.09999999999990253 0.1100000000000553 0
263 -0.09999999999989431 0.1200000000000381 0
264 -0.0999999999998861 0.130000000000029 0
265 -0.09999999999987795 0.14000000000001 0
266 -0.09000000000013438 -0.1399999999999806 0
267 -0.09000000000012449 -0.1299999999999635 0
268 -0.09000000000011456 -0.1199999999999456 0
269 -0.09000000000010466 -0.109999999999934 0
270 -0.09000000000009475 -0.09999999999991893 0
271 -0.09000000000008485 -0.0899999999999064 0
272 -0.09000000000007494 -0.07999999999989245 0
273 -0.090000000000065 -0.06999999999987416 0
274 -0.09000000000005509 -0.0599999999998602 0
275 -0.0900000000000452 -0.04999999999984482 0
276 -0.09000000000003526 -0.03999999999982768 0
277 -0.09000000000002534 -0.02999999999980949 0
278 -0.09000000000001546 -0.01999999999979236 0
279 -0.09000000000000552 -0.00999999999977641 0
280 -0.08999999999999564 2.343403249227549e-13 0
281 -0.08999999999998569 0.0100000000002197 0
282 -0.08999999999997579 0.02000000000020225 0
283 -0.08999999999996589 0.0300000000001851 0
284 -0.08999999999995595 0.04000000000017229 0
285 -0.08999999999994605 0.05000000000015513 0
286 -0.08999999999993613 0.06000000000013757 0
287 -0.08999999999992622 0.07000000000011963 0
288 -0.08999999999991631 0.08000000000010278 0
289 -0.0899999999999064 0.09000000000008485 0
290 -0.0899999999998965 0.1000000000000666 0
291 -0.08999999999988655 0.1100000000000489 0
292 -0.08999999999987668 0.1200000000000332 0
293 -0.08999999999986673 0.1300000000000256 0
294 -0.08999999999985683 0.1400000000000085 0
295 -0.08000000000016123 -0.1399999999999822 0
296 -0.08000000000014955 -0.1299999999999669 0
297 -0.08000000000013782 -0.1199999999999505 0
298 -0.08000000000012616 -0.1099999999999404 0
299 -0.08000000000011445 -0.09999999999992712 0
300 -0.08000000000010278 -0.08999999999991633 0
301 -0.08000000000009108 -0.07999999999990412 0
302 -0.0800000000000794 -0.0699999999998878 0
303 -0.08000000000006773 -0.05999999999987558 0
304 -0.08000000000005608 -0.04999999999986209 0
305 -0.08000000000004434 -0.03999999999984682 0
306 -0.08000000000003266 -0.02999999999983035 0
307 -0.080000000000021 -0.01999999999981514 0
308 -0.08000000000000929 -0.009999999999801043 0
309 -0.07999999999999761 2.082986561013911e-13 0
310 -0.07999999999998592 0.01000000000019509 0
311 -0.07999999999997423 0.02000000000017949 0
312 -0.07999999999996255 0.03000000000016421 0
313 -0.07999999999995086 0.04000000000015314 0
314 -0.0799999999999392 0.05000000000013789 0
315 -0.07999999999992749 0.06000000000012216 0
316 -0.07999999999991581 0.07000000000010599 0
317 -0.07999999999990412 0.0800000000000911 0
318 -0.07999999999989245 0.09000000000007494 0
319 -0.07999999999988075 0.1000000000000583 0
320 -0.07999999999986908 0.1100000000000425 0
321 -0.07999999999985739 0.1200000000000284 0
322 -0.07999999999984569 0.1300000000000221 0
323 -0.07999999999983402 0.140000000000007 0
324 -0.07000000000018781 -0.1399999999999837 0
325 -0.07000000000017416 -0.1299999999999704 0
326 -0.07000000000016054 -0.1199999999999553 0
327 -0.0700000000001469 -0.1099999999999468 0
328 -0.07000000000013325 -0.09999999999993531 0
329 -0.07000000000011965 -0.08999999999992622 0
330 -0.07000000000010599 -0.07999999999991579 0
331 -0.07000000000009235 -0.06999999999990145 0
332 -0.07000000000007874 -0.05999999999989104 0
333 -0.07000000000006509 -0.04999999999987931 0
334 -0.07000000000005147 -0.03999999999986598 0
335 -0.07000000000003781 -0.02999999999985121 0
336 -0.07000000000002415 -0.0199999999998379 0
337 -0.07000000000001055 -0.009999999999825655 0
338 -0.06999999999999691 1.822708650678351e-13 0
339 -0.06999999999998327 0.01000000000017046 0
340 -0.06999999999996964 0.02000000000015673 0
341 -0.06999999999995599 0.03000000000014336 0
342 -0.06999999999994236 0.04000000000013399 0
343 -0.0699999999999287 0.05000000000012066 0
344 -0.06999999999991507 0.06000000000010675 0
345 -0.06999999999990142 0.07000000000009238 0
346 -0.06999999999988779 0.08000000000007938 0
347 -0.06999999999987416 0.09000000000006499 0
348 -0.06999999999986052 0.1000000000000501 0
349 -0.06999999999984688 0.1100000000000361 0
350 -0.06999999999983325 0.1200000000000234 0
351 -0.06999999999981958 0.1300000000000187 0
352 -0.06999999999980597 0.1400000000000054 0
353 -0.06000000000021461 -0.1399999999999853 0
354 -0.06000000000019922 -0.1299999999999739 0
355 -0.06000000000018382 -0.1199999999999601 0
356 -0.06000000000016838 -0.1099999999999532 0
357 -0.06000000000015299 -0.09999999999994352 0
358 -0.06000000000013757 -0.08999999999993616 0
359 -0.06000000000012215 -0.0799999999999275 0
360 -0.06000000000010677 -0.06999999999991509 0
361 -0.06000000000009134 -0.05999999999990641 0
362 -0.06000000000007594 -0.04999999999989656 0
363 -0.06000000000006054 -0.03999999999988512 0
364 -0.06000000000004511 -0.02999999999987207 0
365 -0.0600000000000297 -0.01999999999986067 0
366 -0.0600000000000143 -0.009999999999850274 0
367 -0.05999999999999888 1.562430740342791e-13 0
368 -0.05999999999998348 0.01000000000014582 0
369 -0.05999999999996805 0.02000000000013395 0
370 -0.05999999999995267 0.03000000000012249 0
371 -0.05999999999993724 0.04000000000011485 0
372 -0.05999999999992184 0.05000000000010341 0
373 -0.05999999999990644 0.06000000000009135 0
374 -0.05999999999989103 0.07000000000007872 0
375 -0.05999999999987563 0.08000000000006774 0
376 -0.05999999999986021 0.09000000000005509 0
377 -0.05999999999984479 0.1000000000000419 0
378 -0.05999999999982938 0.1100000000000298 0
379 -0.05999999999981397 0.1200000000000186 0
380 -0.05999999999979856 0.1300000000000152 0
381 -0.05999999999978314 0.1400000000000038 0
382 -0.05000000000024134 -0.1399999999999869 0
383 -0.05000000000022409 -0.1299999999999773 0
384 -0.05000000000020686 -0.119999999999965 0
385 -0.05000000000018961 -0.1099999999999596 0
386 -0.05000000000017236 -0.09999999999995174 0
387 -0.05000000000015514 -0.08999999999994608 0
388 -0.05000000000013791 -0.07999999999993919 0
389 -0.05000000000012066 -0.06999999999992872 0
390 -0.05000000000010342 -0.05999999999992184 0
391 -0.05000000000008617 -0.04999999999991378 0
392 -0.05000000000006895 -0.03999999999990429 0
393 -0.05000000000005171 -0.02999999999989295 0
394 -0.05000000000003445 -0.01999999999988345 0
395 -0.05000000000001723 -0.009999999999874908 0
396 -0.04999999999999997 1.301875274251074e-13 0
397 -0.04999999999998275 0.0100000000001212 0
398 -0.04999999999996552 0.02000000000011117 0
399 -0.04999999999994825 0.03000000000010163 0
400 -0.04999999999993102 0.04000000000009572 0
401 -0.04999999999991378 0.05000000000008617 0
402 -0.04999999999989656 0.06000000000007594 0
403 -0.04999999999987932 0.07000000000006509 0
404 -0.04999999999986207 0.08000000000005603 0
405 -0.04999999999984482 0.09000000000004518 0
406 -0.04999999999982758 0.1000000000000337 0
407 -0.04999999999981033 0.1100000000000234 0
408 -0.0499999999997931 0.1200000000000137 0
409 -0.04999999999977587 0.1300000000000118 0
410 -0.04999999999975863 0.1400000000000023 0
411 -0.04000000000026799 -0.1399999999999884 0
412 -0.04000000000024886 -0.1299999999999808 0
413 -0.04000000000022973 -0.1199999999999699 0
414 -0.04000000000021058 -0.109999999999966 0
415 -0.04000000000019144 -0.09999999999995993 0
416 -0.04000000000017227 -0.08999999999995596 0
417 -0.04000000000015313 -0.07999999999995087 0
418 -0.040000000000134 -0.06999999999994233 0
419 -0.04000000000011485 -0.05999999999993724 0
420 -0.04000000000009572 -0.04999999999993102 0
421 -0.04000000000007657 -0.03999999999992341 0
422 -0.04000000000005741 -0.02999999999991382 0
423 -0.04000000000003825 -0.01999999999990623 0
424 -0.04000000000001915 -0.009999999999899534 0
425 -0.03999999999999999 1.041527974976475e-13 0
426 -0.03999999999998084 0.01000000000009658 0
427 -0.03999999999996169 0.02000000000008839 0
428 -0.03999999999994257 0.03000000000008075 0
429 -0.03999999999992342 0.04000000000007656 0
430 -0.03999999999990426 0.05000000000006893 0
431 -0.03999999999988512 0.06000000000006052 0
432 -0.039999999999866 0.07000000000005147 0
433 -0.03999999999984682 0.08000000000004434 0
434 -0.03999999999982768 0.09000000000003527 0
435 -0.03999999999980855 0.1000000000000256 0
436 -0.03999999999978941 0.110000000000017 0
437 -0.03999999999977026 0.1200000000000089 0
438 -0.0399999999997511 0.1300000000000083 0
439 -0.03999999999973197 0.1400000000000008 0
440 -0.03000000000028942 -0.13999999999999 0
441 -0.03000000000026855 -0.1299999999999842 0
442 -0.03000000000024767 -0.1199999999999748 0
443 -0.03000000000022681 -0.1099999999999723 0
444 -0.03000000000020596 -0.09999999999996814 0
445 -0.03000000000018509 -0.0899999999999659 0
446 -0.03000000000016422 -0.07999999999996257 0
447 -0.03000000000014335 -0.06999999999995599 0
448 -0.03000000000012248 -0.05999999999995265 0
449 -0.03000000000010162 -0.04999999999994829 0
450 -0.03000000000008075 -0.03999999999994256 0
451 -0.03000000000005988 -0.02999999999993468 0
452 -0.03000000000003902 -0.019999999999929 0
453 -0.03000000000001815 -0.009999999999924167 0
454 -0.02999999999999728 7.811112867628367e-14 0
455 -0.02999999999997642 0.01000000000007195 0
456 -0.02999999999995554 0.02000000000006564 0
457 -0.02999999999993468 0.03000000000005989 0
458 -0.02999999999991383 0.04000000000005742 0
459 -0.02999999999989295 0.05000000000005169 0
460 -0.02999999999987208 0.06000000000004511 0
461 -0.02999999999985122 0.07000000000003781 0
462 -0.02999999999983035 0.08000000000003266 0
463 -0.02999999999980948 0.09000000000002537 0
464 -0.02999999999978863 0.1000000000000174 0
465 -0.02999999999976774 0.1100000000000106 0
466 -0.02999999999974687 0.120000000000004 0
467 -0.02999999999972602 0.1300000000000049 0
468 -0.02999999999970514 0.1399999999999992 0
469 -0.0200000000003161 -0.1399999999999915 0
470 -0.02000000000029334 -0.1299999999999876 0
471 -0.02000000000027056 -0.1199999999999797 0
472 -0.0200000000002478 -0.1099999999999787 0
473 -0.02000000000022503 -0.09999999999997633 0
474 -0.02000000000020225 -0.08999999999997579 0
475 -0.02000000000017948 -0.07999999999997423 0
476 -0.0200000000001567 -0.06999999999996964 0
477 -0.02000000000013393 -0.05999999999996806 0
478 -0.02000000000011118 -0.0499999999999655 0
479 -0.02000000000008839 -0.03999999999996171 0
480 -0.02000000000006564 -0.02999999999995556 0
481 -0.02000000000004286 -0.01999999999995176 0
482 -0.02000000000002008 -0.0099999999999488 0
483 -0.01999999999999731 5.208333764272766e-14 0
484 -0.01999999999997453 0.01000000000004733 0
485 -0.01999999999995176 0.02000000000004286 0
486 -0.019999999999929 0.03000000000003902 0
487 -0.01999999999990621 0.04000000000003828 0
488 -0.01999999999988345 0.05000000000003446 0
489 -0.01999999999986066 0.0600000000000297 0
490 -0.01999999999983791 0.07000000000002418 0
491 -0.01999999999981514 0.080000000000021 0
492 -0.01999999999979236 0.09000000000001546 0
493 -0.01999999999976959 0.1000000000000091 0
494 -0.01999999999974682 0.1100000000000042 0
495 -0.01999999999972406 0.1199999999999991 0
496 -0.01999999999970127 0.1300000000000014 0
497 -0.0199999999996785 0.1399999999999977 0
498 -0.01000000000034284 -0.139999999999993 0
499 -0.0100000000003182 -0.1299999999999911 0
500 -0.01000000000029357 -0.1199999999999845 0
501 -0.01000000000026896 -0.1099999999999851 0
502 -0.01000000000024432 -0.09999999999998452 0
503 -0.0100000000002197 -0.08999999999998573 0
504 -0.01000000000019508 -0.07999999999998593 0
505 -0.01000000000017044 -0.06999999999998324 0
506 -0.01000000000014581 -0.05999999999998346 0
507 -0.01000000000012118 -0.04999999999998275 0
508 -0.01000000000009656 -0.03999999999998083 0
509 -0.01000000000007194 -0.02999999999997641 0
510 -0.0100000000000473 -0.01999999999997454 0
511 -0.01000000000002268 -0.009999999999973419 0
512 -0.009999999999998038 2.602779103355601e-14 0
513 -0.009999999999973419 0.01000000000002269 0
514 -0.009999999999948782 0.02000000000002009 0
515 -0.009999999999924177 0.03000000000001815 0
516 -0.009999999999899534 0.04000000000001913 0
517 -0.009999999999874915 0.05000000000001723 0
518 -0.009999999999850268 0.06000000000001429 0
519 -0.009999999999825659 0.07000000000001055 0
520 -0.009999999999801019 0.08000000000000929 0
521 -0.009999999999776403 0.09000000000000551 0
522 -0.009999999999751777 0.100000000000001 0
523 -0.009999999999727144 0.1099999999999979 0
524 -0.009999999999702514 0.1199999999999943 0
525 -0.009999999999677881 0.129999999999998 0
526 -0.009999999999653265 0.1399999999999961 0
527 -3.645506061375017e-13 -0.1399999999999945 0
528 -3.384969966362859e-13 -0.1299999999999945 0
529 -3.124576986037146e-13 -0.1199999999999893 0
530 -2.864175332094278e-13 -0.1099999999999915 0
531 -2.603843067090548e-13 -0.09999999999999273 0
532 -2.343458760382538e-13 -0.08999999999999561 0
533 -2.083074453674529e-13 -0.0799999999999976 0
534 -1.822655452497e-13 -0.06999999999999691 0
535 -1.562305840258509e-13 -0.05999999999999889 0
536 -1.301921533550501e-13 -0.05 0
537 -1.041537226842492e-13 -0.03999999999999999 0
538 -7.8118761460386e-14 -0.02999999999999728 0
539 -5.207686134263308e-14 -0.0199999999999973 0
540 -2.603843067183212e-14 -0.009999999999998045 0
541 -1.017012100785412e-24 6.938893903907228e-18 0
542 2.603843066990836e-14 0.009999999999998073 0
543 5.207686134085432e-14 0.0199999999999973 0
544 7.810835311790002e-14 0.02999999999999729 0
545 1.041606615766575e-13 0.03999999999999999 0
546 1.301921533537033e-13 0.04999999999999999 0
547 1.562167062368395e-13 0.05999999999999888 0
548 1.822620758016827e-13 0.0699999999999969 0
549 2.08314384260444e-13 0.0799999999999976 0
550 2.343458760374795e-13 0.0899999999999956 0
551 2.603843067084142e-13 0.09999999999999275 0
552 2.864227373793573e-13 0.1099999999999915 0
553 3.124611680502865e-13 0.1199999999999894 0
554 3.384995987212305e-13 0.1299999999999945 0
555 3.645380293921803e-13 0.1399999999999946 0
556 0.009999999999653297 -0.1399999999999961 0
557 0.009999999999677909 -0.1299999999999979 0
558 0.009999999999702539 -0.1199999999999942 0
559 0.009999999999727163 -0.1099999999999978 0
560 0.009999999999751789 -0.1000000000000009 0
561 0.00999999999977641 -0.09000000000000553 0
562 0.009999999999801043 -0.08000000000000929 0
563 0.009999999999825669 -0.07000000000001055 0
564 0.009999999999850292 -0.06000000000001428 0
565 0.009999999999874925 -0.05000000000001723 0
566 0.009999999999899551 -0.04000000000001914 0
567 0.009999999999924181 -0.03000000000001815 0
568 0.009999999999948814 -0.02000000000002008 0
569 0.009999999999973433 -0.01000000000002268 0
570 0.009999999999998066 -2.604166882136383e-14 0
571 0.01000000000002269 0.00999999999997344 0
572 0.01000000000004732 0.01999999999997454 0
573 0.01000000000007193 0.02999999999997642 0
574 0.01000000000009658 0.03999999999998084 0
575 0.0100000000001212 0.04999999999998273 0
576 0.01000000000014584 0.05999999999998347 0
577 0.01000000000017046 0.06999999999998327 0
578 0.01000000000019508 0.07999999999998592 0
579 0.01000000000021973 0.0899999999999857 0
580 0.01000000000024433 0.09999999999998452 0
581 0.01000000000026897 0.1099999999999851 0
582 0.0100000000002936 0.1199999999999845 0
583 0.01000000000031822 0.1299999999999911 0
584 0.01000000000034285 0.139999999999993 0
585 0.01999999999967851 -0.1399999999999977 0
586 0.01999999999970128 -0.1300000000000014 0
587 0.01999999999972404 -0.1199999999999991 0
588 0.01999999999974683 -0.1100000000000042 0
589 0.0199999999997696 -0.1000000000000091 0
590 0.01999999999979237 -0.09000000000001546 0
591 0.01999999999981514 -0.08000000000002097 0
592 0.01999999999983793 -0.07000000000002415 0
593 0.01999999999986068 -0.0600000000000297 0
594 0.01999999999988346 -0.05000000000003446 0
595 0.01999999999990622 -0.04000000000003829 0
596 0.019999999999929 -0.03000000000003902 0
597 0.01999999999995177 -0.02000000000004286 0
598 0.01999999999997454 -0.0100000000000473 0
599 0.01999999999999731 -5.208333764272766e-14 0
600 0.02000000000002009 0.009999999999948821 0
601 0.02000000000004286 0.01999999999995176 0
602 0.02000000000006563 0.02999999999995555 0
603 0.0200000000000884 0.03999999999996171 0
604 0.02000000000011117 0.0499999999999655 0
605 0.02000000000013395 0.05999999999996805 0
606 0.02000000000015672 0.06999999999996961 0
607 0.02000000000017949 0.07999999999997423 0
608 0.02000000000020225 0.08999999999997579 0
609 0.02000000000022503 0.09999999999997633 0
610 0.0200000000002478 0.1099999999999787 0
611 0.02000000000027057 0.1199999999999797 0
612 0.02000000000029335 0.1299999999999877 0
613 0.02000000000031613 0.1399999999999915 0
614 0.02999999999970514 -0.1399999999999992 0
615 0.02999999999972603 -0.1300000000000048 0
616 0.0299999999997469 -0.120000000000004 0
617 0.02999999999976775 -0.1100000000000106 0
618 0.02999999999978861 -0.1000000000000173 0
619 0.02999999999980948 -0.09000000000002537 0
620 0.02999999999983034 -0.08000000000003267 0
621 0.02999999999985122 -0.0700000000000378 0
622 0.02999999999987209 -0.06000000000004511 0
623 0.02999999999989295 -0.0500000000000517 0
624 0.02999999999991382 -0.04000000000005744 0
625 0.02999999999993469 -0.03000000000005989 0
626 0.02999999999995555 -0.02000000000006564 0
627 0.02999999999997642 -0.01000000000007194 0
628 0.02999999999999729 -7.812500646409148e-14 0
629 0.03000000000001815 0.009999999999924167 0
630 0.03000000000003903 0.019999999999929 0
631 0.03000000000005987 0.02999999999993468 0
632 0.03000000000008075 0.03999999999994255 0
633 0.03000000000010164 0.04999999999994827 0
634 0.03000000000012249 0.05999999999995265 0
635 0.03000000000014336 0.06999999999995599 0
636 0.03000000000016424 0.07999999999996255 0
637 0.0300000000001851 0.08999999999996589 0
638 0.03000000000020597 0.09999999999996816 0
639 0.03000000000022684 0.1099999999999723 0
640 0.03000000000024769 0.1199999999999748 0
641 0.03000000000026857 0.1299999999999842 0
642 0.03000000000028941 0.1399999999999899 0
643 0.03999999999973198 -0.1400000000000008 0
644 0.03999999999975111 -0.1300000000000083 0
645 0.03999999999977024 -0.1200000000000089 0
646 0.0399999999997894 -0.110000000000017 0
647 0.03999999999980855 -0.1000000000000255 0
648 0.03999999999982769 -0.09000000000003527 0
649 0.03999999999984683 -0.08000000000004434 0
650 0.03999999999986597 -0.07000000000005142 0
651 0.03999999999988513 -0.0600000000000605 0
652 0.03999999999990427 -0.05000000000006897 0
653 0.0399999999999234 -0.04000000000007656 0
654 0.03999999999994255 -0.03000000000008076 0
655 0.03999999999996171 -0.02000000000008839 0
656 0.03999999999998084 -0.01000000000009657 0
657 0.03999999999999998 -1.041493280506955e-13 0
658 0.04000000000001913 0.009999999999899565 0
659 0.04000000000003829 0.01999999999990622 0
660 0.04000000000005742 0.02999999999991382 0
661 0.04000000000007656 0.03999999999992341 0
662 0.04000000000009572 0.04999999999993102 0
663 0.04000000000011486 0.05999999999993724 0
664 0.040000000000134 0.06999999999994236 0
665 0.04000000000015313 0.07999999999995086 0
666 0.04000000000017229 0.08999999999995598 0
667 0.04000000000019143 0.09999999999995993 0
668 0.04000000000021058 0.1099999999999659 0
669 0.04000000000022973 0.11999999999997 0
670 0.04000000000024886 0.1299999999999807 0
671 0.04000000000026802 0.1399999999999884 0
672 0.04999999999975862 -0.1400000000000023 0
673 0.04999999999977586 -0.1300000000000118 0
674 0.04999999999979311 -0.1200000000000137 0
675 0.04999999999981035 -0.1100000000000234 0
676 0.04999999999982759 -0.1000000000000338 0
677 0.04999999999984481 -0.09000000000004518 0
678 0.04999999999986206 -0.08000000000005605 0
679 0.04999999999987931 -0.07000000000006507 0
680 0.04999999999989654 -0.06000000000007594 0
681 0.04999999999991376 -0.05000000000008618 0
682 0.049999999999931 -0.04000000000009571 0
683 0.04999999999994825 -0.03000000000010163 0
684 0.04999999999996549 -0.02000000000011116 0
685 0.04999999999998274 -0.01000000000012119 0
686 0.05 -1.301944663190113e-13 0
687 0.05000000000001723 0.009999999999874932 0
688 0.05000000000003445 0.01999999999988346 0
689 0.05000000000005169 0.02999999999989295 0
690 0.05000000000006893 0.03999999999990426 0
691 0.05000000000008617 0.04999999999991378 0
692 0.05000000000010341 0.05999999999992183 0
693 0.05000000000012065 0.06999999999992869 0
694 0.0500000000001379 0.07999999999993918 0
695 0.05000000000015512 0.08999999999994607 0
696 0.05000000000017237 0.09999999999995171 0
697 0.05000000000018961 0.1099999999999596 0
698 0.05000000000020683 0.1199999999999651 0
699 0.05000000000022408 0.1299999999999773 0
700 0.05000000000024132 0.1399999999999869 0
701 0.05999999999978316 -0.1400000000000039 0
702 0.05999999999979856 -0.1300000000000152 0
703 0.05999999999981397 -0.1200000000000185 0
704 0.05999999999982937 -0.1100000000000297 0
705 0.0599999999998448 -0.1000000000000419 0
706 0.05999999999986019 -0.09000000000005513 0
707 0.0599999999998756 -0.08000000000006773 0
708 0.05999999999989103 -0.07000000000007872 0
709 0.05999999999990641 -0.06000000000009133 0
710 0.05999999999992183 -0.05000000000010344 0
711 0.05999999999993724 -0.04000000000011486 0
712 0.05999999999995265 -0.03000000000012249 0
713 0.05999999999996806 -0.02000000000013393 0
714 0.05999999999998347 -0.0100000000001458 0
715 0.05999999999999887 -1.562430740342791e-13 0
716 0.06000000000001429 0.009999999999850313 0
717 0.0600000000000297 0.01999999999986069 0
718 0.06000000000004511 0.02999999999987209 0
719 0.06000000000006053 0.03999999999988513 0
720 0.06000000000007593 0.04999999999989654 0
721 0.06000000000009134 0.05999999999990643 0
722 0.06000000000010675 0.06999999999991507 0
723 0.06000000000012217 0.07999999999992749 0
724 0.06000000000013756 0.08999999999993612 0
725 0.06000000000015298 0.09999999999994354 0
726 0.0600000000001684 0.1099999999999532 0
727 0.0600000000001838 0.1199999999999602 0
728 0.0600000000001992 0.1299999999999738 0
729 0.06000000000021462 0.1399999999999853 0
730 0.06999999999980598 -0.1400000000000054 0
731 0.06999999999981961 -0.1300000000000187 0
732 0.06999999999983324 -0.1200000000000234 0
733 0.06999999999984688 -0.1100000000000361 0
734 0.06999999999986053 -0.1000000000000501 0
735 0.06999999999987416 -0.09000000000006504 0
736 0.06999999999988776 -0.08000000000007942 0
737 0.06999999999990145 -0.07000000000009239 0
738 0.06999999999991507 -0.06000000000010675 0
739 0.06999999999992869 -0.05000000000012067 0
740 0.06999999999994236 -0.040000000000134 0
741 0.06999999999995599 -0.03000000000014335 0
742 0.06999999999996964 -0.02000000000015671 0
743 0.06999999999998324 -0.01000000000017044 0
744 0.06999999999999688 -1.82277803961739e-13 0
745 0.07000000000001051 0.009999999999825673 0
746 0.07000000000002418 0.01999999999983793 0
747 0.07000000000003781 0.02999999999985122 0
748 0.07000000000005145 0.03999999999986598 0
749 0.07000000000006504 0.04999999999987929 0
750 0.07000000000007872 0.05999999999989102 0
751 0.07000000000009235 0.06999999999990145 0
752 0.07000000000010601 0.07999999999991581 0
753 0.07000000000011963 0.08999999999992622 0
754 0.07000000000013326 0.09999999999993534 0
755 0.07000000000014689 0.1099999999999468 0
756 0.07000000000016053 0.1199999999999553 0
757 0.0700000000001742 0.1299999999999704 0
758 0.07000000000018783 0.1399999999999838 0
759 0.07999999999983402 -0.1400000000000069 0
760 0.07999999999984571 -0.1300000000000222 0
761 0.07999999999985737 -0.1200000000000283 0
762 0.07999999999986904 -0.1100000000000425 0
763 0.07999999999988075 -0.1000000000000583 0
764 0.07999999999989245 -0.09000000000007495 0
765 0.07999999999990411 -0.0800000000000911 0
766 0.07999999999991581 -0.07000000000010598 0
767 0.07999999999992752 -0.06000000000012215 0
768 0.07999999999993918 -0.05000000000013791 0
769 0.07999999999995086 -0.04000000000015314 0
770 0.07999999999996253 -0.03000000000016423 0
771 0.07999999999997424 -0.02000000000017948 0
772 0.07999999999998592 -0.01000000000019507 0
773 0.0799999999999976 -2.083090644422469e-13 0
774 0.08000000000000929 0.00999999999980105 0
775 0.08000000000002098 0.01999999999981514 0
776 0.08000000000003267 0.02999999999983037 0
777 0.08000000000004438 0.03999999999984682 0
778 0.08000000000005604 0.04999999999986207 0
779 0.08000000000006773 0.0599999999998756 0
780 0.0800000000000794 0.0699999999998878 0
781 0.08000000000009111 0.07999999999990412 0
782 0.08000000000010277 0.08999999999991631 0
783 0.08000000000011449 0.09999999999992713 0
784 0.08000000000012612 0.1099999999999404 0
785 0.08000000000013785 0.1199999999999505 0
786 0.08000000000014951 0.1299999999999669 0
787 0.08000000000016123 0.1399999999999822 0
788 0.08999999999985685 -0.1400000000000085 0
789 0.08999999999986673 -0.1300000000000256 0
790 0.08999999999987665 -0.1200000000000332 0
791 0.08999999999988657 -0.1100000000000489 0
792 0.0899999999998965 -0.1000000000000666 0
793 0.08999999999990643 -0.09000000000008487 0
794 0.08999999999991631 -0.08000000000010277 0
795 0.08999999999992619 -0.07000000000011963 0
796 0.08999999999993616 -0.06000000000013756 0
797 0.08999999999994604 -0.05000000000015514 0
798 0.08999999999995595 -0.04000000000017229 0
799 0.08999999999996589 -0.03000000000018508 0
800 0.08999999999997579 -0.02000000000020226 0
801 0.08999999999998569 -0.0100000000002197 0
802 0.0899999999999956 -2.34333386028851e-13 0
803 0.09000000000000552 0.009999999999776431 0
804 0.09000000000001544 0.01999999999979236 0
805 0.09000000000002534 0.02999999999980949 0
806 0.09000000000003527 0.03999999999982768 0
807 0.09000000000004518 0.04999999999984482 0
808 0.09000000000005508 0.05999999999986019 0
809 0.09000000000006503 0.06999999999987416 0
810 0.0900000000000749 0.07999999999989243 0
811 0.09000000000008483 0.0899999999999064 0
812 0.09000000000009473 0.09999999999991892 0
813 0.09000000000010466 0.1099999999999341 0
814 0.09000000000011456 0.1199999999999456 0
815 0.09000000000012448 0.1299999999999635 0
816 0.0900000000001344 0.1399999999999807 0
817 0.09999999999987792 -0.14000000000001 0
818 0.09999999999988611 -0.130000000000029 0
819 0.09999999999989434 -0.120000000000038 0
820 0.09999999999990253 -0.1100000000000553 0
821 0.0999999999999107 -0.1000000000000747 0
822 0.09999999999991892 -0.09000000000009477 0
823 0.09999999999992712 -0.08000000000011445 0
824 0.09999999999993535 -0.0700000000001333 0
825 0.09999999999994355 -0.06000000000015299 0
826 0.09999999999995174 -0.05000000000017239 0
827 0.09999999999995995 -0.04000000000019144 0
828 0.09999999999996816 -0.03000000000020596 0
829 0.09999999999997634 -0.02000000000022503 0
830 0.09999999999998452 -0.01000000000024433 0
831 0.09999999999999275 -2.603941368084506e-13 0
832 0.1000000000000009 0.009999999999751773 0
833 0.1000000000000092 0.0199999999997696 0
834 0.1000000000000173 0.02999999999978862 0
835 0.1000000000000256 0.03999999999980855 0
836 0.1000000000000337 0.04999999999982757 0
837 0.1000000000000419 0.05999999999984479 0
838 0.1000000000000501 0.06999999999986052 0
839 0.1000000000000584 0.07999999999988078 0
840 0.1000000000000666 0.0899999999998965 0
841 0.1000000000000747 0.09999999999991076 0
842 0.1000000000000829 0.1099999999999277 0
843 0.1000000000000912 0.1199999999999407 0
844 0.1000000000000994 0.1299999999999601 0
845 0.1000000000001075 0.1399999999999791 0
846 0.1099999999999021 -0.1400000000000115 0
847 0.1099999999999085 -0.1300000000000325 0
848 0.1099999999999149 -0.1200000000000429 0
849 0.1099999999999213 -0.1100000000000617 0
850 0.1099999999999277 -0.1000000000000829 0
851 0.1099999999999341 -0.09000000000010468 0
852 0.1099999999999404 -0.08000000000012618 0
853 0.1099999999999468 -0.07000000000014689 0
854 0.1099999999999532 -0.06000000000016838 0
855 0.1099999999999596 -0.0500000000001896 0
856 0.109999999999966 -0.0400000000002106 0
857 0.1099999999999723 -0.03000000000022682 0
858 0.1099999999999787 -0.0200000000002478 0
859 0.1099999999999851 -0.01000000000026895 0
860 0.1099999999999915 -2.864236625654826e-13 0
861 0.1099999999999979 0.00999999999972717 0
862 0.1100000000000042 0.01999999999974682 0
863 0.1100000000000106 0.02999999999976775 0
864 0.110000000000017 0.03999999999978941 0
865 0.1100000000000234 0.04999999999981034 0
866 0.1100000000000298 0.05999999999982938 0
867 0.1100000000000361 0.06999999999984689 0
868 0.1100000000000425 0.07999999999986906 0
869 0.1100000000000489 0.08999999999988656 0
870 0.1100000000000552 0.09999999999990253 0
871 0.1100000000000617 0.1099999999999213 0
872 0.110000000000068 0.1199999999999359 0
873 0.1100000000000744 0.1299999999999566 0
874 0.1100000000000808 0.1399999999999776 0
875 0.1199999999999213 -0.1400000000000131 0
876 0.1199999999999261 -0.1300000000000359 0
877 0.119999999999931 -0.1200000000000477 0
878 0.1199999999999359 -0.110000000000068 0
879 0.1199999999999407 -0.1000000000000912 0
880 0.1199999999999456 -0.09000000000011459 0
881 0.1199999999999505 -0.08000000000013784 0
882 0.1199999999999554 -0.07000000000016053 0
883 0.1199999999999602 -0.0600000000001838 0
884 0.1199999999999651 -0.05000000000020685 0
885 0.1199999999999699 -0.04000000000022972 0
886 0.1199999999999748 -0.03000000000024768 0
887 0.1199999999999796 -0.02000000000027057 0
888 0.1199999999999845 -0.01000000000029357 0
889 0.1199999999999894 -3.124531883225146e-13 0
890 0.1199999999999943 0.009999999999702537 0
891 0.1199999999999991 0.01999999999972407 0
892 0.120000000000004 0.02999999999974689 0
893 0.1200000000000088 0.03999999999977025 0
894 0.1200000000000137 0.0499999999997931 0
895 0.1200000000000186 0.05999999999981398 0
896 0.1200000000000235 0.06999999999983324 0
897 0.1200000000000283 0.07999999999985738 0
898 0.1200000000000332 0.08999999999987668 0
899 0.120000000000038 0.09999999999989434 0
900 0.1200000000000429 0.1099999999999149 0
901 0.1200000000000478 0.119999999999931 0
902 0.1200000000000526 0.1299999999999532 0
903 0.1200000000000575 0.139999999999976 0
904 0.1299999999999462 -0.1400000000000146 0
905 0.1299999999999497 -0.1300000000000394 0
906 0.1299999999999532 -0.1200000000000526 0
907 0.1299999999999566 -0.1100000000000744 0
908 0.12999999999996 -0.1000000000000994 0
909 0.1299999999999635 -0.09000000000012449 0
910 0.1299999999999669 -0.08000000000014953 0
911 0.1299999999999704 -0.07000000000017419 0
912 0.1299999999999738 -0.06000000000019919 0
913 0.1299999999999772 -0.0500000000002241 0
914 0.1299999999999807 -0.04000000000024886 0
915 0.1299999999999841 -0.03000000000026856 0
916 0.1299999999999877 -0.02000000000029333 0
917 0.1299999999999911 -0.0100000000003182 0
918 0.1299999999999945 -3.384887856117125e-13 0
919 0.129999999999998 0.009999999999677919 0
920 0.1300000000000015 0.01999999999970129 0
921 0.1300000000000049 0.02999999999972602 0
922 0.1300000000000084 0.03999999999975111 0
923 0.1300000000000118 0.04999999999977586 0
924 0.1300000000000152 0.05999999999979855 0
925 0.1300000000000187 0.06999999999981962 0
926 0.1300000000000221 0.07999999999984569 0
927 0.1300000000000256 0.08999999999986674 0
928 0.1300000000000291 0.09999999999988611 0
929 0.1300000000000325 0.1099999999999085 0
930 0.1300000000000359 0.1199999999999262 0
931 0.1300000000000394 0.1299999999999497 0
932 0.1300000000000429 0.1399999999999745 0
933 0.139999999999973 -0.1400000000000162 0
934 0.1399999999999745 -0.1300000000000428 0
935 0.139999999999976 -0.1200000000000575 0
936 0.1399999999999776 -0.1100000000000808 0
937 0.1399999999999791 -0.1000000000001075 0
938 0.1399999999999807 -0.09000000000013442 0
939 0.1399999999999822 -0.08000000000016122 0
940 0.1399999999999838 -0.0700000000001878 0
941 0.1399999999999853 -0.0600000000002146 0
942 0.1399999999999868 -0.05000000000024132 0
943 0.1399999999999884 -0.04000000000026802 0
944 0.13999999999999 -0.03000000000028941 0
945 0.1399999999999915 -0.02000000000031609 0
946 0.139999999999993 -0.01000000000034284 0
947 0.1399999999999945 -3.645438985400151e-13 0
948 0.1399999999999961 0.009999999999653281 0
949 0.1399999999999977 0.01999999999967852 0
950 0.1399999999999992 0.02999999999970514 0
951 0.1400000000000007 0.03999999999973198 0
952 0.1400000000000023 0.04999999999975863 0
953 0.1400000000000038 0.05999999999978314 0
954 0.1400000000000054 0.06999999999980597 0
955 0.140000000000007 0.07999999999983402 0
956 0.1400000000000085 0.08999999999985683 0
957 0.14000000000001 0.09999999999987794 0
958 0.1400000000000115 0.1099999999999021 0
959 0.1400000000000131 0.1199999999999213 0
960 0.1400000000000146 0.1299999999999462 0
961 0.1400000000000162 0.139999999999973 0
$EndNodes
$Elements
1020
1 1 2 2 11 1 5
2 1 2 2 11 5 6
3 1 2 2 11 6 7
4 1 2 2 11 7 8
5 1 2 2 11 8 9
6 1 2 2 11 9 10
7 1 2 2 11 10 11
8 1 2 2 11 11 12
9 1 2 2 11 12 13
10 1 2 2 11 13 14
11 1 2 2 11 14 15
12 1 2 2 11 15 16
13 1 2 2 11 16 17
14 1 2 2 11 17 18
15 1 2 2 11 18 19
16 1 2 2 11 19 20
17 1 2 2 11 20 21
18 1 2 2 11 21 22
19 1 2 2 11 22 23
20 1 2 2 11 23 24
21 1 2 2 11 24 25
22 1 2 2 11 25 26
23 1 2 2 11 26 27
24 1 2 2 11 27 28
25 1 2 2 11 28 29
26 1 2 2 11 29 30
27 1 2 2 11 30 31
28 1 2 2 11 31 32
29 1 2 2 11 32 33
30 1 2 2 11 33 2
31 1 2 2 12 2 34
32 1 2 2 12 34 35
33 1 2 2 12 35 36
34 1 2 2 12 36 37
35 1 2 2 12 37 38
36 1 2 2 12 38 39
37 1 2 2 12 39 40
38 1 2 2 12 40 41
39 1 2 2 12 41 42
40 1 2 2 12 42 43
41 1 2 2 12 43 44
42 1 2 2 12 44 45
43 1 2 2 12 45 46
44 1 2 2 12 46 47
45 1 2 2 12 47 48
46 1 2 2 12 48 49
47 1 2 2 12 49 50
48 1 2 2 12 50 51
49 1 2 2 12 51 52
50 1 2 2 12 52 53
51 1 2 2 12 53 54
52 1 2 2 12 54 55
53 1 2 2 12 55 56
54 1 2 2 12 56 57
55 1 2 2 12 57 58
56 1 2 2 12 58 59
57 1 2 2 12 59 60
58 1 2 2 12 60 61
59 1 2 2 12 61 62
60 1 2 2 12 62 3
61 1 2 2 13 3 63
62 1 2 2 13 63 64
63 1 2 2 13 64 65
64 1 2 2 13 65 66
65 1 2 2 13 66 67
66 1 2 2 13 67 68
67 1 2 2 13 68 69
68 1 2 2 13 69 70
69 1 2 2 13 70 71
70 1 2 2 13 71 72
71 1 2 2 13 72 73
72 1 2 2 13 73 74
73 1 2 2 13 74 75
74 1 2 2 13 75 76
75 1 2 2 13 76 77
76 1 2 2 13 77 78
77 1 2 2 13 78 79
78 1 2 2 13 79 80
79 1 2 2 13 80 81
80 1 2 2 13 81 82
81 1 2 2 13 82 83
82 1 2 2 13 83 84
83 1 2 2 13 84 85
84 1 2 2 13 85 86
85 1 2 2 13 86 87
86 1 2 2 13 87 88
87 1 2 2 13 88 89
88 1 2 2 13 89 90
89 1 2 2 13 90 91
90 1 2 2 13 91 4
91 1 2 2 14 4 92
92 1 2 2 14 92 93
93 1 2 2 14 93 94
94 1 2 2 14 94 95
95 1 2 2 14 95 96
96 1 2 2 14 96 97
97 1 2 2 14 97 98
98 1 2 2 14 98 99
99 1 2 2 14 99 100
100 1 2 2 14 100 101
101 1 2 2 14 101 102
102 1 2 2 14 102 103
103 1 2 2 14 103 104
104 1 2 2 14 104 105
105 1 2 2 14 105 106
106 1 2 2 14 106 107
107 1 2 2 14 107 108
108 1 2 2 14 108 109
109 1 2 2 14 109 110
110 1 2 2 14 110 111
111 1 2 2 14 111 112
112 1 2 2 14 112 113
113 1 2 2 14 113 114
114 1 2 2 14 114 115
115 1 2 2 14 115 116
116 1 2 2 14 116 117
117 1 2 2 14 117 118
118 1 2 2 14 118 119
119 1 2 2 14 119 120
120 1 2 2 14 120 1
121 3 2 1 31 1 5 121 120
122 3 2 1 31 120 121 122 119
123 3 2 1 31 119 122 123 118
124 3 2 1 31 118 123 124 117
125 3 2 1 31 117 124 125 116
126 3 2 1 31 116 125 126 115
127 3 2 1 31 115 126 127 114
128 3 2 1 31 114 127 128 113
129 3 2 1 31 113 128 129 112
130 3 2 1 31 112 129 130 111
131 3 2 1 31 111 130 131 110
132 3 2 1 31 110 131 132 109
133 3 2 1 31 109 132 133 108
134 3 2 1 31 108 133 134 107
135 3 2 1 31 107 134 135 106
136 3 2 1 31 106 135 136 105
137 3 2 1 31 105 136 137 104
138 3 2 1 31 104 137 138 103
139 3 2 1 31 103 138 139 102
140 3 2 1 31 102 139 140 101
141 3 2 1 31 101 140 141 100
142 3 2 1 31 100 141 142 99
143 3 2 1 31 99 142 143 98
144 3 2 1 31 98 143 144 97
145 3 2 1 31 97 144 145 96
146 3 2 1 31 96 145 146 95
147 3 2 1 31 95 146 147 94
148 3 2 1 31 94 147 148 93
149 3 2 1 31 93 148 149 92
150 3 2 1 31 92 149 91 4
151 3 2 1 31 5 6 150 121
152 3 2 1 31 121 150 151 122
153 3 2 1 31 122 151 152 123
154 3 2 1 31 123 152 153 124
155 3 2 1 31 124 153 154 125
156 3 2 1 31 125 154 155 126
157 3 2 1 31 126 155 156 127
158 3 2 1 31 127 156 157 128
159 3 2 1 31 128 157 158 129
160 3 2 1 31 129 158 159 130
161 3 2 1 31 130 159 160 131
162 3 2 1 31 131 160 161 132
163 3 2 1 31 132 161 162 133
164 3 2 1 31 133 162 163 134
165 3 2 1 31 134 163 164 135
166 3 2 1 31 135 164 165 136
167 3 2 1 31 136 165 166 137
168 3 2 1 31 137 166 167 138
169 3 2 1 31 138 167 168 139
170 3 2 1 31 139 168 169 140
171 3 2 1 31 140 169 170 141
172 3 2 1 31 141 170 171 142
173 3 2 1 31 142 171 172 143
174 3 2 1 31 143 172 173 144
175 3 2 1 31 144 173 174 145
176 3 2 1 31 145 174 175 146
177 3 2 1 31 146 175 176 147
178 3 2 1 31 147 176 177 148
179 3 2 1 31 148 177 178 149
180 3 2 1 31 149 178 90 91
181 3 2 1 31 6 7 179 150
182 3 2 1 31 150 179 180 151
183 3 2 1 31 151 180 181 152
184 3 2 1 31 152 181 182 153
185 3 2 1 31 153 182 183 154
186 3 2 1 31 154 183 184 155
187 3 2 1 31 155 184 185 156
188 3 2 1 31 156 185 186 157
189 3 2 1 31 157 186 187 158
190 3 2 1 31 158 187 188 159
191 3 2 1 31 159 188 189 160
192 3 2 1 31 160 189 190 161
193 3 2 1 31 161 190 191 162
194 3 2 1 31 162 191 192 163
195 3 2 1 31 163 192 193 164
196 3 2 1 31 164 193 194 165
197 3 2 1 31 165 194 195 166
198 3 2 1 31 166 195 196 167
199 3 2 1 31 167 196 197 168
200 3 2 1 31 168 197 198 169
201 3 2 1 31 169 198 199 170
202 3 2 1 31 170 199 200 171
203 3 2 1 31 171 200 201 172
204 3 2 1 31 172 201 202 173
205 3 2 1 31 173 202 203 174
206 3 2 1 31 174 203 204 175
207 3 2 1 31 175 204 205 176
208 3 2 1 31 176 205 206 177
209 3 2 1 31 177 206 207 178
210 3 2 1 31 178 207 89 90
211 3 2 1 31 7 8 208 179
212 3 2 1 31 179 208 209 180
213 3 2 1 31 180 209 210 181
214 3 2 1 31 181 210 211 182
215 3 2 1 31 182 211 212 183
216 3 2 1 31 183 212 213 184
217 3 2 1 31 184 213 214 185
218 3 2 1 31 185 214 215 186
219 3 2 1 31 186 215 216 187
220 3 2 1 31 187 216 217 188
221 3 2 1 31 188 217 218 189
222 3 2 1 31 189 218 219 190
223 3 2 1 31 190 219 220 191
224 3 2 1 31 191 220 221 192
225 3 2 1 31 192 221 222 193
226 3 2 1 31 193 222 223 194
227 3 2 1 31 194 223 224 195
228 3 2 1 31 195 224 225 196
229 3 2 1 31 196 225 226 197
230 3 2 1 31 197 226 227 198
231 3 2 1 31 198 227 228 199
232 3 2 1 31 199 228 229 200
233 3 2 1 31 200 229 230 201
234 3 2 1 31 201 230 231 202
235 3 2 1 31 202 231 232 203
236 3 2 1 31 203 232 233 204
237 3 2 1 31 204 233 234 205
238 3 2 1 31 205 234 235 206
239 3 2 1 31 206 235 236 207
240 3 2 1 31 207 236 88 89
241 3 2 1 31 8 9 237 208
242 3 2 1 31 208 237 238 209
243 3 2 1 31 209 238 239 210
244 3 2 1 31 210 239 240 211
245 3 2 1 31 211 240 241 212
246 3 2 1 31 212 241 242 213
247 3 2 1 31 213 242 243 214
248 3 2 1 31 214 243 244 215
249 3 2 1 31 215 244 245 216
250 3 2 1 31 216 245 246 217
251 3 2 1 31 217 246 247 218
252 3 2 1 31 218 247 248 219
253 3 2 1 31 219 248 249 220
254 3 2 1 31 220 249 250 221
255 3 2 1 31 221 250 251 222
256 3 2 1 31 222 251 252 223
257 3 2 1 31 223 252 253 224
258 3 2 1 31 224 253 254 225
259 3 2 1 31 225 254 255 226
260 3 2 1 31 226 255 256 227
261 3 2 1 31 227 256 257 228
262 3 2 1 31 228 257 258 229
263 3 2 1 31 229 258 259 230
264 3 2 1 31 230 259 260 231
265 3 2 1 31 231 260 261 232
266 3 2 1 31 232 261 262 233
267 3 2 1 31 233 262 263 234
268 3 2 1 31 234 263 264 235
269 3 2 1 31 235 264 265 236
270 3 2 1 31 236 265 87 88
271 3 2 1 31 9 10 266 237
272 3 2 1 31 237 266 267 238
273 3 2 1 31 238 267 268 239
274 3 2 1 31 239 268 269 240
275 3 2 1 31 240 269 270 241
276 3 2 1 31 241 270 271 242
277 3 2 1 31 242 271 272 243
278 3 2 1 31 243 272 273 244
279 3 2 1 31 244 273 274 245
280 3 2 1 31 245 274 275 246
281 3 2 1 31 246 275 276 247
282 3 2 1 31 247 276 277 248
283 3 2 1 31 248 277 278 249
284 3 2 1 31 249 278 279 250
285 3 2 1 31 250 279 280 251
286 3 2 1 31 251 280 281 252
287 3 2 1 31 252 281 282 253
288 3 2 1 31 253 282 283 254
289 3 2 1 31 254 283 284 255
290 3 2 1 31 255 284 285 256
291 3 2 1 31 256 285 286 257
292 3 2 1 31 257 286 287 258
293 3 2 1 31 258 287 288 259
294 3 2 1 31 259 288 289 260
295 3 2 1 31 260 289 290 261
296 3 2 1 31 261 290 291 262
297 3 2 1 31 262 291 292 263
298 3 2 1 31 263 292 293 264
299 3 2 1 31 264 293 294 265
300 3 2 1 31 265 294 86 87
301 3 2 1 31 10 11 295 266
302 3 2 1 31 266 295 296 267
303 3 2 1 31 267 296 297 268
304 3 2 1 31 268 297 298 269
305 3 2 1 31 269 298 299 270
306 3 2 1 31 270 299 300 271
307 3 2 1 31 271 300 301 272
308 3 2 1 31 272 301 302 273
309 3 2 1 31 273 302 303 274
310 3 2 1 31 274 303 304 275
311 3 2 1 31 275 304 305 276
312 3 2 1 31 276 305 306 277
313 3 2 1 31 277 306 307 278
314 3 2 1 31 278 307 308 279
315 3 2 1 31 279 308 309 280
316 3 2 1 31 280 309 310 281
317 3 2 1 31 281 310 311 282
318 3 2 1 31 282 311 312 283
319 3 2 1 31 283 312 313 284
320 3 2 1 31 284 313 314 285
321 3 2 1 31 285 314 315 286
322 3 2 1 31 286 315 316 287
323 3 2 1 31 287 316 317 288
324 3 2 1 31 288 317 318 289
325 3 2 1 31 289 318 319 290
326 3 2 1 31 290 319 320 291
327 3 2 1 31 291 320 321 292
328 3 2 1 31 292 321 322 293
329 3 2 1 31 293 322 323 294
330 3 2 1 31 294 323 85 86
331 3 2 1 31 11 12 324 295
332 3 2 1 31 295 324 325 296
333 3 2 1 31 296 325 326 297
334 3 2 1 31 297 326 327 298
335 3 2 1 31 298 327 328 299
336 3 2 1 31 299 328 329 300
337 3 2 1 31 300 329 330 301
338 3 2 1 31 301 330 331 302
339 3 2 1 31 302 331 332 303
340 3 2 1 31 303 332 333 304
341 3 2 1 31 304 333 334 305
342 3 2 1 31 305 334 335 306
343 3 2 1 31 306 335 336 307
344 3 2 1 31 307 336 337 308
345 3 2 1 31 308 337 338 309
346 3 2 1 31 309 338 339 310
347 3 2 1 31 310 339 340 311
348 3 2 1 31 311 340 341 312
349 3 2 1 31 312 341 342 313
350 3 2 1 31 313 342 343 314
351 3 2 1 31 314 343 344 315
352 3 2 1 31 315 344 345 316
353 3 2 1 31 316 345 346 317
354 3 2 1 31 317 346 347 318
355 3 2 1 31 318 347 348 319
356 3 2 1 31 319 348 349 320
357 3 2 1 31 320 349 350 321
358 3 2 1 31 321 350 351 322
359 3 2 1 31 322 351 352 323
360 3 2 1 31 323 352 84 85
361 3 2 1 31 12 13 353 324
362 3 2 1 31 324 353 354 325
363 3 2 1 31 325 354 355 326
364 3 2 1 31 326 355 356 327
365 3 2 1 31 327 356 357 328
366 3 2 1 31 328 357 358 329
367 3 2 1 31 329 358 359 330
368 3 2 1 31 330 359 360 331
369 3 2 1 31 331 360 361 332
370 3 2 1 31 332 361 362 333
371 3 2 1 31 333 362 363 334
372 3 2 1 31 334 363 364 335
373 3 2 1 31 335 364 365 336
374 3 2 1 31 336 365 366 337
375 3 2 1 31 337 366 367 338
376 3 2 1 31 338 367 368 339
377 3 2 1 31 339 368 369 340
378 3 2 1 31 340 369 370 341
379 3 2 1 31 341 370 371 342
380 3 2 1 31 342 371 372 343
381 3 2 1 31 343 372 373 344
382 3 2 1 31 344 373 374 345
383 3 2 1 31 345 374 375 346
384 3 2 1 31 346 375 376 347
385 3 2 1 31 347 376 377 348
386 3 2 1 31 348 377 378 349
387 3 2 1 31 349 378 379 350
388 3 2 1 31 350 379 380 351
389 3 2 1 31 351 380 381 352
390 3 2 1 31 352 381 83 84
391 3 2 1 31 13 14 382 353
392 3 2 1 31 353 382 383 354
393 3 2 1 31 354 383 384 355
394 3 2 1 31 355 384 385 356
395 3 2 1 31 356 385 386 357
396 3 2 1 31 357 386 387 358
397 3 2 1 31 358 387 388 359
398 3 2 1 31 359 388 389 360
399 3 2 1 31 360 389 390 361
400 3 2 1 31 361 390 391 362
401 3 2 1 31 362 391 392 363
402 3 2 1 31 363 392 393 364
403 3 2 1 31 364 393 394 365
404 3 2 1 31 365 394 395 366
405 3 2 1 31 366 395 396 367
406 3 2 1 31 367 396 397 368
407 3 2 1 31 368 397 398 369
408 3 2 1 31 369 398 399 370
409 3 2 1 31 370 399 400 371
410 3 2 1 31 371 400 401 372
411 3 2 1 31 372 401 402 373
412 3 2 1 31 373 402 403 374
413 3 2 1 31 374 403 404 375
414 3 2 1 31 375 404 405 376
415 3 2 1 31 376 405 406 377
416 3 2 1 31 377 406 407 378
417 3 2 1 31 378 407 408 379
418 3 2 1 31 379 408 409 380
419 3 2 1 31 380 409 410 381
420 3 2 1 31 381 410 82 83
421 3 2 1 31 14 15 411 382
422 3 2 1 31 382 411 412 383
423 3 2 1 31 383 412 413 384
424 3 2 1 31 384 413 414 385
425 3 2 1 31 385 414 415 386
426 3 2 1 31 386 415 416 387
427 3 2 1 31 387 416 417 388
428 3 2 1 31 388 417 418 389
429 3 2 1 31 389 418 419 390
430 3 2 1 31 390 419 420 391
431 3 2 1 31 391 420 421 392
432 3 2 1 31 392 421 422 393
433 3 2 1 31 393 422 423 394
434 3 2 1 31 394 423 424 395
435 3 2 1 31 395 424 425 396
436 3 2 1 31 396 425 426 397
437 3 2 1 31 397 426 427 398
438 3 2 1 31 398 427 428 399
439 3 2 1 31 399 428 429 400
440 3 2 1 31 400 429 430 401
441 3 2 1 31 401 430 431 402
442 3 2 1 31 402 431 432 403
443 3 2 1 31 403 432 433 404
444 3 2 1 31 404 433 434 405
445 3 2 1 31 405 434 435 406
446 3 2 1 31 406 435 436 407
447 3 2 1 31 407 436 437 408
448 3 2 1 31 408 437 438 409
449 3 2 1 31 409 438 439 410
450 3 2 1 31 410 439 81 82
451 3 2 1 31 15 16 440 411
452 3 2 1 31 411 440 441 412
453 3 2 1 31 412 441 442 413
454 3 2 1 31 413 442 443 414
455 3 2 1 31 414 443 444 415
456 3 2 1 31 415 444 445 416
457 3 2 1 31 416 445 446 417
458 3 2 1 31 417 446 447 418
459 3 2 1 31 418 447 448 419
460 3 2 1 31 419 448 449 420
461 3 2 1 31 420 449 450 421
462 3 2 1 31 421 450 451 422
463 3 2 1 31 422 451 452 423
464 3 2 1 31 423 452 453 424
465 3 2 1 31 424 453 454 425
466 3 2 1 31 425 454 455 426
467 3 2 1 31 426 455 456 427
468 3 2 1 31 427 456 457 428
469 3 2 1 31 428 457 458 429
470 3 2 1 31 429 458 459 430
471 3 2 1 31 430 459 460 431
472 3 2 1 31 431 460 461 432
473 3 2 1 31 432 461 462 433
474 3 2 1 31 433 462 463 434
475 3 2 1 31 434 463 464 435
476 3 2 1 31 435 464 465 436
477 3 2 1 31 436 465 466 437
478 3 2 1 31 437 466 467 438
479 3 2 1 31 438 467 468 439
480 3 2 1 31 439 468 80 81
481 3 2 1 31 16 17 469 440
482 3 2 1 31 440 469 470 441
483 3 2 1 31 441 470 471 442
484 3 2 1 31 442 471 472 443
485 3 2 1 31 443 472 473 444
486 3 2 1 31 444 473 474 445
487 3 2 1 31 445 474 475 446
488 3 2 1 31 446 475 476 447
489 3 2 1 31 447 476 477 448
490 3 2 1 31 448 477 478 449
491 3 2 1 31 449 478 479 450
492 3 2 1 31 450 479 480 451
493 3 2 1 31 451 480 481 452
494 3 2 1 31 452 481 482 453
495 3 2 1 31 453 482 483 454
496 3 2 1 31 454 483 484 455
497 3 2 1 31 455 484 485 456
498 3 2 1 31 456 485 486 457
499 3 2 1 31 457 486 487 458
500 3 2 1 31 458 487 488 459
501 3 2 1 31 459 488 489 460
502 3 2 1 31 460 489 490 461
503 3 2 1 31 461 490 491 462
504 3 2 1 31 462 491 492 463
505 3 2 1 31 463 492 493 464
506 3 2 1 31 464 493 494 465
507 3 2 1 31 465 494 495 466
508 3 2 1 31 466 495 496 467
509 3 2 1 31 467 496 497 468
510 3 2 1 31 468 497 79 80
511 3 2 1 31 17 18 498 469
512 3 2 1 31 469 498 499 470
513 3 2 1 31 470 499 500 471
514 3 2 1 31 471 500 501 472
515 3 2 1 31 472 501 502 473
516 3 2 1 31 473 502 503 474
517 3 2 1 31 474 503 504 475
518 3 2 1 31 475 504 505 476
519 3 2 1 31 476 505 506 477
520 3 2 1 31 477 506 507 478
521 3 2 1 31 478 507 508 479
522 3 2 1 31 479 508 509 480
523 3 2 1 31 480 509 510 481
524 3 2 1 31 481 510 511 482
525 3 2 1 31 482 511 512 483
526 3 2 1 31 483 512 513 484
527 3 2 1 31 484 513 514 485
528 3 2 1 31 485 514 515 486
529 3 2 1 31 486 515 516 487
530 3 2 1 31 487 516 517 488
531 3 2 1 31 488 517 518 489
532 3 2 1 31 489 518 519 490
533 3 2 1 31 490 519 520 491
534 3 2 1 31 491 520 521 492
535 3 2 1 31 492 521 522 493
536 3 2 1 31 493 522 523 494
537 3 2 1 31 494 523 524 495
538 3 2 1 31 495 524 525 496
539 3 2 1 31 496 525 526 497
540 3 2 1 31 497 526 78 79
541 3 2 1 31 18 19 527 498
542 3 2 1 31 498 527 528 499
543 3 2 1 31 499 528 529 500
544 3 2 1 31 500 529 530 501
545 3 2 1 31 501 530 531 502
546 3 2 1 31 502 531 532 503
547 3 2 1 31 503 532 533 504
548 3 2 1 31 504 533 534 505
549 3 2 1 31 505 534 535 506
550 3 2 1 31 506 535 536 507
551 3 2 1 31 507 536 537 508
552 3 2 1 31 508 537 538 509
553 3 2 1 31 509 538 539 510
554 3 2 1 31 510 539 540 511
555 3 2 1 31 511 540 541 512
556 3 2 1 31 512 541 542 513
557 3 2 1 31 513 542 543 514
558 3 2 1 31 514 543 544 515
559 3 2 1 31 515 544 545 516
560 3 2 1 31 516 545 546 517
561 3 2 1 31 517 546 547 518
562 3 2 1 31 518 547 548 519
563 3 2 1 31 519 548 549 520
564 3 2 1 31 520 549 550 521
565 3 2 1 31 521 550 551 522
566 3 2 1 31 522 551 552 523
567 3 2 1 31 523 552 553 524
568 3 2 1 31 524 553 554 525
569 3 2 1 31 525 554 555 526
570 3 2 1 31 526 555 77 78
571 3 2 1 31 19 20 556 527
572 3 2 1 31 527 556 557 528
573 3 2 1 31 528 557 558 529
574 3 2 1 31 529 558 559 530
575 3 2 1 31 530 559 560 531
576 3 2 1 31 531 560 561 532
577 3 2 1 31 532 561 562 533
578 3 2 1 31 533 562 563 534
579 3 2 1 31 534 563 564 535
580 3 2 1 31 535 564 565 536
581 3 2 1 31 536 565 566 537
582 3 2 1 31 537 566 567 538
583 3 2 1 31 538 567 568 539
584 3 2 1 31 539 568 569 540
585 3 2 1 31 540 569 570 541
586 3 2 1 31 541 570 571 542
587 3 2 1 31 542 571 572 543
588 3 2 1 31 543 572 573 544
589 3 2 1 31 544 573 574 545
590 3 2 1 31 545 574 575 546
591 3 2 1 31 546 575 576 547
592 3 2 1 31 547 576 577 548
593 3 2 1 31 548 577 578 549
594 3 2 1 31 549 578 579 550
595 3 2 1 31 550 579 580 551
596 3 2 1 31 551 580 581 552
597 3 2 1 31 552 581 582 553
598 3 2 1 31 553 582 583 554
599 3 2 1 31 554 583 584 555
600 3 2 1 31 555 584 76 77
601 3 2 1 31 20 21 585 556
602 3 2 1 31 556 585 586 557
603 3 2 1 31 557 586 587 558
604 3 2 1 31 558 587 588 559
605 3 2 1 31 559 588 589 560
606 3 2 1 31 560 589 590 561
607 3 2 1 31 561 590 591 562
608 3 2 1 31 562 591 592 563
609 3 2 1 31 563 592 593 564
610 3 2 1 31 564 593 594 565
611 3 2 1 31 565 594 595 566
612 3 2 1 31 566 595 596 567
613 3 2 1 31 567 596 597 568
614 3 2 1 31 568 597 598 569
615 3 2 1 31 569 598 599 570
616 3 2 1 31 570 599 600 571
617 3 2 1 31 571 600 601 572
618 3 2 1 31 572 601 602 573
619 3 2 1 31 573 602 603 574
620 3 2 1 31 574 603 604 575
621 3 2 1 31 575 604 605 576
622 3 2 1 31 576 605 606 577
623 3 2 1 31 577 606 607 578
624 3 2 1 31 578 607 608 579
625 3 2 1 31 579 608 609 580
626 3 2 1 31 580 609 610 581
627 3 2 1 31 581 610 611 582
628 3 2 1 31 582 611 612 583
629 3 2 1 31 583 612 613 584
630 3 2 1 31 584 613 75 76
631 3 2 1 31 21 22 614 585
632 3 2 1 31 585 614 615 586
633 3 2 1 31 586 615 616 587
634 3 2 1 31 587 616 617 588
635 3 2 1 31 588 617 618 589
636 3 2 1 31 589 618 619 590
637 3 2 1 31 590 619 620 591
638 3 2 1 31 591 620 621 592
639 3 2 1 31 592 621 622 593
640 3 2 1 31 593 622 623 594
641 3 2 1 31 594 623 624 595
642 3 2 1 31 595 624 625 596
643 3 2 1 31 596 625 626 597
644 3 2 1 31 597 626 627 598
645 3 2 1 31 598 627 628 599
646 3 2 1 31 599 628 629 600
647 3 2 1 31 600 629 630 601
648 3 2 1 31 601 630 631 602
649 3 2 1 31 602 631 632 603
650 3 2 1 31 603 632 633 604
651 3 2 1 31 604 633 634 605
652 3 2 1 31 605 634 635 606
653 3 2 1 31 606 635 636 607
654 3 2 1 31 607 636 637 608
655 3 2 1 31 608 637 638 609
656 3 2 1 31 609 638 639 610
657 3 2 1 31 610 639 640 611
658 3 2 1 31 611 640 641 612
659 3 2 1 31 612 641 642 613
660 3 2 1 31 613 642 74 75
661 3 2 1 31 22 23 643 614
662 3 2 1 31 614 643 644 615
663 3 2 1 31 615 644 645 616
664 3 2 1 31 616 645 646 617
665 3 2 1 31 617 646 647 618
666 3 2 1 31 618 647 648 619
667 3 2 1 31 619 648 649 620
668 3 2 1 31 620 649 650 621
669 3 2 1 31 621 650 651 622
670 3 2 1 31 622 651 652 623
671 3 2 1 31 623 652 653 624
672 3 2 1 31 624 653 654 625
673 3 2 1 31 625 654 655 626
674 3 2 1 31 626 655 656 627
675 3 2 1 31 627 656 657 628
676 3 2 1 31 628 657 658 629
677 3 2 1 31 629 658 659 630
678 3 2 1 31 630 659 660 631
679 3 2 1 31 631 660 661 632
680 3 2 1 31 632 661 662 633
681 3 2 1 31 633 662 663 634
682 3 2 1 31 634 663 664 635
683 3 2 1 31 635 664 665 636
684 3 2 1 31 636 665 666 637
685 3 2 1 31 637 666 667 638
686 3 2 1 31 638 667 668 639
687 3 2 1 31 639 668 669 640
688 3 2 1 31 640 669 670 641
689 3 2 1 31 641 670 671 642
690 3 2 1 31 642 671 73 74
691 3 2 1 31 23 24 672 643
692 3 2 1 31 643 672 673 644
693 3 2 1 31 644 673 674 645
694 3 2 1 31 645 674 675 646
695 3 2 1 31 646 675 676 647
696 3 2 1 31 647 676 677 648
697 3 2 1 31 648 677 678 649
698 3 2 1 31 649 678 679 650
699 3 2 1 31 650 679 680 651
700 3 2 1 31 651 680 681 652
701 3 2 1 31 652 681 682 653
702 3 2 1 31 653 682 683 654
703 3 2 1 31 654 683 684 655
704 3 2 1 31 655 684 685 656
705 3 2 1 31 656 685 686 657
706 3 2 1 31 657 686 687 658
707 3 2 1 31 658 687 688 659
708 3 2 1 31 659 688 689 660
709 3 2 1 31 660 689 690 661
710 3 2 1 31 661 690 691 662
711 3 2 1 31 662 691 692 663
712 3 2 1 31 663 692 693 664
713 3 2 1 31 664 693 694 665
714 3 2 1 31 665 694 695 666
715 3 2 1 31 666 695 696 667
716 3 2 1 31 667 696 697 668
717 3 2 1 31 668 697 698 669
718 3 2 1 31 669 698 699 670
719 3 2 1 31 670 699 700 671
720 3 2 1 31 671 700 72 73
721 3 2 1 31 24 25 701 672
722 3 2 1 31 672 701 702 673
723 3 2 1 31 673 702 703 674
724 3 2 1 31 674 703 704 675
725 3 2 1 31 675 704 705 676
726 3 2 1 31 676 705 706 677
727 3 2 1 31 677 706 707 678
728 3 2 1 31 678 707 708 679
729 3 2 1 31 679 708 709 680
730 3 2 1 31 680 709 710 681
731 3 2 1 31 681 710 711 682
732 3 2 1 31 682 711 712 683
733 3 2 1 31 683 712 713 684
734 3 2 1 31 684 713 714 685
735 3 2 1 31 685 714 715 686
736 3 2 1 31 686 715 716 687
737 3 2 1 31 687 716 717 688
738 3 2 1 31 688 717 718 689
739 3 2 1 31 689 718 719 690
740 3 2 1 31 690 719 720 691
741 3 2 1 31 691 720 721 692
742 3 2 1 31 692 721 722 693
743 3 2 1 31 693 722 723 694
744 3 2 1 31 694 723 724 695
745 3 2 1 31 695 724 725 696
746 3 2 1 31 696 725 726 697
747 3 2 1 31 697 726 727 698
748 3 2 1 31 698 727 728 699
749 3 2 1 31 699 728 729 700
750 3 2 1 31 700 729 71 72
751 3 2 1 31 25 26 730 701
752 3 2 1 31 701 730 731 702
753 3 2 1 31 702 731 732 703
754 3 2 1 31 703 732 733 704
755 3 2 1 31 704 733 734 705
756 3 2 1 31 705 734 735 706
757 3 2 1 31 706 735 736 707
758 3 2 1 31 707 736 737 708
759 3 2 1 31 708 737 738 709
760 3 2 1 31 709 738 739 710
761 3 2 1 31 710 739 740 711
762 3 2 1 31 711 740 741 712
763 3 2 1 31 712 741 742 713
764 3 2 1 31 713 742 743 714
765 3 2 1 31 714 743 744 715
766 3 2 1 31 715 744 745 716
767 3 2 1 31 716 745 746 717
768 3 2 1 31 717 746 747 718
769 3 2 1 31 718 747 748 719
770 3 2 1 31 719 748 749 720
771 3 2 1 31 720 749 750 721
772 3 2 1 31 721 750 751 722
773 3 2 1 31 722 751 752 723
774 3 2 1 31 723 752 753 724
775 3 2 1 31 724 753 754 725
776 3 2 1 31 725 754 755 726
777 3 2 1 31 726 755 756 727
778 3 2 1 31 727 756 757 728
779 3 2 1 31 728 757 758 729
780 3 2 1 31 729 758 70 71
781 3 2 1 31 26 27 759 730
782 3 2 1 31 730 759 760 731
783 3 2 1 31 731 760 761 732
784 3 2 1 31 732 761 762 733
785 3 2 1 31 733 762 763 734
786 3 2 1 31 734 763 764 735
787 3 2 1 31 735 764 765 736
788 3 2 1 31 736 765 766 737
789 3 2 1 31 737 766 767 738
790 3 2 1 31 738 767 768 739
791 3 2 1 31 739 768 769 740
792 3 2 1 31 740 769 770 741
793 3 2 1 31 741 770 771 742
794 3 2 1 31 742 771 772 743
795 3 2 1 31 743 772 773 744
796 3 2 1 31 744 773 774 745
797 3 2 1 31 745 774 775 746
798 3 2 1 31 746 775 776 747
799 3 2 1 31 747 776 777 748
800 3 2 1 31 748 777 778 749
801 3 2 1 31 749 778 779 750
802 3 2 1 31 750 779 780 751
803 3 2 1 31 751 780 781 752
804 3 2 1 31 752 781 782 753
805 3 2 1 31 753 782 783 754
806 3 2 1 31 754 783 784 755
807 3 2 1 31 755 784 785 756
808 3 2 1 31 756 785 786 757
809 3 2 1 31 757 786 787 758
810 3 2 1 31 758 787 69 70
811 3 2 1 31 27 28 788 759
812 3 2 1 31 759 788 789 760
813 3 2 1 31 760 789 790 761
814 3 2 1 31 761 790 791 762
815 3 2 1 31 762 791 792 763
816 3 2 1 31 763 792 793 764
817 3 2 1 31 764 793 794 765
818 3 2 1 31 765 794 795 766
819 3 2 1 31 766 795 796 767
820 3 2 1 31 767 796 797 768
821 3 2 1 31 768 797 798 769
822 3 2 1 31 769 798 799 770
823 3 2 1 31 770 799 800 771
824 3 2 1 31 771 800 801 772
825 3 2 1 31 772 801 802 773
826 3 2 1 31 773 802 803 774
827 3 2 1 31 774 803 804 775
828 3 2 1 31 775 804 805 776
829 3 2 1 31 776 805 806 777
830 3 2 1 31 777 806 807 778
831 3 2 1 31 778 807 808 779
832 3 2 1 31 779 808 809 780
833 3 2 1 31 780 809 810 781
834 3 2 1 31 781 810 811 782
835 3 2 1 31 782 811 812 783
836 3 2 1 31 783 812 813 784
837 3 2 1 31 784 813 814 785
838 3 2 1 31 785 814 815 786
839 3 2 1 31 786 815 816 787
840 3 2 1 31 787 816 68 69
841 3 2 1 31 28 29 817 788
842 3 2 1 31 788 817 818 789
843 3 2 1 31 789 818 819 790
844 3 2 1 31 790 819 820 791
845 3 2 1 31 791 820 821 792
846 3 2 1 31 792 821 822 793
847 3 2 1 31 793 822 823 794
848 3 2 1 31 794 823 824 795
849 3 2 1 31 795 824 825 796
850 3 2 1 31 796 825 826 797
851 3 2 1 31 797 826 827 798
852 3 2 1 31 798 827 828 799
853 3 2 1 31 799 828 829 800
854 3 2 1 31 800 829 830 801
855 3 2 1 31 801 830 831 802
856 3 2 1 31 802 831 832 803
857 3 2 1 31 803 832 833 804
858 3 2 1 31 804 833 834 805
859 3 2 1 31 805 834 835 806
860 3 2 1 31 806 835 836 807
861 3 2 1 31 807 836 837 808
862 3 2 1 31 808 837 838 809
863 3 2 1 31 809 838 839 810
864 3 2 1 31 810 839 840 811
865 3 2 1 31 811 840 841 812
866 3 2 1 31 812 841 842 813
867 3 2 1 31 813 842 843 814
868 3 2 1 31 814 843 844 815
869 3 2 1 31 815 844 845 816
870 3 2 1 31 816 845 67 68
871 3 2 1 31 29 30 846 817
872 3 2 1 31 817 846 847 818
873 3 2 1 31 818 847 848 819
874 3 2 1 31 819 848 849 820
875 3 2 1 31 820 849 850 821
876 3 2 1 31 821 850 851 822
877 3 2 1 31 822 851 852 823
878 3 2 1 31 823 852 853 824
879 3 2 1 31 824 853 854 825
880 3 2 1 31 825 854 855 826
881 3 2 1 31 826 855 856 827
882 3 2 1 31 827 856 857 828
883 3 2 1 31 828 857 858 829
884 3 2 1 31 829 858 859 830
885 3 2 1 31 830 859 860 831
886 3 2 1 31 831 860 861 832
887 3 2 1 31 832 861 862 833
888 3 2 1 31 833 862 863 834
889 3 2 1 31 834 863 864 835
890 3 2 1 31 835 864 865 836
891 3 2 1 31 836 865 866 837
892 3 2 1 31 837 866 867 838
893 3 2 1 31 838 867 868 839
894 3 2 1 31 839 868 869 840
895 3 2 1 31 840 869 870 841
896 3 2 1 31 841 870 871 842
897 3 2 1 31 842 871 872 843
898 3 2 1 31 843 872 873 844
899 3 2 1 31 844 873 874 845
900 3 2 1 31 845 874 66 67
901 3 2 1 31 30 31 875 846
902 3 2 1 31 846 875 876 847
903 3 2 1 31 847 876 877 848
904 3 2 1 31 848 877 878 849
905 3 2 1 31 849 878 879 850
906 3 2 1 31 850 879 880 851
907 3 2 1 31 851 880 881 852
908 3 2 1 31 852 881 882 853
909 3 2 1 31 853 882 883 854
910 3 2 1 31 854 883 884 855
911 3 2 1 31 855 884 885 856
912 3 2 1 31 856 885 886 857
913 3 2 1 31 857 886 887 858
914 3 2 1 31 858 887 888 859
915 3 2 1 31 859 888 889 860
916 3 2 1 31 860 889 890 861
917 3 2 1 31 861 890 891 862
918 3 2 1 31 862 891 892 863
919 3 2 1 31 863 892 893 864
920 3 2 1 31 864 893 894 865
921 3 2 1 31 865 894 895 866
922 3 2 1 31 866 895 896 867
923 3 2 1 31 867 896 897 868
924 3 2 1 31 868 897 898 869
925 3 2 1 31 869 898 899 870
926 3 2 1 31 870 899 900 871
927 3 2 1 31 871 900 901 872
928 3 2 1 31 872 901 902 873
929 3 2 1 31 873 902 903 874
930 3 2 1 31 874 903 65 66
931 3 2 1 31 31 32 904 875
932 3 2 1 31 875 904 905 876
933 3 2 1 31 876 905 906 877
934 3 2 1 31 877 906 907 878
935 3 2 1 31 878 907 908 879
936 3 2 1 31 879 908 909 880
937 3 2 1 31 880 909 910 881
938 3 2 1 31 881 910 911 882
939 3 2 1 31 882 911 912 883
940 3 2 1 31 883 912 913 884
941 3 2 1 31 884 913 914 885
942 3 2 1 31 885 914 915 886
943 3 2 1 31 886 915 916 887
944 3 2 1 31 887 916 917 888
945 3 2 1 31 888 917 918 889
946 3 2 1 31 889 918 919 890
947 3 2 1 31 890 919 920 891
948 3 2 1 31 891 920 921 892
949 3 2 1 31 892 921 922 893
950 3 2 1 31 893 922 923 894
951 3 2 1 31 894 923 924 895
952 3 2 1 31 895 924 925 896
953 3 2 1 31 896 925 926 897
954 3 2 1 31 897 926 927 898
955 3 2 1 31 898 927 928 899
956 3 2 1 31 899 928 929 900
957 3 2 1 31 900 929 930 901
958 3 2 1 31 901 930 931 902
959 3 2 1 31 902 931 932 903
960 3 2 1 31 903 932 64 65
961 3 2 1 31 32 33 933 904
962 3 2 1 31 904 933 934 905
963 3 2 1 31 905 934 935 906
964 3 2 1 31 906 935 936 907
965 3 2 1 31 907 936 937 908
966 3 2 1 31 908 937 938 909
967 3 2 1 31 909 938 939 910
968 3 2 1 31 910 939 940 911
969 3 2 1 31 911 940 941 912
970 3 2 1 31 912 941 942 913
971 3 2 1 31 913 942 943 914
972 3 2 1 31 914 943 944 915
973 3 2 1 31 915 944 945 916
974 3 2 1 31 916 945 946 917
975 3 2 1 31 917 946 947 918
976 3 2 1 31 918 947 948 919
977 3 2 1 31 919 948 949 920
978 3 2 1 31 920 949 950 921
979 3 2 1 31 921 950 951 922
980 3 2 1 31 922 951 952 923
981 3 2 1 31 923 952 953 924
982 3 2 1 31 924 953 954 925
983 3 2 1 31 925 954 955 926
984 3 2 1 31 926 955 956 927
985 3 2 1 31 927 956 957 928
986 3 2 1 31 928 957 958 929
987 3 2 1 31 929 958 959 930
988 3 2 1 31 930 959 960 931
989 3 2 1 31 931 960 961 932
990 3 2 1 31 932 961 63 64
991 3 2 1 31 33 2 34 933
992 3 2 1 31 933 34 35 934
993 3 2 1 31 934 35 36 935
994 3 2 1 31 935 36 37 936
995 3 2 1 31 936 37 38 937
996 3 2 1 31 937 38 39 938
997 3 2 1 31 938 39 40 939
998 3 2 1 31 939 40 41 940
999 3 2 1 31 940 41 42 941
1000 3 2 1 31 941 42 43 942
1001 3 2 1 31 942 43 44 943
1002 3 2 1 31 943 44 45 944
1003 3 2 1 31 944 45 46 945
1004 3 2 1 31 945 46 47 946
1005 3 2 1 31 946 47 48 947
1006 3 2 1 31 947 48 49 948
1007 3 2 1 31 948 49 50 949
1008 3 2 1 31 949 50 51 950
1009 3 2 1 31 950 51 52 951
1010 3 2 1 31 951 52 53 952
1011 3 2 1 31 952 53 54 953
1012 3 2 1 31 953 54 55 954
1013 3 2 1 31 954 55 56 955
1014 3 2 1 31 955 56 57 956
1015 3 2 1 31 956 57 58 957
1016 3 2 1 31 957 58 59 958
1017 3 2 1 31 958 59 60 959
1018 3 2 1 31 959 60 61 960
1019 3 2 1 31 960 61 62 961
1020 3 2 1 31 961 62 3 63
$EndElements
