[Info]
Version 1
Dimension 2
NumNodes 231
Num3DElements 0
Num2DElements 200
Num1DElements 0
NumNodeBC 4
NumSaveNodes 0
NumSaveElements 0
Num 2d-line      : 0
Num 2d-line,quad : 0
Num 3d-line      : 0
Num 3d-line,quad : 0
Num triangle     : 0
Num triangle,quad: 0
Num quadr        : 200
Num quadr,quad   : 0
Num tetra        : 0
Num tetra,quad   : 0
Num brick        : 0
Num brick,quad   : 0
Num pyramid      : 0
Num pyramid,quad : 0
Num wedge        : 0
Num wedge,quad   : 0

[Nodes]
#NodeNr x-coord y-coord z-coord
       1  2.0000000000000e+00  0.0000000000000e+00  0.0000000000000e+00 
       2  2.0000000000000e+00  1.0000000000000e-01  0.0000000000000e+00 
       3  1.9000000000000e+00  0.0000000000000e+00  0.0000000000000e+00 
       4  1.9000000000000e+00  1.0000000000000e-01  0.0000000000000e+00 
       5  1.8000000000000e+00  0.0000000000000e+00  0.0000000000000e+00 
       6  2.0000000000000e+00  2.0000000000000e-01  0.0000000000000e+00 
       7  1.8000000000000e+00  1.0000000000000e-01  0.0000000000000e+00 
       8  1.9000000000000e+00  2.0000000000000e-01  0.0000000000000e+00 
       9  1.8000000000000e+00  2.0000000000000e-01  0.0000000000000e+00 
      10  2.0000000000000e+00  3.0000000000000e-01  0.0000000000000e+00 
      11  1.7000000000000e+00  0.0000000000000e+00  0.0000000000000e+00 
      12  1.7000000000000e+00  1.0000000000000e-01  0.0000000000000e+00 
      13  1.9000000000000e+00  3.0000000000000e-01  0.0000000000000e+00 
      14  1.7000000000000e+00  2.0000000000000e-01  0.0000000000000e+00 
      15  1.8000000000000e+00  3.0000000000000e-01  0.0000000000000e+00 
      16  1.6000000000000e+00  0.0000000000000e+00  0.0000000000000e+00 
      17  2.0000000000000e+00  4.0000000000000e-01  0.0000000000000e+00 
      18  1.9000000000000e+00  4.0000000000000e-01  0.0000000000000e+00 
      19  1.6000000000000e+00  1.0000000000000e-01  0.0000000000000e+00 
      20  1.7000000000000e+00  3.0000000000000e-01  0.0000000000000e+00 
      21  1.6000000000000e+00  2.0000000000000e-01  0.0000000000000e+00 
      22  1.8000000000000e+00  4.0000000000000e-01  0.0000000000000e+00 
      23  1.6000000000000e+00  3.0000000000000e-01  0.0000000000000e+00 
      24  1.5000000000000e+00  0.0000000000000e+00  0.0000000000000e+00 
      25  2.0000000000000e+00  5.0000000000000e-01  0.0000000000000e+00 
      26  1.7000000000000e+00  4.0000000000000e-01  0.0000000000000e+00 
      27  1.5000000000000e+00  1.0000000000000e-01  0.0000000000000e+00 
      28  1.9000000000000e+00  5.0000000000000e-01  0.0000000000000e+00 
      29  1.5000000000000e+00  2.0000000000000e-01  0.0000000000000e+00 
      30  1.8000000000000e+00  5.0000000000000e-01  0.0000000000000e+00 
      31  1.6000000000000e+00  4.0000000000000e-01  0.0000000000000e+00 
      32  1.5000000000000e+00  3.0000000000000e-01  0.0000000000000e+00 
      33  1.7000000000000e+00  5.0000000000000e-01  0.0000000000000e+00 
      34  2.0000000000000e+00  6.0000000000000e-01  0.0000000000000e+00 
      35  1.4000000000000e+00  0.0000000000000e+00  0.0000000000000e+00 
      36  1.9000000000000e+00  6.0000000000000e-01  0.0000000000000e+00 
      37  1.4000000000000e+00  1.0000000000000e-01  0.0000000000000e+00 
      38  1.8000000000000e+00  6.0000000000000e-01  0.0000000000000e+00 
      39  1.4000000000000e+00  2.0000000000000e-01  0.0000000000000e+00 
      40  1.5000000000000e+00  4.0000000000000e-01  0.0000000000000e+00 
      41  1.6000000000000e+00  5.0000000000000e-01  0.0000000000000e+00 
      42  1.7000000000000e+00  6.0000000000000e-01  0.0000000000000e+00 
      43  1.4000000000000e+00  3.0000000000000e-01  0.0000000000000e+00 
      44  1.3000000000000e+00  0.0000000000000e+00  0.0000000000000e+00 
      45  2.0000000000000e+00  7.0000000000000e-01  0.0000000000000e+00 
      46  1.5000000000000e+00  5.0000000000000e-01  0.0000000000000e+00 
      47  1.3000000000000e+00  1.0000000000000e-01  0.0000000000000e+00 
      48  1.9000000000000e+00  7.0000000000000e-01  0.0000000000000e+00 
      49  1.4000000000000e+00  4.0000000000000e-01  0.0000000000000e+00 
      50  1.6000000000000e+00  6.0000000000000e-01  0.0000000000000e+00 
      51  1.8000000000000e+00  7.0000000000000e-01  0.0000000000000e+00 
      52  1.3000000000000e+00  2.0000000000000e-01  0.0000000000000e+00 
      53  1.7000000000000e+00  7.0000000000000e-01  0.0000000000000e+00 
      54  1.3000000000000e+00  3.0000000000000e-01  0.0000000000000e+00 
      55  1.5000000000000e+00  6.0000000000000e-01  0.0000000000000e+00 
      56  1.4000000000000e+00  5.0000000000000e-01  0.0000000000000e+00 
      57  1.2000000000000e+00  0.0000000000000e+00  0.0000000000000e+00 
      58  2.0000000000000e+00  8.0000000000000e-01  0.0000000000000e+00 
      59  1.9000000000000e+00  8.0000000000000e-01  0.0000000000000e+00 
      60  1.6000000000000e+00  7.0000000000000e-01  0.0000000000000e+00 
      61  1.3000000000000e+00  4.0000000000000e-01  0.0000000000000e+00 
      62  1.2000000000000e+00  1.0000000000000e-01  0.0000000000000e+00 
      63  1.8000000000000e+00  8.0000000000000e-01  0.0000000000000e+00 
      64  1.2000000000000e+00  2.0000000000000e-01  0.0000000000000e+00 
      65  1.4000000000000e+00  6.0000000000000e-01  0.0000000000000e+00 
      66  1.7000000000000e+00  8.0000000000000e-01  0.0000000000000e+00 
      67  1.2000000000000e+00  3.0000000000000e-01  0.0000000000000e+00 
      68  1.5000000000000e+00  7.0000000000000e-01  0.0000000000000e+00 
      69  1.3000000000000e+00  5.0000000000000e-01  0.0000000000000e+00 
      70  1.6000000000000e+00  8.0000000000000e-01  0.0000000000000e+00 
      71  1.2000000000000e+00  4.0000000000000e-01  0.0000000000000e+00 
      72  1.1000000000000e+00  0.0000000000000e+00  0.0000000000000e+00 
      73  2.0000000000000e+00  9.0000000000000e-01  0.0000000000000e+00 
      74  1.1000000000000e+00  1.0000000000000e-01  0.0000000000000e+00 
      75  1.9000000000000e+00  9.0000000000000e-01  0.0000000000000e+00 
      76  1.4000000000000e+00  7.0000000000000e-01  0.0000000000000e+00 
      77  1.1000000000000e+00  2.0000000000000e-01  0.0000000000000e+00 
      78  1.8000000000000e+00  9.0000000000000e-01  0.0000000000000e+00 
      79  1.3000000000000e+00  6.0000000000000e-01  0.0000000000000e+00 
      80  1.5000000000000e+00  8.0000000000000e-01  0.0000000000000e+00 
      81  1.2000000000000e+00  5.0000000000000e-01  0.0000000000000e+00 
      82  1.1000000000000e+00  3.0000000000000e-01  0.0000000000000e+00 
      83  1.7000000000000e+00  9.0000000000000e-01  0.0000000000000e+00 
      84  1.6000000000000e+00  9.0000000000000e-01  0.0000000000000e+00 
      85  1.1000000000000e+00  4.0000000000000e-01  0.0000000000000e+00 
      86  1.3000000000000e+00  7.0000000000000e-01  0.0000000000000e+00 
      87  2.0000000000000e+00  1.0000000000000e+00  0.0000000000000e+00 
      88  1.0000000000000e+00  0.0000000000000e+00  0.0000000000000e+00 
      89  1.2000000000000e+00  6.0000000000000e-01  0.0000000000000e+00 
      90  1.4000000000000e+00  8.0000000000000e-01  0.0000000000000e+00 
      91  1.9000000000000e+00  1.0000000000000e+00  0.0000000000000e+00 
      92  1.0000000000000e+00  1.0000000000000e-01  0.0000000000000e+00 
      93  1.8000000000000e+00  1.0000000000000e+00  0.0000000000000e+00 
      94  1.0000000000000e+00  2.0000000000000e-01  0.0000000000000e+00 
      95  1.1000000000000e+00  5.0000000000000e-01  0.0000000000000e+00 
      96  1.5000000000000e+00  9.0000000000000e-01  0.0000000000000e+00 
      97  1.7000000000000e+00  1.0000000000000e+00  0.0000000000000e+00 
      98  1.0000000000000e+00  3.0000000000000e-01  0.0000000000000e+00 
      99  1.2000000000000e+00  7.0000000000000e-01  0.0000000000000e+00 
     100  1.3000000000000e+00  8.0000000000000e-01  0.0000000000000e+00 
     101  1.6000000000000e+00  1.0000000000000e+00  0.0000000000000e+00 
     102  1.0000000000000e+00  4.0000000000000e-01  0.0000000000000e+00 
     103  1.1000000000000e+00  6.0000000000000e-01  0.0000000000000e+00 
     104  1.4000000000000e+00  9.0000000000000e-01  0.0000000000000e+00 
     105  9.0000000000000e-01  0.0000000000000e+00  0.0000000000000e+00 
     106  9.0000000000000e-01  1.0000000000000e-01  0.0000000000000e+00 
     107  9.0000000000000e-01  2.0000000000000e-01  0.0000000000000e+00 
     108  1.5000000000000e+00  1.0000000000000e+00  0.0000000000000e+00 
     109  1.0000000000000e+00  5.0000000000000e-01  0.0000000000000e+00 
     110  1.2000000000000e+00  8.0000000000000e-01  0.0000000000000e+00 
     111  1.1000000000000e+00  7.0000000000000e-01  0.0000000000000e+00 
     112  9.0000000000000e-01  3.0000000000000e-01  0.0000000000000e+00 
     113  1.3000000000000e+00  9.0000000000000e-01  0.0000000000000e+00 
     114  1.4000000000000e+00  1.0000000000000e+00  0.0000000000000e+00 
     115  1.0000000000000e+00  6.0000000000000e-01  0.0000000000000e+00 
     116  9.0000000000000e-01  4.0000000000000e-01  0.0000000000000e+00 
     117  8.0000000000000e-01  0.0000000000000e+00  0.0000000000000e+00 
     118  8.0000000000000e-01  1.0000000000000e-01  0.0000000000000e+00 
     119  1.1000000000000e+00  8.0000000000000e-01  0.0000000000000e+00 
     120  1.2000000000000e+00  9.0000000000000e-01  0.0000000000000e+00 
     121  9.0000000000000e-01  5.0000000000000e-01  0.0000000000000e+00 
     122  8.0000000000000e-01  2.0000000000000e-01  0.0000000000000e+00 
     123  1.3000000000000e+00  1.0000000000000e+00  0.0000000000000e+00 
     124  1.0000000000000e+00  7.0000000000000e-01  0.0000000000000e+00 
     125  8.0000000000000e-01  3.0000000000000e-01  0.0000000000000e+00 
     126  9.0000000000000e-01  6.0000000000000e-01  0.0000000000000e+00 
     127  8.0000000000000e-01  4.0000000000000e-01  0.0000000000000e+00 
     128  1.1000000000000e+00  9.0000000000000e-01  0.0000000000000e+00 
     129  1.2000000000000e+00  1.0000000000000e+00  0.0000000000000e+00 
     130  1.0000000000000e+00  8.0000000000000e-01  0.0000000000000e+00 
     131  8.0000000000000e-01  5.0000000000000e-01  0.0000000000000e+00 
     132  7.0000000000000e-01  0.0000000000000e+00  0.0000000000000e+00 
     133  9.0000000000000e-01  7.0000000000000e-01  0.0000000000000e+00 
     134  7.0000000000000e-01  1.0000000000000e-01  0.0000000000000e+00 
     135  7.0000000000000e-01  2.0000000000000e-01  0.0000000000000e+00 
     136  7.0000000000000e-01  3.0000000000000e-01  0.0000000000000e+00 
     137  8.0000000000000e-01  6.0000000000000e-01  0.0000000000000e+00 
     138  1.1000000000000e+00  1.0000000000000e+00  0.0000000000000e+00 
     139  1.0000000000000e+00  9.0000000000000e-01  0.0000000000000e+00 
     140  9.0000000000000e-01  8.0000000000000e-01  0.0000000000000e+00 
     141  7.0000000000000e-01  4.0000000000000e-01  0.0000000000000e+00 
     142  8.0000000000000e-01  7.0000000000000e-01  0.0000000000000e+00 
     143  7.0000000000000e-01  5.0000000000000e-01  0.0000000000000e+00 
     144  6.0000000000000e-01  0.0000000000000e+00  0.0000000000000e+00 
     145  6.0000000000000e-01  1.0000000000000e-01  0.0000000000000e+00 
     146  6.0000000000000e-01  2.0000000000000e-01  0.0000000000000e+00 
     147  1.0000000000000e+00  1.0000000000000e+00  0.0000000000000e+00 
     148  9.0000000000000e-01  9.0000000000000e-01  0.0000000000000e+00 
     149  6.0000000000000e-01  3.0000000000000e-01  0.0000000000000e+00 
     150  7.0000000000000e-01  6.0000000000000e-01  0.0000000000000e+00 
     151  8.0000000000000e-01  8.0000000000000e-01  0.0000000000000e+00 
     152  6.0000000000000e-01  4.0000000000000e-01  0.0000000000000e+00 
     153  7.0000000000000e-01  7.0000000000000e-01  0.0000000000000e+00 
     154  9.0000000000000e-01  1.0000000000000e+00  0.0000000000000e+00 
     155  6.0000000000000e-01  5.0000000000000e-01  0.0000000000000e+00 
     156  8.0000000000000e-01  9.0000000000000e-01  0.0000000000000e+00 
     157  5.0000000000000e-01  0.0000000000000e+00  0.0000000000000e+00 
     158  5.0000000000000e-01  1.0000000000000e-01  0.0000000000000e+00 
     159  5.0000000000000e-01  2.0000000000000e-01  0.0000000000000e+00 
     160  6.0000000000000e-01  6.0000000000000e-01  0.0000000000000e+00 
     161  7.0000000000000e-01  8.0000000000000e-01  0.0000000000000e+00 
     162  5.0000000000000e-01  3.0000000000000e-01  0.0000000000000e+00 
     163  5.0000000000000e-01  4.0000000000000e-01  0.0000000000000e+00 
     164  8.0000000000000e-01  1.0000000000000e+00  0.0000000000000e+00 
     165  6.0000000000000e-01  7.0000000000000e-01  0.0000000000000e+00 
     166  5.0000000000000e-01  5.0000000000000e-01  0.0000000000000e+00 
     167  7.0000000000000e-01  9.0000000000000e-01  0.0000000000000e+00 
     168  4.0000000000000e-01  0.0000000000000e+00  0.0000000000000e+00 
     169  4.0000000000000e-01  1.0000000000000e-01  0.0000000000000e+00 
     170  6.0000000000000e-01  8.0000000000000e-01  0.0000000000000e+00 
     171  4.0000000000000e-01  2.0000000000000e-01  0.0000000000000e+00 
     172  5.0000000000000e-01  6.0000000000000e-01  0.0000000000000e+00 
     173  4.0000000000000e-01  3.0000000000000e-01  0.0000000000000e+00 
     174  7.0000000000000e-01  1.0000000000000e+00  0.0000000000000e+00 
     175  4.0000000000000e-01  4.0000000000000e-01  0.0000000000000e+00 
     176  5.0000000000000e-01  7.0000000000000e-01  0.0000000000000e+00 
     177  6.0000000000000e-01  9.0000000000000e-01  0.0000000000000e+00 
     178  4.0000000000000e-01  5.0000000000000e-01  0.0000000000000e+00 
     179  3.0000000000000e-01  0.0000000000000e+00  0.0000000000000e+00 
     180  5.0000000000000e-01  8.0000000000000e-01  0.0000000000000e+00 
     181  3.0000000000000e-01  1.0000000000000e-01  0.0000000000000e+00 
     182  4.0000000000000e-01  6.0000000000000e-01  0.0000000000000e+00 
     183  3.0000000000000e-01  2.0000000000000e-01  0.0000000000000e+00 
     184  6.0000000000000e-01  1.0000000000000e+00  0.0000000000000e+00 
     185  3.0000000000000e-01  3.0000000000000e-01  0.0000000000000e+00 
     186  3.0000000000000e-01  4.0000000000000e-01  0.0000000000000e+00 
     187  4.0000000000000e-01  7.0000000000000e-01  0.0000000000000e+00 
     188  5.0000000000000e-01  9.0000000000000e-01  0.0000000000000e+00 
     189  3.0000000000000e-01  5.0000000000000e-01  0.0000000000000e+00 
     190  4.0000000000000e-01  8.0000000000000e-01  0.0000000000000e+00 
     191  2.0000000000000e-01  0.0000000000000e+00  0.0000000000000e+00 
     192  3.0000000000000e-01  6.0000000000000e-01  0.0000000000000e+00 
     193  5.0000000000000e-01  1.0000000000000e+00  0.0000000000000e+00 
     194  2.0000000000000e-01  1.0000000000000e-01  0.0000000000000e+00 
     195  2.0000000000000e-01  2.0000000000000e-01  0.0000000000000e+00 
     196  2.0000000000000e-01  3.0000000000000e-01  0.0000000000000e+00 
     197  4.0000000000000e-01  9.0000000000000e-01  0.0000000000000e+00 
     198  3.0000000000000e-01  7.0000000000000e-01  0.0000000000000e+00 
     199  2.0000000000000e-01  4.0000000000000e-01  0.0000000000000e+00 
     200  2.0000000000000e-01  5.0000000000000e-01  0.0000000000000e+00 
     201  3.0000000000000e-01  8.0000000000000e-01  0.0000000000000e+00 
     202  4.0000000000000e-01  1.0000000000000e+00  0.0000000000000e+00 
     203  2.0000000000000e-01  6.0000000000000e-01  0.0000000000000e+00 
     204  1.0000000000000e-01  0.0000000000000e+00  0.0000000000000e+00 
     205  1.0000000000000e-01  1.0000000000000e-01  0.0000000000000e+00 
     206  1.0000000000000e-01  2.0000000000000e-01  0.0000000000000e+00 
     207  3.0000000000000e-01  9.0000000000000e-01  0.0000000000000e+00 
     208  1.0000000000000e-01  3.0000000000000e-01  0.0000000000000e+00 
     209  2.0000000000000e-01  7.0000000000000e-01  0.0000000000000e+00 
     210  1.0000000000000e-01  4.0000000000000e-01  0.0000000000000e+00 
     211  1.0000000000000e-01  5.0000000000000e-01  0.0000000000000e+00 
     212  2.0000000000000e-01  8.0000000000000e-01  0.0000000000000e+00 
     213  3.0000000000000e-01  1.0000000000000e+00  0.0000000000000e+00 
     214  1.0000000000000e-01  6.0000000000000e-01  0.0000000000000e+00 
     215  0.0000000000000e+00  0.0000000000000e+00  0.0000000000000e+00 
     216  0.0000000000000e+00  1.0000000000000e-01  0.0000000000000e+00 
     217  0.0000000000000e+00  2.0000000000000e-01  0.0000000000000e+00 
     218  2.0000000000000e-01  9.0000000000000e-01  0.0000000000000e+00 
     219  0.0000000000000e+00  3.0000000000000e-01  0.0000000000000e+00 
     220  1.0000000000000e-01  7.0000000000000e-01  0.0000000000000e+00 
     221  0.0000000000000e+00  4.0000000000000e-01  0.0000000000000e+00 
     222  2.0000000000000e-01  1.0000000000000e+00  0.0000000000000e+00 
     223  0.0000000000000e+00  5.0000000000000e-01  0.0000000000000e+00 
     224  1.0000000000000e-01  8.0000000000000e-01  0.0000000000000e+00 
     225  0.0000000000000e+00  6.0000000000000e-01  0.0000000000000e+00 
     226  1.0000000000000e-01  9.0000000000000e-01  0.0000000000000e+00 
     227  0.0000000000000e+00  7.0000000000000e-01  0.0000000000000e+00 
     228  1.0000000000000e-01  1.0000000000000e+00  0.0000000000000e+00 
     229  0.0000000000000e+00  8.0000000000000e-01  0.0000000000000e+00 
     230  0.0000000000000e+00  9.0000000000000e-01  0.0000000000000e+00 
     231  0.0000000000000e+00  1.0000000000000e+00  0.0000000000000e+00 


[1D Elements]
#ElemNr  ElemType  NrOfNodes  Level
#Node1 Node2 ... NodeNrOfNodes

[2D Elements]
#ElemNr  ElemType  NrOfNodes  Level
#Node1 Node2 ... NodeNrOfNodes
1 6 4 mech
204 205 216 215
2 6 4 mech
191 194 205 204
3 6 4 mech
179 181 194 191
4 6 4 mech
168 169 181 179
5 6 4 mech
157 158 169 168
6 6 4 mech
144 145 158 157
7 6 4 mech
132 134 145 144
8 6 4 mech
117 118 134 132
9 6 4 mech
105 106 118 117
10 6 4 mech
88 92 106 105
11 6 4 mech
72 74 92 88
12 6 4 mech
57 62 74 72
13 6 4 mech
44 47 62 57
14 6 4 mech
35 37 47 44
15 6 4 mech
24 27 37 35
16 6 4 mech
16 19 27 24
17 6 4 mech
11 12 19 16
18 6 4 mech
5 7 12 11
19 6 4 mech
3 4 7 5
20 6 4 mech
1 2 4 3
21 6 4 mech
205 206 217 216
22 6 4 mech
194 195 206 205
23 6 4 mech
181 183 195 194
24 6 4 mech
169 171 183 181
25 6 4 mech
158 159 171 169
26 6 4 mech
145 146 159 158
27 6 4 mech
134 135 146 145
28 6 4 mech
118 122 135 134
29 6 4 mech
106 107 122 118
30 6 4 mech
92 94 107 106
31 6 4 mech
74 77 94 92
32 6 4 mech
62 64 77 74
33 6 4 mech
47 52 64 62
34 6 4 mech
37 39 52 47
35 6 4 mech
27 29 39 37
36 6 4 mech
19 21 29 27
37 6 4 mech
12 14 21 19
38 6 4 mech
7 9 14 12
39 6 4 mech
4 8 9 7
40 6 4 mech
2 6 8 4
41 6 4 mech
206 208 219 217
42 6 4 mech
195 196 208 206
43 6 4 mech
183 185 196 195
44 6 4 mech
171 173 185 183
45 6 4 mech
159 162 173 171
46 6 4 mech
146 149 162 159
47 6 4 mech
135 136 149 146
48 6 4 mech
122 125 136 135
49 6 4 mech
107 112 125 122
50 6 4 mech
94 98 112 107
51 6 4 mech
77 82 98 94
52 6 4 mech
64 67 82 77
53 6 4 mech
52 54 67 64
54 6 4 mech
39 43 54 52
55 6 4 mech
29 32 43 39
56 6 4 mech
21 23 32 29
57 6 4 mech
14 20 23 21
58 6 4 mech
9 15 20 14
59 6 4 mech
8 13 15 9
60 6 4 mech
6 10 13 8
61 6 4 mech
208 210 221 219
62 6 4 mech
196 199 210 208
63 6 4 mech
185 186 199 196
64 6 4 mech
173 175 186 185
65 6 4 mech
162 163 175 173
66 6 4 mech
149 152 163 162
67 6 4 mech
136 141 152 149
68 6 4 mech
125 127 141 136
69 6 4 mech
112 116 127 125
70 6 4 mech
98 102 116 112
71 6 4 mech
82 85 102 98
72 6 4 mech
67 71 85 82
73 6 4 mech
54 61 71 67
74 6 4 mech
43 49 61 54
75 6 4 mech
32 40 49 43
76 6 4 mech
23 31 40 32
77 6 4 mech
20 26 31 23
78 6 4 mech
15 22 26 20
79 6 4 mech
13 18 22 15
80 6 4 mech
10 17 18 13
81 6 4 mech
210 211 223 221
82 6 4 mech
199 200 211 210
83 6 4 mech
186 189 200 199
84 6 4 mech
175 178 189 186
85 6 4 mech
163 166 178 175
86 6 4 mech
152 155 166 163
87 6 4 mech
141 143 155 152
88 6 4 mech
127 131 143 141
89 6 4 mech
116 121 131 127
90 6 4 mech
102 109 121 116
91 6 4 mech
85 95 109 102
92 6 4 mech
71 81 95 85
93 6 4 mech
61 69 81 71
94 6 4 mech
49 56 69 61
95 6 4 mech
40 46 56 49
96 6 4 mech
31 41 46 40
97 6 4 mech
26 33 41 31
98 6 4 mech
22 30 33 26
99 6 4 mech
18 28 30 22
100 6 4 mech
17 25 28 18
101 6 4 mech
211 214 225 223
102 6 4 mech
200 203 214 211
103 6 4 mech
189 192 203 200
104 6 4 mech
178 182 192 189
105 6 4 mech
166 172 182 178
106 6 4 mech
155 160 172 166
107 6 4 mech
143 150 160 155
108 6 4 mech
131 137 150 143
109 6 4 mech
121 126 137 131
110 6 4 mech
109 115 126 121
111 6 4 mech
95 103 115 109
112 6 4 mech
81 89 103 95
113 6 4 mech
69 79 89 81
114 6 4 mech
56 65 79 69
115 6 4 mech
46 55 65 56
116 6 4 mech
41 50 55 46
117 6 4 mech
33 42 50 41
118 6 4 mech
30 38 42 33
119 6 4 mech
28 36 38 30
120 6 4 mech
25 34 36 28
121 6 4 mech
214 220 227 225
122 6 4 mech
203 209 220 214
123 6 4 mech
192 198 209 203
124 6 4 mech
182 187 198 192
125 6 4 mech
172 176 187 182
126 6 4 mech
160 165 176 172
127 6 4 mech
150 153 165 160
128 6 4 mech
137 142 153 150
129 6 4 mech
126 133 142 137
130 6 4 mech
115 124 133 126
131 6 4 mech
103 111 124 115
132 6 4 mech
89 99 111 103
133 6 4 mech
79 86 99 89
134 6 4 mech
65 76 86 79
135 6 4 mech
55 68 76 65
136 6 4 mech
50 60 68 55
137 6 4 mech
42 53 60 50
138 6 4 mech
38 51 53 42
139 6 4 mech
36 48 51 38
140 6 4 mech
34 45 48 36
141 6 4 mech
220 224 229 227
142 6 4 mech
209 212 224 220
143 6 4 mech
198 201 212 209
144 6 4 mech
187 190 201 198
145 6 4 mech
176 180 190 187
146 6 4 mech
165 170 180 176
147 6 4 mech
153 161 170 165
148 6 4 mech
142 151 161 153
149 6 4 mech
133 140 151 142
150 6 4 mech
124 130 140 133
151 6 4 mech
111 119 130 124
152 6 4 mech
99 110 119 111
153 6 4 mech
86 100 110 99
154 6 4 mech
76 90 100 86
155 6 4 mech
68 80 90 76
156 6 4 mech
60 70 80 68
157 6 4 mech
53 66 70 60
158 6 4 mech
51 63 66 53
159 6 4 mech
48 59 63 51
160 6 4 mech
45 58 59 48
161 6 4 mech
224 226 230 229
162 6 4 mech
212 218 226 224
163 6 4 mech
201 207 218 212
164 6 4 mech
190 197 207 201
165 6 4 mech
180 188 197 190
166 6 4 mech
170 177 188 180
167 6 4 mech
161 167 177 170
168 6 4 mech
151 156 167 161
169 6 4 mech
140 148 156 151
170 6 4 mech
130 139 148 140
171 6 4 mech
119 128 139 130
172 6 4 mech
110 120 128 119
173 6 4 mech
100 113 120 110
174 6 4 mech
90 104 113 100
175 6 4 mech
80 96 104 90
176 6 4 mech
70 84 96 80
177 6 4 mech
66 83 84 70
178 6 4 mech
63 78 83 66
179 6 4 mech
59 75 78 63
180 6 4 mech
58 73 75 59
181 6 4 mech
226 228 231 230
182 6 4 mech
218 222 228 226
183 6 4 mech
207 213 222 218
184 6 4 mech
197 202 213 207
185 6 4 mech
188 193 202 197
186 6 4 mech
177 184 193 188
187 6 4 mech
167 174 184 177
188 6 4 mech
156 164 174 167
189 6 4 mech
148 154 164 156
190 6 4 mech
139 147 154 148
191 6 4 mech
128 138 147 139
192 6 4 mech
120 129 138 128
193 6 4 mech
113 123 129 120
194 6 4 mech
104 114 123 113
195 6 4 mech
96 108 114 104
196 6 4 mech
84 101 108 96
197 6 4 mech
83 97 101 84
198 6 4 mech
78 93 97 83
199 6 4 mech
75 91 93 78
200 6 4 mech
73 87 91 75


[3D Elements]
#ElemNr  ElemType  NrOfNodes  Level
#Node1 Node2 ... NodeNrOfNodes

[Node BC]
#NodeNr Level
1 fixed
215 fixed
231 fixed
87 fixed

[Save Nodes]
#NodeNr Level


[Save Elements]
#ElemNr Level

