$MeshFormat
2.2 0 8
$EndMeshFormat
$PhysicalNames
12
0 11 "origin"
0 12 "circle_point"
1 4 "abc"
1 5 "x0"
1 6 "y0"
1 7 "excitation_line"
1 8 "excitation_circle"
1 9 "x"
1 10 "y"
2 1 "pml"
2 2 "outside"
2 3 "inside"
$EndPhysicalNames
$Nodes
957
1 0 0 0
2 1.5 0 0
3 1.5 1.5 0
4 0 1.5 0
5 0.5 0 0
6 2 0 0
7 2 1.5 0
8 2 2 0
9 1.5 2 0
10 0 2 0
11 0 0.5 0
12 0.1249999999997057 0 0
13 0.2499999999993467 0 0
14 0.3749999999996707 0 0
15 0.06249999999988769 0 0
16 0.1874999999995262 0 0
17 0.3124999999995087 0 0
18 0.4374999999998353 0 0
19 1.5 0.1249999999994696 0
20 1.5 0.249999999998912 0
21 1.5 0.3749999999984595 0
22 1.5 0.4999999999980141 0
23 1.5 0.6249999999975685 0
24 1.5 0.7499999999971444 0
25 1.5 0.8749999999976028 0
26 1.5 0.9999999999980831 0
27 1.5 1.124999999998563 0
28 1.5 1.249999999999042 0
29 1.5 1.374999999999521 0
30 1.5 0.06249999999972743 0
31 1.5 0.1874999999992361 0
32 1.5 0.3124999999986795 0
33 1.5 0.4374999999982674 0
34 1.5 0.5624999999977827 0
35 1.5 0.6874999999973394 0
36 1.5 0.8124999999973782 0
37 1.5 0.9374999999978194 0
38 1.5 1.062499999998337 0
39 1.5 1.187499999998713 0
40 1.5 1.312499999999245 0
41 1.5 1.43749999999976 0
42 1.375000000001037 1.5 0
43 1.250000000001583 1.5 0
44 1.12500000000129 1.5 0
45 1.000000000000968 1.5 0
46 0.8750000000015284 1.5 0
47 0.7500000000020816 1.5 0
48 0.625000000001752 1.5 0
49 0.5000000000014008 1.5 0
50 0.3750000000010498 1.5 0
51 0.2500000000006999 1.5 0
52 0.1250000000003499 1.5 0
53 1.437500000000551 1.5 0
54 1.312500000001248 1.5 0
55 1.187500000001469 1.5 0
56 1.062500000001062 1.5 0
57 0.9375000000012521 1.5 0
58 0.8125000000018048 1.5 0
59 0.6875000000020162 1.5 0
60 0.56250000000161 1.5 0
61 0.4375000000012239 1.5 0
62 0.312500000000937 1.5 0
63 0.1875000000005174 1.5 0
64 0.06250000000012657 1.5 0
65 0 1.375000000000694 0
66 0 1.250000000001388 0
67 0 1.125000000002082 0
68 0 1.000000000002754 0
69 0 0.8750000000020821 0
70 0 0.7500000000013881 0
71 0 0.625000000000694 0
72 0 1.43750000000041 0
73 0 1.312500000001092 0
74 0 1.187500000001761 0
75 0 1.062500000002323 0
76 0 0.9375000000024183 0
77 0 0.8125000000017351 0
78 0 0.6875000000010411 0
79 0 0.5625000000003471 0
80 0.6250000000011926 0 0
81 0.7500000000010407 0 0
82 0.8750000000008666 0 0
83 1.000000000000693 0 0
84 1.125000000000519 0 0
85 1.250000000000346 0 0
86 1.375000000000173 0 0
87 0.5625000000005154 0 0
88 0.6875000000011094 0 0
89 0.8125000000009894 0 0
90 0.9375000000007768 0 0
91 1.062500000000701 0 0
92 1.187500000000561 0 0
93 1.312500000000337 0 0
94 1.437500000000152 0 0
95 1.625 0 0
96 1.75 0 0
97 1.875 0 0
98 1.562500000000046 0 0
99 1.6875 0 0
100 1.812500000000052 0 0
101 1.937499999999954 0 0
102 1.625 1.5 0
103 1.75 1.5 0
104 1.875 1.5 0
105 1.562500000000046 1.5 0
106 1.6875 1.5 0
107 1.812500000000052 1.5 0
108 1.937499999999954 1.5 0
109 1.5 1.625 0
110 1.5 1.75 0
111 1.5 1.875 0
112 1.5 1.562500000000046 0
113 1.5 1.6875 0
114 1.5 1.812500000000052 0
115 1.5 1.937499999999954 0
116 0 1.625 0
117 0 1.75 0
118 0 1.875 0
119 0 1.562500000000046 0
120 0 1.6875 0
121 0 1.812500000000052 0
122 0 1.937499999999954 0
123 2 0.1249999999994696 0
124 2 0.249999999998912 0
125 2 0.3749999999984595 0
126 2 0.4999999999980141 0
127 2 0.6249999999975685 0
128 2 0.7499999999971444 0
129 2 0.8749999999976028 0
130 2 0.9999999999980831 0
131 2 1.124999999998563 0
132 2 1.249999999999042 0
133 2 1.374999999999521 0
134 2 0.06249999999972743 0
135 2 0.1874999999992361 0
136 2 0.3124999999986795 0
137 2 0.4374999999982674 0
138 2 0.5624999999977827 0
139 2 0.6874999999973394 0
140 2 0.8124999999973782 0
141 2 0.9374999999978194 0
142 2 1.062499999998337 0
143 2 1.187499999998713 0
144 2 1.312499999999245 0
145 2 1.43749999999976 0
146 2 1.625 0
147 2 1.75 0
148 2 1.875 0
149 2 1.562500000000046 0
150 2 1.6875 0
151 2 1.812500000000052 0
152 2 1.937499999999954 0
153 1.875 2 0
154 1.75 2 0
155 1.625 2 0
156 1.937499999999954 2 0
157 1.8125 2 0
158 1.687499999999948 2 0
159 1.562500000000046 2 0
160 1.375000000001037 2 0
161 1.250000000001583 2 0
162 1.12500000000129 2 0
163 1.000000000000968 2 0
164 0.8750000000015284 2 0
165 0.7500000000020816 2 0
166 0.625000000001752 2 0
167 0.5000000000014008 2 0
168 0.3750000000010498 2 0
169 0.2500000000006999 2 0
170 0.1250000000003499 2 0
171 1.437500000000551 2 0
172 1.312500000001248 2 0
173 1.187500000001469 2 0
174 1.062500000001062 2 0
175 0.9375000000012521 2 0
176 0.8125000000018048 2 0
177 0.6875000000020162 2 0
178 0.56250000000161 2 0
179 0.4375000000012239 2 0
180 0.312500000000937 2 0
181 0.1875000000005174 2 0
182 0.06250000000012657 2 0
183 0.4829629131446249 0.1294095225509216 0
184 0.4330127018925694 0.2499999999993936 0
185 0.3535533905939447 0.3535533905926028 0
186 0.250000000000534 0.433012701891911 0
187 0.1294095225514793 0.4829629131444755 0
188 0.4957224306869287 0.06526309610984704 0
189 0.4619397662558483 0.1913417161820501 0
190 0.3966766701461114 0.3043807145037168 0
191 0.3043807145049819 0.3966766701451406 0
192 0.1913417161828947 0.4619397662554985 0
193 0.06526309611014165 0.4957224306868899 0
194 0 0.1249999999997057 0
195 0 0.2499999999993467 0
196 0 0.3749999999996707 0
197 0 0.06249999999988769 0
198 0 0.1874999999995262 0
199 0 0.3124999999995087 0
200 0 0.4374999999998353 0
201 0.8260201338174609 0.8320334628274717 0
202 1.066954004481946 0.4574508418923032 0
203 0.4588548728553744 1.071819079134628 0
204 1.119030717482333 1.132727567805929 0
205 0.694458967014854 0.5357496747655546 0
206 1.165098657366529 0.8020885046497285 0
207 0.7970282058262785 1.15378658940044 0
208 0.4584453927727909 0.749526436029273 0
209 1.241552404254265 0.298457046008777 0
210 0.2980439790356667 1.249005922628108 0
211 0.2926600464907944 0.9174558012501652 0
212 1.286952935260983 0.6099516779030505 0
213 0.6285683561772296 1.286504103825483 0
214 1.284467125009502 1.314546493141289 0
215 0.6167380897322908 0.8627687276589809 0
216 0.8735232686735845 0.5347034763489447 0
217 0.943295289653461 1.269962957880744 0
218 1.318630948797864 0.946083889704974 0
219 0.2223255379408528 0.6977342188283224 0
220 0.9958321834783647 0.9230904407361364 0
221 0.6523554528403718 0.3137657786906169 0
222 0.9961157354623759 0.2354879729070592 0
223 0.5100675422882213 0.5426793564391067 0
224 0.6334780026743752 0.6586642241875602 0
225 0.2337827428692535 1.026249865382122 0
226 0.9325089149838643 1.099694638594481 0
227 0.628695870831453 1.033368330350485 0
228 0.786381769085275 1.322080497529906 0
229 1.312866206716673 0.7982800820931415 0
230 1.018398893515289 0.6080216475284218 0
231 0.8684870443367804 0.4344864267442024 0
232 0.4803077143412919 0.8430322296796127 0
233 0.7906601750301412 1.027074433380893 0
234 1.295758714308278 0.3898030948055102 0
235 0.3921065827374632 1.300334668429614 0
236 1.140008257611436 1.384703337469615 0
237 1.388813245392617 1.095992019228057 0
238 0.9716672715898578 0.742445339182497 0
239 0.6743493659832916 0.192159858678181 0
240 1.360052431671872 0.2118306344675806 0
241 0.2074162375375855 1.365455746055134 0
242 0.3068838633047434 0.592567550006697 0
243 0.1152266434946572 0.800380953598074 0
244 0.8815120685180854 0.1128838492197324 0
245 1.152694365272289 0.3919564953218456 0
246 0.3925762925417206 1.161293239497301 0
247 1.125911248147148 0.1312212917897792 0
248 0.4785208616461407 0.4347885531002083 0
249 0.9957360484422429 0.3603921015112059 0
250 0.1310862545426015 1.136069291386081 0
251 0.1488574450313104 0.9244170654039534 0
252 0.8789434390158348 1.335998241774673 0
253 1.37588745793545 0.8647114579265079 0
254 0.3488661884336339 1.013682809887723 0
255 1.154944839535308 0.9570908680437584 0
256 1.360008731671274 1.368731586232763 0
257 0.7654085103544062 0.4355999344161099 0
258 0.5629022182973643 0.651193184398505 0
259 0.352170148532781 0.7773095833773227 0
260 1.370567686191989 0.2829004514090584 0
261 0.2817545806070737 1.374450576454274 0
262 0.752342578671325 0.6380931890477775 0
263 0.5563854444319057 0.7424693554523945 0
264 0.8880918137795737 0.9704023856127231 0
265 0.5762853624364883 0.157393721852518 0
266 1.393843983486643 0.6055303031378931 0
267 0.6193437367099646 1.392423675905145 0
268 0.5618671816275314 1.133016310621038 0
269 1.091542326382342 0.3332208333707336 0
270 1.176738537494377 1.25312332466748 0
271 0.6636368525955511 1.18761136613782 0
272 0.117696039565588 0.6005067069856707 0
273 0.6765519853263106 0.7428386191912343 0
274 1.127176754265548 0.5531775351422785 0
275 1.18386364321657 0.6511582958294545 0
276 1.250464167804085 1.065169329540549 0
277 1.221367031312232 1.402198664174147 0
278 1.381976940931769 1.212077456004525 0
279 1.020623964689491 1.199003213786949 0
280 0.7695046958087896 0.5373061612165039 0
281 0.8729267880257167 1.204628966142115 0
282 1.015005544819493 1.36149133849316 0
283 1.407280311913346 0.9865928195275773 0
284 0.5170782038878122 0.9528277327730156 0
285 1.238521057456597 0.8781411605378117 0
286 0.3303620622064355 1.10543937785835 0
287 0.9738133529199973 0.5076339042537812 0
288 0.2274570345286886 0.5873731911001158 0
289 0.6397922177193093 0.4570757092993724 0
290 1.000059534953564 0.1196817844779096 0
291 0.5359190707907006 0.2870070633979073 0
292 1.054246933050992 1.02746475667012 0
293 1.087453381668757 0.8698321095329218 0
294 0.8215273209665193 1.275161972717994 0
295 0.3655357972236578 0.5275338256640348 0
296 0.7713106449391065 0.1072815715705261 0
297 0.5841722352125899 0.5628441857399948 0
298 0.4484789198800455 0.6265243516940678 0
299 0.3275781313022474 0.6730019351629305 0
300 0.7667041707492472 0.3254317909476289 0
301 0.1253725446392199 1.021198470305253 0
302 1.267845027211821 1.178220501655221 0
303 0.1131450531681502 0.717327312677654 0
304 0.8354927627396092 1.092903291127304 0
305 0.9674683009376567 0.8209872537895284 0
306 1.072052550146564 0.7249271468140916 0
307 1.06966188387693 1.268291261961164 0
308 1.275333121131406 0.149277326779666 0
309 0.5013806026981851 1.387763380915843 0
310 1.386600217408035 0.4959527595899044 0
311 0.7182663647398807 1.099979429608092 0
312 1.409749107492657 0.6943981365446312 0
313 0.7275029037461557 1.39810813454443 0
314 0.8824111307891715 0.225559023284128 0
315 0.6648032425055701 0.5982585602504151 0
316 0.227177385707177 0.954938815689456 0
317 0.7103356718551089 0.9397122759135622 0
318 1.111176198951336 0.2514993936446563 0
319 0.5509858910802047 0.8157498682159977 0
320 0.6935569872599372 0.1078229824577139 0
321 1.251185457595477 0.4852834110619823 0
322 0.4919627822822223 1.25496487874239 0
323 1.393556261009868 0.1158937463522134 0
324 0.0958934671111544 1.405939893382383 0
325 0.1453847392505669 1.281623372984321 0
326 1.423105319647497 0.9125559272914079 0
327 0.9215489189618966 1.394170200132681 0
328 0.8895431443617332 0.6696156856744939 0
329 0.4149249249491743 0.9462914002673368 0
330 1.405910978808304 0.1902774538111104 0
331 0.1843045560461121 1.410985978179224 0
332 1.308347548924678 0.6806139714764831 0
333 0.725460793187128 1.309335581466654 0
334 0.7743784115211501 0.2141479490775057 0
335 0.2197874730469377 0.823306882227102 0
336 1.042930470458462 0.8110090823025735 0
337 0.2498909545172484 1.125945936886272 0
338 1.423025229553598 0.8143363865424474 0
339 0.8128409496830833 1.382587346821533 0
340 1.410689902505568 1.413776261863421 0
341 1.245626040699671 0.7309697017254101 0
342 0.9435641871685512 0.4368444918368167 0
343 0.7517713853118984 1.230416589466829 0
344 0.8755149662105148 0.3344807668241175 0
345 1.408792082261931 1.32110328366856 0
346 1.316940565278172 1.418341526887737 0
347 0.3867040289431716 1.385756726295719 0
348 1.383218165945204 0.3850816048048417 0
349 0.3853536304158299 0.8756289546216911 0
350 0.4053077706527859 0.7634180097032979 0
351 0.4693765535570414 0.7962793328544429 0
352 0.4328306723785609 0.8593305921506519 0
353 0.3687618894743054 0.8264692689995069 0
354 0.184322459039124 0.8738619738155278 0
355 0.07442872251565519 0.8997085327030178 0
356 0.05761332174732859 0.8376904768000781 0
357 0.1675070582707974 0.811843917912588 0
358 1.262666560565876 0.07463866338983302 0
359 1.200622184639277 0.1402493092847226 0
360 1.125455624073834 0.0656106458948896 0
361 0.9407858017358246 0.116282816848821 0
362 0.8782560342594761 0.05644192460986619 0
363 1.000029767477128 0.05984089223895479 0
364 0.5591565396827249 0.4459321311997904 0
365 0.6119822264659496 0.5099599475196837 0
366 0.5471198887504056 0.5527617710895507 0
367 0.494294201967181 0.4887339547696575 0
368 0.361469177374078 1.133366308677826 0
369 0.3396141253200347 1.059561093873037 0
370 0.4038605306445041 1.042750944511176 0
371 0.4257155826985475 1.116556159315965 0
372 1.230602831251939 1.283834908904384 0
373 1.252917078160867 1.358372578657718 0
374 1.180687644461834 1.393451000821881 0
375 1.158373397552907 1.318913331068547 0
376 1.284547558300974 1.005626609622762 0
377 1.362955630355605 0.9663383546162756 0
378 1.398046778652982 1.041292419377817 0
379 1.319638706598351 1.080580674384303 0
380 0.6006426812188405 0.07869686092625902 0
381 0.5296241377905566 0.1434016222017198 0
382 1.318892837501756 0.4906180853259433 0
383 1.390222100447339 0.5507415313638988 0
384 1.340398459373813 0.6077409905204718 0
385 1.26906919642823 0.5476175444825164 0
386 0.560265569229726 1.270734491283937 0
387 0.6239560464435971 1.339463889865314 0
388 0.5603621697040748 1.390093528410494 0
389 0.4966716924902037 1.321364129829117 0
390 0.8967442173775588 0.8265103583085001 0
391 0.857781639089597 0.7508245742509828 0
392 0.9306052079757955 0.7060305124284955 0
393 0.9695677862637573 0.7817162964860127 0
394 1.132504128806363 1.442351668734807 0
395 1.007502772410231 1.43074566924658 0
396 1.077506901215465 1.373097337981388 0
397 1.453640155956673 0.9932964097628302 0
398 1.444406622696308 1.11049600961331 0
399 0.4879665383715933 1.012323405953822 0
400 0.5728870373596326 0.9930980315617501 0
401 0.5952815262294922 1.083192320485761 0
402 0.5103610272414528 1.102417694877833 0
403 0.1235527810585336 0.5417348100650731 0
404 0.058848019782794 0.6127533534931824 0
405 1.317692776401639 0.1805539806236233 0
406 1.36531005893193 0.2473655429383195 0
407 1.306060045223127 0.2906787487089177 0
408 1.258442762692835 0.2238671863942215 0
409 0.2217143591431168 1.265314647806214 0
410 0.2898992798213702 1.311728249541191 0
411 0.2445854090723296 1.369953161254704 0
412 0.1764004883940762 1.323539559519727 0
413 0.6633524094118317 0.252962818684399 0
414 0.5941372618155362 0.3003864210442621 0
415 0.5561022166135945 0.2222003926252127 0
416 0.6253173642098899 0.1747767902653495 0
417 1.097065379373747 0.5053141885172908 0
418 1.072787823890418 0.5805995913353501 0
419 0.9961061232176429 0.5578277758911014 0
420 1.020383678700972 0.4825423730730422 0
421 1.39538451159685 1.266590369836542 0
422 1.384400406966602 1.344917434950661 0
423 1.322237928340388 1.341639039687026 0
424 1.333222032970636 1.263311974572907 0
425 1.338474648474723 1.39353655656025 0
426 1.269153798295202 1.410270095530942 0
427 0.910300364381719 1.035048512103602 0
428 0.9419619986289691 0.9467464131744298 0
429 1.025039558264678 0.9752775987031284 0
430 0.9933779240174281 1.063579697632301 0
431 1.440988470465885 1.231038728001784 0
432 1.385395093162193 1.154034737616291 0
433 1.235683515656908 1.451099332087074 0
434 1.109824184877118 0.4247036686070744 0
435 1.031345026462094 0.4089214717017545 0
436 1.043639187412293 0.3468064674409698 0
437 1.122118345827316 0.3625886643462896 0
438 0.3390068384533121 0.8965423779359282 0
439 0.4001392776825021 0.910960177444514 0
440 0.3818955566914041 0.97998710507753 0
441 0.3207631174622141 0.9655693055689442 0
442 0.7085729105884475 0.6181758746490963 0
443 0.7144472819988178 0.6904659041195058 0
444 0.6550149940003429 0.7007514216893973 0
445 0.6491406225899726 0.6284613922189877 0
446 0.850235379991177 1.305580107246334 0
447 0.847227054496118 1.239895469430055 0
448 0.9081110388395888 1.237295962011429 0
449 0.9111193643346479 1.302980599827709 0
450 0.8840008388617367 1.096298964860893 0
451 0.8130764688848752 1.059988862254098 0
452 0.8393759944048574 0.9987384094968078 0
453 1.259154597507953 1.121694915597885 0
454 1.222291782353099 1.21567191316135 0
455 1.147884627488355 1.192925446236704 0
456 1.184747442643209 1.098948448673239 0
457 1.123200210685654 1.260707293314322 0
458 1.045142924283211 1.233647237874057 0
459 1.069827341085912 1.165865390796439 0
460 0.267170448916716 0.5899703705534064 0
461 0.3172309973034955 0.6327847425848138 0
462 0.2749518346215502 0.6853680769956265 0
463 0.2248912862347707 0.6425537049642192 0
464 0.3362098302642006 0.5600506878353659 0
465 0.2387285172646113 0.5101929464960134 0
466 0.3077678986120959 0.480273263777973 0
467 0.484465886341635 0.2685035316986504 0
468 0.5072199662184206 0.3608978082490578 0
469 0.4160371261200427 0.3941709718464056 0
470 0.6164687148791081 0.7426539873218143 0
471 0.559643831364635 0.6968312699254497 0
472 0.5981901104858698 0.6549287042930326 0
473 1.334444691070637 0.1325855365659397 0
474 1.384278130505021 0.05794687317610668 0
475 0.4792732310841333 0.5846018540665873 0
476 0.4070073585518517 0.5770290886790513 0
477 0.4220283294348992 0.4811611893821216 0
478 1.101359262666839 0.292360113507695 0
479 1.1763643016028 0.2749782198267167 0
480 1.197123384763277 0.3452067706653113 0
481 0.5074154186023483 0.7459978957408337 0
482 0.5536856677560552 0.779109611834196 0
483 0.5156468027107484 0.8293910489478051 0
484 0.5269149819548768 1.193990594681714 0
485 0.4422695374119715 1.208129059119846 0
486 0.821513982241187 0.5360048187827242 0
487 0.7674566030815979 0.4864530478163069 0
488 0.8169477773455933 0.4350431805801561 0
489 0.8710051565051824 0.4845949515465735 0
490 0.05657252658407511 0.7336636563395211 0
491 0.1141858483314037 0.758854133137864 0
492 1.399496388791474 0.888633692608958 0
493 1.415192815780422 0.9495743734094926 0
494 1.347259203366657 0.905397673815741 0
495 0.9791504172364769 1.315727148186952 0
496 0.9682772318906947 1.377830769312921 0
497 0.9002461789888657 1.365084220953677 0
498 0.1371149948352651 0.9728077678546031 0
499 0.06268627231960994 1.010599235154004 0
500 1.27857600312723 0.9121125251213928 0
501 1.202704503669697 1.011130098792154 0
502 1.196732948495952 0.917616014290785 0
503 0.1677352955545015 0.7075307657529882 0
504 0.2210565054938952 0.7605205505277122 0
505 1.344376832326062 0.8314957700098247 0
506 1.275693632086635 0.8382106213154765 0
507 1.268655559281272 0.3441300704071436 0
508 1.273472085951878 0.4375432529337462 0
509 1.201939911433883 0.4386199531919139 0
510 0.3453101357886936 1.205149581062705 0
511 0.4420346825098428 1.277649773586002 0
512 0.3450752808865649 1.274670295528861 0
513 0.7660563405518267 0.3805158626818694 0
514 0.821109568479881 0.3299562788858732 0
515 0.8720010052736475 0.3844835967841599 0
516 1.086638825266662 1.080096162238025 0
517 1.10459588629315 0.9922778123569393 0
518 0.8209428615165291 0.6538544373611357 0
519 0.7512860595718858 0.787436041009353 0
520 0.9765664398366777 1.149348926190715 0
521 0.6460738352798405 0.3854207439949947 0
522 0.9980876352079699 0.1775848786924844 0
523 0.9392634331257737 0.2305234980955936 0
524 0.8819615996536285 0.1692214362519302 0
525 1.118543723549242 0.1913603427172178 0
526 0.9060256157526658 0.4356654592905095 0
527 0.9586887700442742 0.4722391980452989 0
528 0.9236683107967909 0.5211686903013629 0
529 1.062985391550356 0.1254515381338444 0
530 1.053645967206856 0.2434936832758578 0
531 0.6734811177856668 1.066673879979288 0
532 0.6909516086677159 1.143795397872956 0
533 0.6127520171115413 1.160313838379429 0
534 0.750497923442625 0.9833933546472273 0
535 0.768177902836285 0.8858728693705169 0
536 0.8570559737985173 0.9012179242200974 0
537 0.1795776437542367 1.023724167843687 0
538 0.2418368486932509 1.076097901134197 0
539 0.1904886045299249 1.131007614136176 0
540 0.1282293995909107 1.078633880845667 0
541 0.5669081468100515 0.9077982302159983 0
542 0.6635368807936999 0.9012405017862716 0
543 0.6695157713432809 0.9865403031320235 0
544 1.435283843095994 0.2664502257039852 0
545 1.441609082972602 0.3800408024016506 0
546 1.376892926068596 0.33399102810695 0
547 0.3342293047751226 1.380103651374997 0
548 0.3808520144721107 1.44287836314786 0
549 0.2658772903038868 1.437225288227137 0
550 1.189181105930513 0.5192304731021304 0
551 1.155520198741059 0.6021679154858666 0
552 1.127958096681567 0.688042721321773 0
553 1.045225721830926 0.6664743971712568 0
554 0.06554312727130074 1.130534645694081 0
555 0.1382354968965842 1.208846332185201 0
556 0.07269236962528347 1.265811686492854 0
557 0.7386160892495132 1.269876085466741 0
558 0.6770145746821787 1.297919842646068 0
559 0.6461026043863903 1.237057734981652 0
560 0.7077041189537248 1.209013977802325 0
561 1.118575603756546 0.7635078257319101 0
562 1.126276019517643 0.8359603070913251 0
563 1.06519192606361 0.8404205959177476 0
564 1.057491510302513 0.7679681145583326 0
565 0.7026003640368577 0.4463378218577411 0
566 0.7319818314118218 0.5365279179910292 0
567 0.6671255923670816 0.4964126920324635 0
568 0.1880174153692437 0.9396779405467047 0
569 0.2304800642882152 0.9905943405357889 0
570 0.2739674667764576 1.18747592975719 0
571 1.041642782573561 0.8964612751345291 0
572 1.121199110602033 0.9134614887883401 0
573 0.8458921943494591 1.359292794298103 0
574 0.8982744594817125 1.447085100066341 0
575 0.8439204748423059 1.441293673410766 0
576 1.461512614776799 0.8446681932700251 0
577 1.461552659823749 0.8937779636445053 0
578 1.399456343744524 0.8395239222344777 0
579 1.21474484195812 0.6910639987774323 0
580 1.235408289238776 0.6305549868662526 0
581 1.29765024209283 0.6452828246897668 0
582 1.276986794812174 0.7057918366009466 0
583 0.4534621563264182 0.6880253938616705 0
584 0.5056905690887049 0.6388587680462865 0
585 0.256223759768866 0.8703813417386337 0
586 0.2599187160989857 0.9361973084698106 0
587 0.9027178515047904 1.152161802368298 0
588 0.981959627171476 1.234483085833847 0
589 0.7996113593841792 1.352333922175719 0
590 0.8039545450258971 1.29862123512395 0
591 0.2913244656514437 1.019966337634922 0
592 1.201809857411563 0.8401148325937701 0
593 0.4660015644184933 0.9495595665201761 0
594 0.0479467335555772 1.390469946691538 0
595 0.1206391031808607 1.343781633183352 0
596 0.1154205463668691 0.6589170098316623 0
597 0.1725765370471383 0.5939399490428932 0
598 0.5735372267549771 0.6070186850692499 0
599 0.7095298117948095 0.319598784819123 0
600 0.5838619904062478 0.8392592979374893 0
601 0.4986929591145521 0.8979299812263142 0
602 0.3398741399175143 0.7251557592701265 0
603 0.2859788107898593 0.8003082328022124 0
604 0.826411356728596 0.1100827103951292 0
605 0.7606553224700736 0.05364078578526304 0
606 1.446778130504934 0.1204468731758415 0
607 0.1104467335557522 1.452969946691191 0
608 0.6244877388590799 0.580551372995205 0
609 0.8162604842829438 1.123344940263872 0
610 0.8349774969259975 1.179207777771277 0
611 0.4440423158206783 1.386760053605781 0
612 0.500690301349793 1.443881690457922 0
613 1.443300108704018 0.4979763797939593 0
614 1.384909191676619 0.440517182197373 0
615 0.8283947711551608 0.2198534861808168 0
616 0.8789630484998432 0.2800198950541227 0
617 0.7705412911351986 0.2697898700125673 0
618 0.290126508361842 1.115692657372311 0
619 1.382981705240088 0.2010540441393455 0
620 1.452955489404152 0.2201387269050112 0
621 0.217152278023406 1.455492989089612 0
622 0.1958603967918487 1.388220862117179 0
623 1.2053623490331 0.7665291031875693 0
624 1.279246123708172 0.7646248919092757 0
625 0.9959258919523094 0.2979400372091325 0
626 0.9356255073263788 0.3474364341676617 0
627 0.9816502422080107 0.8720388472628324 0
628 1.042333714348211 1.314891300227162 0
629 1.339488440126741 0.3874423498051759 0
630 0.3894053058403174 1.343045697362666 0
631 1.324910984071795 1.195148978829873 0
632 0.9696501178053971 0.3986182966740113 0
633 0.8815332065176589 0.6021595810117193 0
634 0.7609236372400573 0.5876996751321406 0
635 1.446921991743322 0.6152651515677308 0
636 1.454874553746328 0.7221990682708879 0
637 1.40179654548965 0.6499642198412622 0
638 0.6734233202280602 1.395265905224788 0
639 0.7387514518741186 1.449054067272215 0
640 0.6221718683558584 1.446211837952573 0
641 0.6466450375293007 0.8028036734251076 0
642 0.7324338160995219 0.10755227701412 0
643 0.6592784936305649 0.05391149122885697 0
644 1.392844951253303 1.456888130931711 0
645 1.455344951252784 1.394388130931471 0
646 1.345970282639604 1.459170763443868 0
647 1.385349317088421 1.391253924048092 0
648 1.454396041130966 1.34805164183404 0
649 0.6839531766216145 0.1499914205679475 0
650 1.359048328208667 0.6875060540105571 0
651 0.7264818484666418 1.353721858005542 0
652 0.7544632698850109 1.063526931494492 0
653 0.679631104760212 0.5670041175079849 0
654 0.3880285255911464 0.6497631434284992 0
655 0.7576472852830796 1.126883009504266 0
656 0.7743997955690884 1.192101589433634 0
657 1.361307657104665 0.7463391093188864 0
658 0.7243638887522208 0.2031539038778434 0
659 0.7728445282301283 0.1607147603240159 0
660 0.7559212811362015 1.31570803949828 0
661 0.7701719267146194 1.390347740682981 0
662 1.416387168523127 0.7543672615435393 0
663 0.7866493531392088 1.252789281092411 0
664 0.1400990115786332 1.408462935780803 0
665 1.399733619909086 0.1530856000816619 0
666 1.005199385698059 0.815998168046051 0
667 1.021859910868211 0.7336862429982943 0
668 0.9539710189385109 0.6388186666014579 0
669 1.625 0.1249999999995652 0
670 1.75 0.1249999999995944 0
671 1.875 0.1249999999995732 0
672 1.625 0.2499999999991661 0
673 1.75 0.2499999999992317 0
674 1.875 0.2499999999991819 0
675 1.625 0.3749999999988271 0
676 1.75 0.3749999999989327 0
677 1.875 0.3749999999988494 0
678 1.625 0.4999999999985639 0
679 1.75 0.4999999999987148 0
680 1.875 0.49999999999859 0
681 1.625 0.6249999999983942 0
682 1.75 0.6249999999985905 0
683 1.875 0.624999999998423 0
684 1.625 0.7499999999983431 0
685 1.75 0.7499999999985683 0
686 1.875 0.7499999999983717 0
687 1.625 0.8749999999984448 0
688 1.75 0.874999999998649 0
689 1.875 0.8749999999984711 0
690 1.625 0.9999999999986549 0
691 1.75 0.9999999999988197 0
692 1.875 0.9999999999986775 0
693 1.625 1.124999999998939 0
694 1.75 1.124999999999061 0
695 1.875 1.124999999998957 0
696 1.625 1.249999999999272 0
697 1.75 1.249999999999352 0
698 1.875 1.249999999999284 0
699 1.625 1.374999999999631 0
700 1.75 1.374999999999671 0
701 1.875 1.374999999999637 0
702 1.625 0.06249999999978262 0
703 1.5625 0.1249999999995174 0
704 1.75 0.06249999999979727 0
705 1.6875 0.1249999999995799 0
706 1.875 0.06249999999978662 0
707 1.8125 0.1249999999995839 0
708 1.9375 0.1249999999995214 0
709 1.625 0.1874999999993657 0
710 1.5625 0.2499999999990391 0
711 1.75 0.1874999999994131 0
712 1.6875 0.2499999999991989 0
713 1.875 0.1874999999993775 0
714 1.8125 0.2499999999992067 0
715 1.9375 0.2499999999990469 0
716 1.625 0.3124999999989967 0
717 1.5625 0.3749999999986431 0
718 1.75 0.3124999999990823 0
719 1.6875 0.3749999999988799 0
720 1.875 0.3124999999990157 0
721 1.8125 0.3749999999988911 0
722 1.9375 0.3749999999986544 0
723 1.625 0.4374999999986955 0
724 1.5625 0.4999999999982889 0
725 1.75 0.4374999999988237 0
726 1.6875 0.4999999999986393 0
727 1.875 0.4374999999987198 0
728 1.8125 0.4999999999986525 0
729 1.9375 0.4999999999983022 0
730 1.625 0.562499999998479 0
731 1.5625 0.6249999999979814 0
732 1.75 0.5624999999986526 0
733 1.6875 0.6249999999984923 0
734 1.875 0.5624999999985065 0
735 1.8125 0.6249999999985065 0
736 1.9375 0.6249999999979957 0
737 1.625 0.6874999999983686 0
738 1.5625 0.7499999999977438 0
739 1.75 0.6874999999985794 0
740 1.6875 0.7499999999984556 0
741 1.875 0.6874999999983975 0
742 1.8125 0.7499999999984701 0
743 1.9375 0.749999999997758 0
744 1.625 0.8124999999983941 0
745 1.5625 0.8749999999980238 0
746 1.75 0.8124999999986086 0
747 1.6875 0.8749999999985469 0
748 1.875 0.8124999999984215 0
749 1.8125 0.87499999999856 0
750 1.9375 0.8749999999980369 0
751 1.625 0.9374999999985498 0
752 1.5625 0.999999999998369 0
753 1.75 0.9374999999987343 0
754 1.6875 0.9999999999987371 0
755 1.875 0.9374999999985743 0
756 1.8125 0.9999999999987486 0
757 1.9375 0.9999999999983802 0
758 1.625 1.062499999998797 0
759 1.5625 1.124999999998751 0
760 1.75 1.06249999999894 0
761 1.6875 1.124999999999 0
762 1.875 1.062499999998817 0
763 1.8125 1.124999999999009 0
764 1.9375 1.12499999999876 0
765 1.625 1.187499999999106 0
766 1.5625 1.249999999999157 0
767 1.75 1.187499999999206 0
768 1.6875 1.249999999999312 0
769 1.875 1.18749999999912 0
770 1.8125 1.249999999999318 0
771 1.9375 1.249999999999163 0
772 1.625 1.312499999999452 0
773 1.5625 1.374999999999576 0
774 1.75 1.312499999999512 0
775 1.6875 1.374999999999651 0
776 1.875 1.31249999999946 0
777 1.8125 1.374999999999654 0
778 1.9375 1.374999999999579 0
779 1.625 1.437499999999816 0
780 1.75 1.437499999999836 0
781 1.875 1.437499999999819 0
782 1.625 1.625 0
783 1.625 1.75 0
784 1.625 1.875 0
785 1.75 1.625 0
786 1.75 1.75 0
787 1.75 1.875 0
788 1.875 1.625 0
789 1.875 1.75 0
790 1.875 1.875 0
791 1.625 1.5625 0
792 1.5625 1.625 0
793 1.625 1.6875 0
794 1.5625 1.75 0
795 1.625 1.8125 0
796 1.5625 1.875 0
797 1.625 1.9375 0
798 1.75 1.5625 0
799 1.6875 1.625 0
800 1.75 1.6875 0
801 1.6875 1.75 0
802 1.75 1.8125 0
803 1.6875 1.875 0
804 1.75 1.9375 0
805 1.875 1.5625 0
806 1.8125 1.625 0
807 1.875 1.6875 0
808 1.8125 1.75 0
809 1.875 1.8125 0
810 1.8125 1.875 0
811 1.875 1.9375 0
812 1.9375 1.625 0
813 1.9375 1.75 0
814 1.9375 1.875 0
815 1.375000000000389 1.875 0
816 1.375000000000309 1.75 0
817 1.375000000000383 1.625 0
818 1.250000000000695 1.875 0
819 1.250000000000576 1.75 0
820 1.250000000000684 1.625 0
821 1.12500000000089 1.875 0
822 1.125000000000783 1.75 0
823 1.125000000000875 1.625 0
824 1.000000000001021 1.875 0
825 1.000000000000928 1.75 0
826 1.000000000001002 1.625 0
827 0.8750000000011331 1.875 0
828 0.8750000000010107 1.75 0
829 0.8750000000011127 1.625 0
830 0.7500000000011808 1.875 0
831 0.7500000000010254 1.75 0
832 0.7500000000011605 1.625 0
833 0.6250000000011149 1.875 0
834 0.6250000000009683 1.75 0
835 0.6250000000010959 1.625 0
836 0.5000000000009674 1.875 0
837 0.5000000000008471 1.75 0
838 0.5000000000009515 1.625 0
839 0.3750000000007646 1.875 0
840 0.3750000000006748 1.75 0
841 0.3750000000007518 1.625 0
842 0.2500000000005254 1.875 0
843 0.2500000000004661 1.75 0
844 0.2500000000005167 1.625 0
845 0.1250000000002662 1.875 0
846 0.1250000000002367 1.75 0
847 0.1250000000002616 1.625 0
848 1.375000000000713 1.9375 0
849 1.437500000000195 1.875 0
850 1.375000000000349 1.8125 0
851 1.437500000000154 1.75 0
852 1.375000000000346 1.6875 0
853 1.437500000000191 1.625 0
854 1.37500000000071 1.5625 0
855 1.250000000001139 1.9375 0
856 1.312500000000542 1.875 0
857 1.250000000000635 1.8125 0
858 1.312500000000442 1.75 0
859 1.25000000000063 1.6875 0
860 1.312500000000534 1.625 0
861 1.250000000001133 1.5625 0
862 1.12500000000109 1.9375 0
863 1.187500000000792 1.875 0
864 1.125000000000836 1.8125 0
865 1.187500000000679 1.75 0
866 1.125000000000829 1.6875 0
867 1.187500000000779 1.625 0
868 1.125000000001082 1.5625 0
869 1.000000000000994 1.9375 0
870 1.062500000000955 1.875 0
871 1.000000000000974 1.812500000000001 0
872 1.062500000000855 1.75 0
873 1.000000000000965 1.6875 0
874 1.062500000000938 1.625 0
875 1.000000000000985 1.5625 0
876 0.8750000000013307 1.9375 0
877 0.9375000000010768 1.875 0
878 0.8750000000010717 1.8125 0
879 0.9375000000009694 1.75 0
880 0.8750000000010617 1.6875 0
881 0.9375000000010574 1.625 0
882 0.8750000000013204 1.5625 0
883 0.7500000000016311 1.9375 0
884 0.8125000000011569 1.875 0
885 0.7500000000011031 1.8125 0
886 0.812500000001018 1.75 0
887 0.7500000000010931 1.6875 0
888 0.8125000000011366 1.625 0
889 0.7500000000016211 1.5625 0
890 0.6250000000014337 1.9375 0
891 0.687500000001148 1.875 0
892 0.6250000000010416 1.8125 0
893 0.6875000000009971 1.75 0
894 0.6250000000010323 1.6875 0
895 0.6875000000011283 1.625 0
896 0.625000000001424 1.5625 0
897 0.5000000000011843 1.9375 0
898 0.5625000000010412 1.875 0
899 0.5000000000009072 1.8125 0
900 0.5625000000009077 1.75 0
901 0.5000000000008992 1.6875 0
902 0.5625000000010238 1.625 0
903 0.5000000000011762 1.5625 0
904 0.3750000000009073 1.9375 0
905 0.4375000000008661 1.875 0
906 0.3750000000007199 1.8125 0
907 0.4375000000007607 1.75 0
908 0.3750000000007132 1.6875 0
909 0.4375000000008515 1.625 0
910 0.3750000000009009 1.5625 0
911 0.2500000000006126 1.9375 0
912 0.312500000000645 1.875 0
913 0.2500000000004956 1.8125 0
914 0.3125000000005704 1.75 0
915 0.2500000000004914 1.6875 0
916 0.3125000000006342 1.625 0
917 0.2500000000006084 1.5625 0
918 0.125000000000308 1.9375 0
919 0.1875000000003957 1.875 0
920 0.1250000000002514 1.8125 0
921 0.1875000000003513 1.75 0
922 0.1250000000002491 1.6875 0
923 0.1875000000003892 1.625 0
924 0.1250000000003058 1.5625 0
925 0.062500000000133 1.875 0
926 0.06250000000011835 1.75 0
927 0.06250000000013078 1.625 0
928 0.2325737077329884 0.2325737086176216 0
929 0.356961800627806 0.1191668660374175 0
930 0.1191668654250085 0.3569618008642992 0
931 0.1205634383728541 0.1205634388127183 0
932 0.2267329226768703 0.3364928103105722 0
933 0.1175719014872556 0.2395218833156069 0
934 0.2395218829187599 0.1175719020935506 0
935 0.3364928102933252 0.2267329235737966 0
936 0.2383664613387021 0.3847527561012416 0
937 0.2901431566354075 0.3450231004515875 0
938 0.3450231004436349 0.2901431570831997 0
939 0.3847527560929473 0.2383664617865951 0
940 0.1227817191862799 0.06028171940635913 0
941 0.06028171918642704 0.122781719406212 0
942 0.1242881939882439 0.4199623570043873 0
943 0.05958343271250423 0.3659809004319849 0
944 0.3659809003137383 0.05958343301870874 0
945 0.4199623568862155 0.1242881942941696 0
946 0.05878595074362781 0.2447609416574768 0
947 0.118369383456132 0.2982418420899531 0
948 0.298241841773283 0.1183693840654841 0
949 0.2447609414590533 0.05878595104677532 0
950 0.1729498940509394 0.3467273055874357 0
951 0.2845332590131568 0.2296533160957091 0
952 0.2360477953258742 0.1750728053555861 0
953 0.3467273054605656 0.172949894805607 0
954 0.175072804610122 0.2360477959666142 0
955 0.2296533152049294 0.2845332594640969 0
956 0.1190676699300549 0.1800426610641626 0
957 0.180042660645807 0.1190676704531345 0
$EndNodes
$Elements
390
1 15 2 11 1 1
2 15 2 12 5 5
3 8 2 6 1 1 12 15
4 8 2 7 1 1 12 15
5 8 2 6 1 12 13 16
6 8 2 7 1 12 13 16
7 8 2 6 1 13 14 17
8 8 2 7 1 13 14 17
9 8 2 6 1 14 5 18
10 8 2 7 1 14 5 18
11 8 2 4 2 2 19 30
12 8 2 4 2 19 20 31
13 8 2 4 2 20 21 32
14 8 2 4 2 21 22 33
15 8 2 4 2 22 23 34
16 8 2 4 2 23 24 35
17 8 2 4 2 24 25 36
18 8 2 4 2 25 26 37
19 8 2 4 2 26 27 38
20 8 2 4 2 27 28 39
21 8 2 4 2 28 29 40
22 8 2 4 2 29 3 41
23 8 2 4 3 3 42 53
24 8 2 4 3 42 43 54
25 8 2 4 3 43 44 55
26 8 2 4 3 44 45 56
27 8 2 4 3 45 46 57
28 8 2 4 3 46 47 58
29 8 2 4 3 47 48 59
30 8 2 4 3 48 49 60
31 8 2 4 3 49 50 61
32 8 2 4 3 50 51 62
33 8 2 4 3 51 52 63
34 8 2 4 3 52 4 64
35 8 2 5 4 4 65 72
36 8 2 10 4 4 65 72
37 8 2 5 4 65 66 73
38 8 2 10 4 65 66 73
39 8 2 5 4 66 67 74
40 8 2 10 4 66 67 74
41 8 2 5 4 67 68 75
42 8 2 10 4 67 68 75
43 8 2 5 4 68 69 76
44 8 2 10 4 68 69 76
45 8 2 5 4 69 70 77
46 8 2 10 4 69 70 77
47 8 2 5 4 70 71 78
48 8 2 10 4 70 71 78
49 8 2 5 4 71 11 79
50 8 2 10 4 71 11 79
51 8 2 6 5 5 80 87
52 8 2 9 5 5 80 87
53 8 2 6 5 80 81 88
54 8 2 9 5 80 81 88
55 8 2 6 5 81 82 89
56 8 2 9 5 81 82 89
57 8 2 6 5 82 83 90
58 8 2 9 5 82 83 90
59 8 2 6 5 83 84 91
60 8 2 9 5 83 84 91
61 8 2 6 5 84 85 92
62 8 2 9 5 84 85 92
63 8 2 6 5 85 86 93
64 8 2 9 5 85 86 93
65 8 2 6 5 86 2 94
66 8 2 9 5 86 2 94
67 8 2 6 6 2 95 98
68 8 2 9 6 2 95 98
69 8 2 6 6 95 96 99
70 8 2 9 6 95 96 99
71 8 2 6 6 96 97 100
72 8 2 9 6 96 97 100
73 8 2 6 6 97 6 101
74 8 2 9 6 97 6 101
75 8 2 5 9 4 116 119
76 8 2 10 9 4 116 119
77 8 2 5 9 116 117 120
78 8 2 10 9 116 117 120
79 8 2 5 9 117 118 121
80 8 2 10 9 117 118 121
81 8 2 5 9 118 10 122
82 8 2 10 9 118 10 122
83 8 2 8 14 5 183 188
84 8 2 8 14 183 184 189
85 8 2 8 14 184 185 190
86 8 2 8 14 185 186 191
87 8 2 8 14 186 187 192
88 8 2 8 14 187 11 193
89 8 2 5 15 1 194 197
90 8 2 5 15 194 195 198
91 8 2 5 15 195 196 199
92 8 2 5 15 196 11 200
93 9 2 3 5 185 186 932 191 936 937
94 9 2 3 5 184 185 935 190 938 939
95 16 2 2 1 259 208 232 349 350 351 352 353
96 16 2 2 1 335 251 69 243 354 355 356 357
97 16 2 2 1 85 308 247 84 358 359 360 92
98 16 2 2 1 290 244 82 83 361 362 90 363
99 16 2 2 1 248 289 297 223 364 365 366 367
100 16 2 2 1 246 286 254 203 368 369 370 371
101 16 2 2 1 270 214 277 236 372 373 374 375
102 16 2 2 1 276 218 283 237 376 377 378 379
103 16 2 2 1 80 265 183 5 380 381 188 87
104 16 2 2 1 321 310 266 212 382 383 384 385
105 16 2 2 1 322 213 267 309 386 387 388 389
106 16 2 2 1 305 201 328 238 390 391 392 393
107 16 2 2 1 236 44 45 282 394 56 395 396
108 16 2 2 1 237 283 26 27 378 397 38 398
109 16 2 2 1 203 284 227 268 399 400 401 402
110 16 2 2 1 71 11 187 272 79 193 403 404
111 16 2 2 1 308 240 260 209 405 406 407 408
112 16 2 2 1 325 210 261 241 409 410 411 412
113 16 2 2 1 239 221 291 265 413 414 415 416
114 16 2 2 1 202 274 230 287 417 418 419 420
115 16 2 2 1 278 345 256 214 421 422 423 424
116 16 2 2 1 277 214 256 346 373 423 425 426
117 16 2 2 1 226 264 220 292 427 428 429 430
118 16 2 2 1 237 27 28 278 398 39 431 432
119 16 2 2 1 236 277 43 44 374 433 55 394
120 16 2 2 1 245 202 249 269 434 435 436 437
121 16 2 2 1 211 349 329 254 438 439 440 441
122 16 2 2 1 315 262 273 224 442 443 444 445
123 16 2 2 1 252 294 281 217 446 447 448 449
124 16 2 2 1 226 304 233 264 450 451 452 427
125 16 2 2 1 276 302 270 204 453 454 455 456
126 16 2 2 1 270 307 279 204 457 458 459 455
127 16 2 2 1 288 242 299 219 460 461 462 463
128 16 2 2 1 295 242 288 186 464 460 465 466
129 16 2 2 1 185 184 291 248 190 467 468 469
130 16 2 2 1 273 263 258 224 470 471 472 444
131 16 2 2 1 323 308 85 86 473 358 93 474
132 16 2 2 1 248 223 298 295 367 475 476 477
133 16 2 2 1 245 269 318 209 437 478 479 480
134 16 2 2 1 232 208 263 319 351 481 482 483
135 16 2 2 1 203 268 322 246 402 484 485 371
136 16 2 2 1 216 280 257 231 486 487 488 489
137 16 2 2 1 69 70 303 243 77 490 491 356
138 16 2 2 1 253 326 283 218 492 493 377 494
139 16 2 2 1 252 217 282 327 449 495 496 497
140 16 2 2 1 69 251 301 68 355 498 499 76
141 16 2 2 1 285 218 276 255 500 376 501 502
142 16 2 2 1 303 219 335 243 503 504 357 491
143 16 2 2 1 248 295 186 185 477 466 191 469
144 16 2 2 1 229 253 218 285 505 494 500 506
145 16 2 2 1 209 234 321 245 507 508 509 480
146 16 2 2 1 210 246 322 235 510 485 511 512
147 16 2 2 1 231 257 300 344 488 513 514 515
148 16 2 2 1 276 204 292 255 456 516 517 501
149 16 2 2 1 273 262 328 201 443 518 391 519
150 16 2 2 1 204 279 226 292 459 520 430 516
151 16 2 2 1 291 221 289 248 414 521 364 468
152 16 2 2 1 290 222 314 244 522 523 524 361
153 16 2 2 1 308 209 318 247 408 479 525 359
154 16 2 2 1 216 231 342 287 489 526 527 528
155 16 2 2 1 290 247 318 222 529 525 530 522
156 16 2 2 1 268 227 311 271 401 531 532 533
157 16 2 2 1 233 317 201 264 534 535 536 452
158 16 2 2 1 301 225 337 250 537 538 539 540
159 16 2 2 1 227 284 215 317 400 541 542 543
160 16 2 2 1 260 20 21 348 544 32 545 546
161 16 2 2 1 261 347 50 51 547 548 62 549
162 16 2 2 1 202 245 321 274 434 509 550 417
163 16 2 2 1 274 275 306 230 551 552 553 418
164 16 2 2 1 67 250 325 66 554 555 556 74
165 16 2 2 1 343 333 213 271 557 558 559 560
166 16 2 2 1 306 206 293 336 561 562 563 564
167 16 2 2 1 289 257 280 205 565 487 566 567
168 16 2 2 1 301 251 316 225 498 568 569 537
169 16 2 2 1 271 213 322 268 559 386 484 533
170 16 2 2 1 325 250 337 210 555 539 570 409
171 16 2 2 1 292 220 293 255 429 571 572 517
172 16 2 2 1 339 252 327 46 573 497 574 575
173 16 2 2 1 338 25 326 253 576 577 492 578
174 16 2 2 1 341 275 212 332 579 580 581 582
175 16 2 2 1 263 208 298 258 481 583 584 471
176 16 2 2 1 335 211 316 251 585 586 568 354
177 16 2 2 1 217 281 226 279 448 587 520 588
178 16 2 2 1 294 252 339 228 446 573 589 590
179 16 2 2 1 225 316 211 254 569 586 441 591
180 16 2 2 1 255 293 206 285 572 562 592 502
181 16 2 2 1 254 329 284 203 440 593 399 370
182 16 2 2 1 324 65 66 325 594 73 556 595
183 16 2 2 1 303 272 288 219 596 597 463 503
184 16 2 2 1 298 223 297 258 475 366 598 584
185 16 2 2 1 289 221 300 257 521 599 513 565
186 16 2 2 1 232 319 215 284 483 600 541 601
187 16 2 2 1 335 219 299 259 504 462 602 603
188 16 2 2 1 275 274 321 212 551 550 385 580
189 16 2 2 1 247 290 83 84 529 363 91 360
190 16 2 2 1 265 291 184 183 415 467 189 381
191 16 2 2 1 186 288 272 187 465 597 403 192
192 16 2 2 1 244 296 81 82 604 605 89 362
193 16 2 2 1 70 71 272 303 78 404 596 490
194 16 2 2 1 86 2 19 323 94 30 606 474
195 16 2 2 1 52 4 65 324 64 72 594 607
196 16 2 2 1 224 258 297 315 472 598 608 445
197 16 2 2 1 207 304 226 281 609 450 587 610
198 16 2 2 1 49 50 347 309 61 548 611 612
199 16 2 2 1 22 310 348 21 613 614 545 33
200 16 2 2 1 334 314 344 300 615 616 514 617
201 16 2 2 1 254 286 337 225 369 618 538 591
202 16 2 2 1 20 260 240 330 544 406 619 620
203 16 2 2 1 51 331 241 261 621 622 411 549
204 16 2 2 1 229 285 206 341 506 592 623 624
205 16 2 2 1 222 249 344 314 625 626 616 523
206 16 2 2 1 250 67 68 301 554 75 499 540
207 16 2 2 1 201 305 220 264 390 627 428 536
208 16 2 2 1 282 307 270 236 628 457 375 396
209 16 2 2 1 209 260 348 234 407 546 629 507
210 16 2 2 1 210 235 347 261 512 630 547 410
211 16 2 2 1 249 222 318 269 625 530 478 436
212 16 2 2 1 278 302 276 237 631 453 379 432
213 16 2 2 1 249 202 287 342 435 420 527 632
214 16 2 2 1 280 216 328 262 486 633 518 634
215 16 2 2 1 284 329 349 232 593 439 352 601
216 16 2 2 1 266 23 24 312 635 35 636 637
217 16 2 2 1 267 313 47 48 638 639 59 640
218 16 2 2 1 48 49 309 267 60 612 388 640
219 16 2 2 1 23 266 310 22 635 383 613 34
220 16 2 2 1 273 215 319 263 641 600 482 470
221 16 2 2 1 278 214 270 302 424 372 454 631
222 16 2 2 1 296 320 80 81 642 643 88 605
223 16 2 2 1 29 3 42 340 41 53 644 645
224 16 2 2 1 42 346 256 340 646 425 647 644
225 16 2 2 1 29 340 256 345 645 647 422 648
226 16 2 2 1 80 320 239 265 643 649 416 380
227 16 2 2 1 46 327 282 45 574 496 395 57
228 16 2 2 1 25 26 283 326 37 397 493 577
229 16 2 2 1 312 332 212 266 650 581 384 637
230 16 2 2 1 313 267 213 333 638 387 558 651
231 16 2 2 1 282 217 279 307 495 588 458 628
232 16 2 2 1 227 317 233 311 543 534 652 531
233 16 2 2 1 215 273 201 317 641 519 535 542
234 16 2 2 1 262 315 205 280 442 653 566 634
235 16 2 2 1 259 299 298 208 602 654 583 350
236 16 2 2 1 295 298 299 242 476 654 461 464
237 16 2 2 1 311 207 343 271 655 656 560 532
238 16 2 2 1 306 275 341 206 552 579 623 561
239 16 2 2 1 211 335 259 349 585 603 353 438
240 16 2 2 1 246 210 337 286 510 570 618 368
241 16 2 2 1 42 43 277 346 54 433 426 646
242 16 2 2 1 29 345 278 28 648 421 431 40
243 16 2 2 1 341 332 312 229 582 650 657 624
244 16 2 2 1 289 205 315 297 567 653 608 365
245 16 2 2 1 221 239 334 300 413 658 617 599
246 16 2 2 1 207 311 233 304 655 652 451 609
247 16 2 2 1 314 334 296 244 615 659 604 524
248 16 2 2 1 322 309 347 235 389 611 630 511
249 16 2 2 1 321 234 348 310 508 629 614 382
250 16 2 2 1 333 228 339 313 660 589 661 651
251 16 2 2 1 253 229 312 338 505 657 662 578
252 16 2 2 1 281 294 343 207 447 663 656 610
253 16 2 2 1 333 343 294 228 557 663 590 660
254 16 2 2 1 320 296 334 239 642 659 658 649
255 16 2 2 1 51 52 324 331 63 607 664 621
256 16 2 2 1 20 330 323 19 620 665 606 31
257 16 2 2 1 325 241 331 324 412 622 664 595
258 16 2 2 1 308 323 330 240 473 665 619 405
259 16 2 2 1 293 220 305 336 571 627 666 563
260 16 2 2 1 306 336 305 238 564 666 393 667
261 16 2 2 1 287 230 328 216 419 668 633 528
262 16 2 2 1 306 238 328 230 667 392 668 553
263 16 2 2 1 249 342 231 344 632 526 515 626
264 16 2 2 1 25 338 312 24 576 662 636 36
265 16 2 2 1 46 47 313 339 58 639 661 575
266 16 2 1 2 2 95 669 19 98 702 703 30
267 16 2 1 2 95 96 670 669 99 704 705 702
268 16 2 1 2 96 97 671 670 100 706 707 704
269 16 2 1 2 97 6 123 671 101 134 708 706
270 16 2 1 2 19 669 672 20 703 709 710 31
271 16 2 1 2 669 670 673 672 705 711 712 709
272 16 2 1 2 670 671 674 673 707 713 714 711
273 16 2 1 2 671 123 124 674 708 135 715 713
274 16 2 1 2 20 672 675 21 710 716 717 32
275 16 2 1 2 672 673 676 675 712 718 719 716
276 16 2 1 2 673 674 677 676 714 720 721 718
277 16 2 1 2 674 124 125 677 715 136 722 720
278 16 2 1 2 21 675 678 22 717 723 724 33
279 16 2 1 2 675 676 679 678 719 725 726 723
280 16 2 1 2 676 677 680 679 721 727 728 725
281 16 2 1 2 677 125 126 680 722 137 729 727
282 16 2 1 2 22 678 681 23 724 730 731 34
283 16 2 1 2 678 679 682 681 726 732 733 730
284 16 2 1 2 679 680 683 682 728 734 735 732
285 16 2 1 2 680 126 127 683 729 138 736 734
286 16 2 1 2 23 681 684 24 731 737 738 35
287 16 2 1 2 681 682 685 684 733 739 740 737
288 16 2 1 2 682 683 686 685 735 741 742 739
289 16 2 1 2 683 127 128 686 736 139 743 741
290 16 2 1 2 24 684 687 25 738 744 745 36
291 16 2 1 2 684 685 688 687 740 746 747 744
292 16 2 1 2 685 686 689 688 742 748 749 746
293 16 2 1 2 686 128 129 689 743 140 750 748
294 16 2 1 2 25 687 690 26 745 751 752 37
295 16 2 1 2 687 688 691 690 747 753 754 751
296 16 2 1 2 688 689 692 691 749 755 756 753
297 16 2 1 2 689 129 130 692 750 141 757 755
298 16 2 1 2 26 690 693 27 752 758 759 38
299 16 2 1 2 690 691 694 693 754 760 761 758
300 16 2 1 2 691 692 695 694 756 762 763 760
301 16 2 1 2 692 130 131 695 757 142 764 762
302 16 2 1 2 27 693 696 28 759 765 766 39
303 16 2 1 2 693 694 697 696 761 767 768 765
304 16 2 1 2 694 695 698 697 763 769 770 767
305 16 2 1 2 695 131 132 698 764 143 771 769
306 16 2 1 2 28 696 699 29 766 772 773 40
307 16 2 1 2 696 697 700 699 768 774 775 772
308 16 2 1 2 697 698 701 700 770 776 777 774
309 16 2 1 2 698 132 133 701 771 144 778 776
310 16 2 1 2 29 699 102 3 773 779 105 41
311 16 2 1 2 699 700 103 102 775 780 106 779
312 16 2 1 2 700 701 104 103 777 781 107 780
313 16 2 1 2 701 133 7 104 778 145 108 781
314 16 2 1 3 3 102 782 109 105 791 792 112
315 16 2 1 3 109 782 783 110 792 793 794 113
316 16 2 1 3 110 783 784 111 794 795 796 114
317 16 2 1 3 111 784 155 9 796 797 159 115
318 16 2 1 3 102 103 785 782 106 798 799 791
319 16 2 1 3 782 785 786 783 799 800 801 793
320 16 2 1 3 783 786 787 784 801 802 803 795
321 16 2 1 3 784 787 154 155 803 804 158 797
322 16 2 1 3 103 104 788 785 107 805 806 798
323 16 2 1 3 785 788 789 786 806 807 808 800
324 16 2 1 3 786 789 790 787 808 809 810 802
325 16 2 1 3 787 790 153 154 810 811 157 804
326 16 2 1 3 104 7 146 788 108 149 812 805
327 16 2 1 3 788 146 147 789 812 150 813 807
328 16 2 1 3 789 147 148 790 813 151 814 809
329 16 2 1 3 790 148 8 153 814 152 156 811
330 16 2 1 4 9 160 815 111 171 848 849 115
331 16 2 1 4 111 815 816 110 849 850 851 114
332 16 2 1 4 110 816 817 109 851 852 853 113
333 16 2 1 4 109 817 42 3 853 854 53 112
334 16 2 1 4 160 161 818 815 172 855 856 848
335 16 2 1 4 815 818 819 816 856 857 858 850
336 16 2 1 4 816 819 820 817 858 859 860 852
337 16 2 1 4 817 820 43 42 860 861 54 854
338 16 2 1 4 161 162 821 818 173 862 863 855
339 16 2 1 4 818 821 822 819 863 864 865 857
340 16 2 1 4 819 822 823 820 865 866 867 859
341 16 2 1 4 820 823 44 43 867 868 55 861
342 16 2 1 4 162 163 824 821 174 869 870 862
343 16 2 1 4 821 824 825 822 870 871 872 864
344 16 2 1 4 822 825 826 823 872 873 874 866
345 16 2 1 4 823 826 45 44 874 875 56 868
346 16 2 1 4 163 164 827 824 175 876 877 869
347 16 2 1 4 824 827 828 825 877 878 879 871
348 16 2 1 4 825 828 829 826 879 880 881 873
349 16 2 1 4 826 829 46 45 881 882 57 875
350 16 2 1 4 164 165 830 827 176 883 884 876
351 16 2 1 4 827 830 831 828 884 885 886 878
352 16 2 1 4 828 831 832 829 886 887 888 880
353 16 2 1 4 829 832 47 46 888 889 58 882
354 16 2 1 4 165 166 833 830 177 890 891 883
355 16 2 1 4 830 833 834 831 891 892 893 885
356 16 2 1 4 831 834 835 832 893 894 895 887
357 16 2 1 4 832 835 48 47 895 896 59 889
358 16 2 1 4 166 167 836 833 178 897 898 890
359 16 2 1 4 833 836 837 834 898 899 900 892
360 16 2 1 4 834 837 838 835 900 901 902 894
361 16 2 1 4 835 838 49 48 902 903 60 896
362 16 2 1 4 167 168 839 836 179 904 905 897
363 16 2 1 4 836 839 840 837 905 906 907 899
364 16 2 1 4 837 840 841 838 907 908 909 901
365 16 2 1 4 838 841 50 49 909 910 61 903
366 16 2 1 4 168 169 842 839 180 911 912 904
367 16 2 1 4 839 842 843 840 912 913 914 906
368 16 2 1 4 840 843 844 841 914 915 916 908
369 16 2 1 4 841 844 51 50 916 917 62 910
370 16 2 1 4 169 170 845 842 181 918 919 911
371 16 2 1 4 842 845 846 843 919 920 921 913
372 16 2 1 4 843 846 847 844 921 922 923 915
373 16 2 1 4 844 847 52 51 923 924 63 917
374 16 2 1 4 170 10 118 845 182 122 925 918
375 16 2 1 4 845 118 117 846 925 121 926 920
376 16 2 1 4 846 117 116 847 926 120 927 922
377 16 2 1 4 847 116 4 52 927 119 64 924
378 16 2 3 5 12 931 194 1 940 941 197 15
379 16 2 3 5 930 187 11 196 942 193 200 943
380 16 2 3 5 929 14 5 183 944 18 188 945
381 16 2 3 5 196 195 933 930 199 946 947 943
382 16 2 3 5 14 929 934 13 944 948 949 17
383 16 2 3 5 187 930 932 186 942 950 936 192
384 16 2 3 5 935 928 934 929 951 952 948 953
385 16 2 3 5 933 928 932 930 954 955 950 947
386 16 2 3 5 195 194 931 933 198 941 956 946
387 16 2 3 5 13 934 931 12 949 957 940 16
388 16 2 3 5 183 184 935 929 189 939 953 945
389 16 2 3 5 933 931 934 928 956 957 952 954
390 16 2 3 5 928 935 185 932 951 938 937 955
$EndElements
