<?xml version="1.0" encoding="UTF-8" standalone="no"?>
<!-- Created with Inkscape (http://www.inkscape.org/) -->

<svg
        xmlns:dc="http://purl.org/dc/elements/1.1/"
        xmlns:cc="http://creativecommons.org/ns#"
        xmlns:rdf="http://www.w3.org/1999/02/22-rdf-syntax-ns#"
        xmlns="http://www.w3.org/2000/svg"
        xmlns:sodipodi="http://sodipodi.sourceforge.net/DTD/sodipodi-0.dtd"
        xmlns:inkscape="http://www.inkscape.org/namespaces/inkscape"
        width="1920"
        height="1080"
        viewBox="0 0 508 285.75001"
        version="1.1"
        id="svg8"
        inkscape:version="0.92.4 (33fec40, 2019-01-16)"
        sodipodi:docname="result_list.svg">
  <defs
     id="defs2">
    <inkscape:path-effect
       only_selected="false"
       apply_with_weight="true"
       apply_no_weight="true"
       helper_size="0"
       steps="2"
       weight="33.333333"
       is_visible="true"
       id="path-effect5314"
       effect="bspline" />
    <inkscape:path-effect
       is_visible="true"
       id="path-effect5310"
       effect="spiro" />
    <inkscape:path-effect
       only_selected="false"
       apply_with_weight="true"
       apply_no_weight="true"
       helper_size="0"
       steps="2"
       weight="33.333333"
       is_visible="true"
       id="path-effect5314-9"
       effect="bspline" />
    <inkscape:path-effect
       is_visible="true"
       id="path-effect5310-1"
       effect="spiro" />
    <filter
       style="color-interpolation-filters:sRGB;"
       inkscape:label="Drop Shadow"
       id="filter2247">
      <feFlood
         flood-opacity="1"
         flood-color="rgb(0,0,0)"
         result="flood"
         id="feFlood2237" />
      <feComposite
         in="flood"
         in2="SourceGraphic"
         operator="in"
         result="composite1"
         id="feComposite2239" />
      <feGaussianBlur
         in="composite1"
         stdDeviation="1"
         result="blur"
         id="feGaussianBlur2241" />
      <feOffset
         dx="0.5"
         dy="0.5"
         result="offset"
         id="feOffset2243" />
      <feComposite
         in="SourceGraphic"
         in2="offset"
         operator="over"
         result="composite2"
         id="feComposite2245" />
    </filter>
  </defs>
  <sodipodi:namedview
          id="base"
          pagecolor="#ffffff"
          bordercolor="#00ffff"
          borderopacity="1"
          inkscape:pageopacity="0.0"
          inkscape:pageshadow="2"
          inkscape:zoom="0.70000001"
          inkscape:cx="996.87285"
          inkscape:cy="531.92024"
          inkscape:document-units="px"
          inkscape:current-layer="layer4"
          showgrid="true"
          units="px"
          inkscape:pagecheckerboard="true"
          borderlayer="true"
          inkscape:window-width="1920"
          inkscape:window-height="1016"
          inkscape:window-x="1050"
          inkscape:window-y="627"
          inkscape:window-maximized="1"
          inkscape:measure-start="1005,960"
          inkscape:measure-end="1005,845">
    <inkscape:grid
       type="xygrid"
       id="grid3989"
       color="#ff65ff"
       opacity="0.1254902"
       empcolor="#ff00ff"
       empopacity="0.25098039"
       dotted="true" />
  </sodipodi:namedview>
  <metadata
     id="metadata5">
    <rdf:RDF>
      <cc:Work
         rdf:about="">
        <dc:format>image/svg+xml</dc:format>
        <dc:type
           rdf:resource="http://purl.org/dc/dcmitype/StillImage" />
        <dc:title />
        <cc:license
           rdf:resource="http://artlibre.org/licence/lal" />
      </cc:Work>
      <cc:License
         rdf:about="http://artlibre.org/licence/lal">
        <cc:permits
           rdf:resource="http://creativecommons.org/ns#Reproduction" />
        <cc:permits
           rdf:resource="http://creativecommons.org/ns#Distribution" />
        <cc:permits
           rdf:resource="http://creativecommons.org/ns#DerivativeWorks" />
        <cc:requires
           rdf:resource="http://creativecommons.org/ns#ShareAlike" />
        <cc:requires
           rdf:resource="http://creativecommons.org/ns#Notice" />
        <cc:requires
           rdf:resource="http://creativecommons.org/ns#Attribution" />
      </cc:License>
    </rdf:RDF>
  </metadata>
  <g
     inkscape:groupmode="layer"
     id="layer4"
     inkscape:label="graphics"
     style="display:inline">
    <rect
       style="display:inline;opacity:0.8;fill:#ffffff;fill-opacity:1;stroke:none;stroke-width:0.96039587;stroke-linejoin:round;stroke-miterlimit:4;stroke-dasharray:none;stroke-opacity:0.1254902;filter:url(#filter2247)"
       id="rect5143"
       width="264.58334"
       height="285.74997"
       x="127"
       y="2.2529889e-08"
       ry="0"
       inkscape:label="background" />
    <g
       transform="translate(6.5544074e-4,138.78884)"
       style="display:inline"
       id="g1147-3"
       inkscape:label="bar">
      <path
         inkscape:label="color-e40d99ff"
         inkscape:connector-curvature="0"
         id="path3991-3-4"
         d="m 1.344444e-5,134.86684 c 507.99933655556,0 507.99933655556,0 507.99933655556,0"
         style="display:inline;fill:#e40d99;fill-opacity:1;stroke:#e40d99;stroke-width:0.5291667;stroke-linecap:butt;stroke-linejoin:miter;stroke-miterlimit:4;stroke-dasharray:none;stroke-opacity:1" />
      <path
         inkscape:label="color-7f0ea5ff"
         inkscape:connector-curvature="0"
         id="path3991-6-9"
         d="m 1.344444e-5,135.59248 c 507.99933655556,0 507.99933655556,0 507.99933655556,0"
         style="display:inline;fill:none;stroke:#7f0ea5;stroke-width:0.5291667;stroke-linecap:butt;stroke-linejoin:miter;stroke-miterlimit:4;stroke-dasharray:none;stroke-opacity:1" />
      <path
         inkscape:label="color-271688ff"
         inkscape:connector-curvature="0"
         id="path3991-7-2"
         d="m 1.344444e-5,136.31806 c 507.99933655556,0 507.99933655556,0 507.99933655556,0"
         style="display:inline;fill:none;stroke:#271688;stroke-width:0.5291667;stroke-linecap:butt;stroke-linejoin:miter;stroke-miterlimit:4;stroke-dasharray:none;stroke-opacity:1" />
      <path
         inkscape:label="color-0ca4dcff"
         inkscape:connector-curvature="0"
         id="path3991-62-7"
         d="M 1.2335365e-5,137.0437 C 507.99935,137.0437 507.99935,137.0437 507.99935,137.0437"
         style="display:inline;fill:none;stroke:#0ca4dc;stroke-width:0.5291667;stroke-linecap:butt;stroke-linejoin:miter;stroke-miterlimit:4;stroke-dasharray:none;stroke-opacity:1" />
      <path
         inkscape:label="color-0fb926ff"
         inkscape:connector-curvature="0"
         id="path3991-4"
         d="m 1.344444e-5,137.76934 c 507.99933655556,0 507.99933655556,0 507.99933655556,0"
         style="display:inline;fill:none;stroke:#0fb926;stroke-width:0.5291667;stroke-linecap:butt;stroke-linejoin:miter;stroke-miterlimit:4;stroke-dasharray:none;stroke-opacity:1" />
      <path
         inkscape:label="color-abd70bff"
         inkscape:connector-curvature="0"
         id="path3991-35-2"
         d="m 1.344444e-5,138.49495 c 507.99933655556,0 507.99933655556,0 507.99933655556,0"
         style="display:inline;fill:none;stroke:#abd70b;stroke-width:0.5291667;stroke-linecap:butt;stroke-linejoin:miter;stroke-miterlimit:4;stroke-dasharray:none;stroke-opacity:1" />
      <path
         inkscape:label="color-fed60fff"
         inkscape:connector-curvature="0"
         id="path3991-5-5"
         d="m 1.344444e-5,139.22059 c 507.99933655556,0 507.99933655556,0 507.99933655556,0"
         style="display:inline;fill:none;stroke:#fed60f;stroke-width:0.5291667;stroke-linecap:butt;stroke-linejoin:miter;stroke-miterlimit:4;stroke-dasharray:none;stroke-opacity:1" />
      <path
         inkscape:label="color-fa9e0dff"
         inkscape:connector-curvature="0"
         id="path3991-9-2"
         d="m 1.244618e-6,139.94622 c 507.999368755382,0 507.999368755382,0 507.999368755382,0"
         style="display:inline;fill:none;stroke:#fa9e0d;stroke-width:0.5291667;stroke-linecap:butt;stroke-linejoin:miter;stroke-miterlimit:4;stroke-dasharray:none;stroke-opacity:1" />
      <path
         inkscape:label="color-ce0f0fff"
         inkscape:connector-curvature="0"
         id="path3991-9-7-4"
         d="M 2.3536927e-6,140.67181 H 4.0774201 507.99937"
         style="display:inline;fill:none;stroke:#ce0f0f;stroke-width:0.5291667;stroke-linecap:butt;stroke-linejoin:miter;stroke-miterlimit:4;stroke-dasharray:none;stroke-opacity:1"
         sodipodi:nodetypes="ccc" />
      <path
         inkscape:label="color-a11033ff"
         inkscape:connector-curvature="0"
         id="path3991-9-7-0-4"
         d="M 2.3536927e-6,141.39743 C 507.99937,141.39743 507.99937,141.39743 507.99937,141.39743"
         style="display:inline;fill:none;stroke:#a11033;stroke-width:0.5291667;stroke-linecap:butt;stroke-linejoin:miter;stroke-miterlimit:4;stroke-dasharray:none;stroke-opacity:1" />
    </g>
    <text
       xml:space="preserve"
       style="font-style:normal;font-variant:normal;font-weight:normal;font-stretch:normal;font-size:16.93333435px;line-height:1.25;font-family:'Kabel LT Std';-inkscape-font-specification:'Kabel LT Std, Normal';font-variant-ligatures:normal;font-variant-caps:normal;font-variant-numeric:normal;font-feature-settings:normal;text-align:start;letter-spacing:0px;word-spacing:0px;writing-mode:lr-tb;text-anchor:start;opacity:0.7;fill:#000000;fill-opacity:1;stroke:none;stroke-width:0.26458335"
       x="141.39941"
       y="33.443314"
       id="text3062"><tspan
         sodipodi:role="line"
         id="tspan4158"
         x="141.39941"
         y="33.443314"
         class="description">Results</tspan></text>
    <text
       xml:space="preserve"
       style="font-style:normal;font-variant:normal;font-weight:normal;font-stretch:normal;font-size:10.58333397px;line-height:1.25;font-family:'Kabel LT Std';-inkscape-font-specification:'Kabel LT Std, Normal';font-variant-ligatures:normal;font-variant-caps:normal;font-variant-numeric:normal;font-feature-settings:normal;text-align:end;letter-spacing:0px;word-spacing:0px;writing-mode:lr-tb;text-anchor:end;opacity:0.7;fill:#000000;fill-opacity:1;stroke:none;stroke-width:0.26458335"
       x="367.23251"
       y="31.220814"
       id="text3070"
       class="class"><tspan
         sodipodi:role="line"
         id="tspan5829"
         x="367.23251"
         y="31.220814"
         class="name">Womens Junior Elite</tspan></text>
    <g
       id="g1258"
       transform="translate(0.159601,1.7131486e-5)"
       class="runner">
      <text
         id="text1494"
         y="78.354881"
         x="340.8519"
         style="font-style:normal;font-variant:normal;font-weight:normal;font-stretch:normal;font-size:9.87777805px;line-height:1.25;font-family:'Kabel LT Std';-inkscape-font-specification:'Kabel LT Std, Normal';font-variant-ligatures:normal;font-variant-caps:normal;font-variant-numeric:normal;font-feature-settings:normal;text-align:end;letter-spacing:0px;word-spacing:0px;writing-mode:lr-tb;text-anchor:end;fill:#000000;fill-opacity:1;stroke:none;stroke-width:0.26458335"
         xml:space="preserve"
         inkscape:label="time"><tspan
           y="78.354881"
           x="340.8519"
           id="tspan2819"
           sodipodi:role="line"
           class="time">07:02:00</tspan></text>
      <text
         id="text1490"
         y="78.3069"
         x="302.80707"
         style="font-style:normal;font-variant:normal;font-weight:normal;font-stretch:normal;font-size:7.05555582px;line-height:1.25;font-family:'Kabel LT Std';-inkscape-font-specification:'Kabel LT Std, Normal';font-variant-ligatures:normal;font-variant-caps:normal;font-variant-numeric:normal;font-feature-settings:normal;text-align:end;letter-spacing:0px;word-spacing:0px;writing-mode:lr-tb;text-anchor:end;fill:#000000;fill-opacity:1;stroke:none;stroke-width:0.26458335"
         xml:space="preserve"
         inkscape:label="club_name"><tspan
           y="78.3069"
           x="302.80707"
           id="tspan2821"
           sodipodi:role="line"
           class="club_name">DEN</tspan></text>
      <text
         id="text1482"
         y="78.759872"
         x="163.70139"
         style="font-style:normal;font-variant:normal;font-weight:normal;font-stretch:normal;font-size:9.87777805px;line-height:1.25;font-family:'Kabel LT Std';-inkscape-font-specification:'Kabel LT Std, Normal';font-variant-ligatures:normal;font-variant-caps:normal;font-variant-numeric:normal;font-feature-settings:normal;text-align:start;letter-spacing:0px;word-spacing:0px;writing-mode:lr-tb;text-anchor:start;fill:#000000;fill-opacity:1;stroke:none;stroke-width:0.26458335"
         xml:space="preserve"
         inkscape:label="name"><tspan
           class="name"
           y="78.759872"
           x="163.70139"
           id="tspan5833"
           sodipodi:role="line">Chrstian Bobach</tspan></text>
      <text
         id="text1486"
         y="78.404274"
         x="142.48947"
         style="font-style:normal;font-variant:normal;font-weight:normal;font-stretch:normal;font-size:9.87777805px;line-height:1.25;font-family:'Kabel LT Std';-inkscape-font-specification:'Kabel LT Std, Normal';font-variant-ligatures:normal;font-variant-caps:normal;font-variant-numeric:normal;font-feature-settings:normal;text-align:start;letter-spacing:0px;word-spacing:0px;writing-mode:lr-tb;text-anchor:start;fill:#000000;fill-opacity:1;stroke:none;stroke-width:0.26458335"
         xml:space="preserve"
         inkscape:label="bib"><tspan
           y="78.404274"
           x="142.48947"
           id="tspan2823"
           sodipodi:role="line"
           class="place">1234</tspan></text>
      <text
         id="text1494-9"
         y="78.404274"
         x="375.68054"
         style="font-style:normal;font-variant:normal;font-weight:normal;font-stretch:normal;font-size:9.87777805px;line-height:1.25;font-family:'Kabel LT Std';-inkscape-font-specification:'Kabel LT Std, Normal';font-variant-ligatures:normal;font-variant-caps:normal;font-variant-numeric:normal;font-feature-settings:normal;text-align:end;letter-spacing:0px;word-spacing:0px;writing-mode:lr-tb;text-anchor:end;display:inline;fill:#000000;fill-opacity:1;stroke:none;stroke-width:0.26458335"
         xml:space="preserve"
         inkscape:label="time_diff"><tspan
           y="78.404274"
           x="375.68054"
           id="tspan1246"
           sodipodi:role="line"
           class="time_diff">+1:02:00</tspan></text>
    </g>
    <g
       style="display:inline"
       id="g1258-9"
       transform="translate(0.159601,15.875017)"
       class="runner">
      <text
         id="text1494-1"
         y="78.354881"
         x="340.8519"
         style="font-style:normal;font-variant:normal;font-weight:normal;font-stretch:normal;font-size:9.87777805px;line-height:1.25;font-family:'Kabel LT Std';-inkscape-font-specification:'Kabel LT Std, Normal';font-variant-ligatures:normal;font-variant-caps:normal;font-variant-numeric:normal;font-feature-settings:normal;text-align:end;letter-spacing:0px;word-spacing:0px;writing-mode:lr-tb;text-anchor:end;fill:#000000;fill-opacity:1;stroke:none;stroke-width:0.26458335"
         xml:space="preserve"
         inkscape:label="time"><tspan
           y="78.354881"
           x="340.8519"
           id="tspan2819-04"
           sodipodi:role="line"
           class="time">07:02:00</tspan></text>
      <text
         id="text1490-2"
         y="78.3069"
         x="302.80707"
         style="font-style:normal;font-variant:normal;font-weight:normal;font-stretch:normal;font-size:7.05555582px;line-height:1.25;font-family:'Kabel LT Std';-inkscape-font-specification:'Kabel LT Std, Normal';font-variant-ligatures:normal;font-variant-caps:normal;font-variant-numeric:normal;font-feature-settings:normal;text-align:end;letter-spacing:0px;word-spacing:0px;writing-mode:lr-tb;text-anchor:end;fill:#000000;fill-opacity:1;stroke:none;stroke-width:0.26458335"
         xml:space="preserve"
         inkscape:label="club_name"><tspan
           y="78.3069"
           x="302.80707"
           id="tspan2821-7"
           sodipodi:role="line"
           class="club_name">DEN</tspan></text>
      <text
         id="text1482-4"
         y="78.759872"
         x="163.70139"
         style="font-style:normal;font-variant:normal;font-weight:normal;font-stretch:normal;font-size:9.87777805px;line-height:1.25;font-family:'Kabel LT Std';-inkscape-font-specification:'Kabel LT Std, Normal';font-variant-ligatures:normal;font-variant-caps:normal;font-variant-numeric:normal;font-feature-settings:normal;text-align:start;letter-spacing:0px;word-spacing:0px;writing-mode:lr-tb;text-anchor:start;fill:#000000;fill-opacity:1;stroke:none;stroke-width:0.26458335"
         xml:space="preserve"
         inkscape:label="name"><tspan
           class="name"
           y="78.759872"
           x="163.70139"
           id="tspan5833-0"
           sodipodi:role="line">Chrstian Bobach</tspan></text>
      <text
         id="text1486-3"
         y="78.404274"
         x="142.48947"
         style="font-style:normal;font-variant:normal;font-weight:normal;font-stretch:normal;font-size:9.87777805px;line-height:1.25;font-family:'Kabel LT Std';-inkscape-font-specification:'Kabel LT Std, Normal';font-variant-ligatures:normal;font-variant-caps:normal;font-variant-numeric:normal;font-feature-settings:normal;text-align:start;letter-spacing:0px;word-spacing:0px;writing-mode:lr-tb;text-anchor:start;fill:#000000;fill-opacity:1;stroke:none;stroke-width:0.26458335"
         xml:space="preserve"
         inkscape:label="bib"><tspan
           y="78.404274"
           x="142.48947"
           id="tspan2823-28"
           sodipodi:role="line"
           class="place">1234</tspan></text>
      <text
         id="text1494-9-0"
         y="78.404274"
         x="375.68054"
         style="font-style:normal;font-variant:normal;font-weight:normal;font-stretch:normal;font-size:9.87777805px;line-height:1.25;font-family:'Kabel LT Std';-inkscape-font-specification:'Kabel LT Std, Normal';font-variant-ligatures:normal;font-variant-caps:normal;font-variant-numeric:normal;font-feature-settings:normal;text-align:end;letter-spacing:0px;word-spacing:0px;writing-mode:lr-tb;text-anchor:end;display:inline;fill:#000000;fill-opacity:1;stroke:none;stroke-width:0.26458335"
         xml:space="preserve"
         inkscape:label="time_diff"><tspan
           y="78.404274"
           x="375.68054"
           id="tspan1246-3"
           sodipodi:role="line"
           class="time_diff">+1:02:00</tspan></text>
    </g>
    <g
       style="display:inline"
       id="g1258-7"
       transform="translate(0.159601,31.750018)"
       class="runner">
      <text
         id="text1494-0"
         y="78.354881"
         x="340.8519"
         style="font-style:normal;font-variant:normal;font-weight:normal;font-stretch:normal;font-size:9.87777805px;line-height:1.25;font-family:'Kabel LT Std';-inkscape-font-specification:'Kabel LT Std, Normal';font-variant-ligatures:normal;font-variant-caps:normal;font-variant-numeric:normal;font-feature-settings:normal;text-align:end;letter-spacing:0px;word-spacing:0px;writing-mode:lr-tb;text-anchor:end;fill:#000000;fill-opacity:1;stroke:none;stroke-width:0.26458335"
         xml:space="preserve"
         inkscape:label="time"><tspan
           y="78.354881"
           x="340.8519"
           id="tspan2819-03"
           sodipodi:role="line"
           class="time">07:02:00</tspan></text>
      <text
         id="text1490-4"
         y="78.3069"
         x="302.80707"
         style="font-style:normal;font-variant:normal;font-weight:normal;font-stretch:normal;font-size:7.05555582px;line-height:1.25;font-family:'Kabel LT Std';-inkscape-font-specification:'Kabel LT Std, Normal';font-variant-ligatures:normal;font-variant-caps:normal;font-variant-numeric:normal;font-feature-settings:normal;text-align:end;letter-spacing:0px;word-spacing:0px;writing-mode:lr-tb;text-anchor:end;fill:#000000;fill-opacity:1;stroke:none;stroke-width:0.26458335"
         xml:space="preserve"
         inkscape:label="club_name"><tspan
           y="78.3069"
           x="302.80707"
           id="tspan2821-9"
           sodipodi:role="line"
           class="club_name">DEN</tspan></text>
      <text
         id="text1482-2"
         y="78.759872"
         x="163.70139"
         style="font-style:normal;font-variant:normal;font-weight:normal;font-stretch:normal;font-size:9.87777805px;line-height:1.25;font-family:'Kabel LT Std';-inkscape-font-specification:'Kabel LT Std, Normal';font-variant-ligatures:normal;font-variant-caps:normal;font-variant-numeric:normal;font-feature-settings:normal;text-align:start;letter-spacing:0px;word-spacing:0px;writing-mode:lr-tb;text-anchor:start;fill:#000000;fill-opacity:1;stroke:none;stroke-width:0.26458335"
         xml:space="preserve"
         inkscape:label="name"><tspan
           class="name"
           y="78.759872"
           x="163.70139"
           id="tspan5833-7"
           sodipodi:role="line">Chrstian Bobach</tspan></text>
      <text
         id="text1486-4"
         y="78.404274"
         x="142.48947"
         style="font-style:normal;font-variant:normal;font-weight:normal;font-stretch:normal;font-size:9.87777805px;line-height:1.25;font-family:'Kabel LT Std';-inkscape-font-specification:'Kabel LT Std, Normal';font-variant-ligatures:normal;font-variant-caps:normal;font-variant-numeric:normal;font-feature-settings:normal;text-align:start;letter-spacing:0px;word-spacing:0px;writing-mode:lr-tb;text-anchor:start;fill:#000000;fill-opacity:1;stroke:none;stroke-width:0.26458335"
         xml:space="preserve"
         inkscape:label="bib"><tspan
           y="78.404274"
           x="142.48947"
           id="tspan2823-25"
           sodipodi:role="line"
           class="place">1234</tspan></text>
      <text
         id="text1494-9-24"
         y="78.404274"
         x="375.68054"
         style="font-style:normal;font-variant:normal;font-weight:normal;font-stretch:normal;font-size:9.87777805px;line-height:1.25;font-family:'Kabel LT Std';-inkscape-font-specification:'Kabel LT Std, Normal';font-variant-ligatures:normal;font-variant-caps:normal;font-variant-numeric:normal;font-feature-settings:normal;text-align:end;letter-spacing:0px;word-spacing:0px;writing-mode:lr-tb;text-anchor:end;display:inline;fill:#000000;fill-opacity:1;stroke:none;stroke-width:0.26458335"
         xml:space="preserve"
         inkscape:label="time_diff"><tspan
           y="78.404274"
           x="375.68054"
           id="tspan1246-4"
           sodipodi:role="line"
           class="time_diff">+1:02:00</tspan></text>
    </g>
    <g
       style="display:inline"
       id="g1258-3"
       transform="translate(0.159601,47.625018)"
       class="runner">
      <text
         id="text1494-8"
         y="78.354881"
         x="340.8519"
         style="font-style:normal;font-variant:normal;font-weight:normal;font-stretch:normal;font-size:9.87777805px;line-height:1.25;font-family:'Kabel LT Std';-inkscape-font-specification:'Kabel LT Std, Normal';font-variant-ligatures:normal;font-variant-caps:normal;font-variant-numeric:normal;font-feature-settings:normal;text-align:end;letter-spacing:0px;word-spacing:0px;writing-mode:lr-tb;text-anchor:end;fill:#000000;fill-opacity:1;stroke:none;stroke-width:0.26458335"
         xml:space="preserve"
         inkscape:label="time"><tspan
           y="78.354881"
           x="340.8519"
           id="tspan2819-6"
           sodipodi:role="line"
           class="time">07:02:00</tspan></text>
      <text
         id="text1490-0"
         y="78.3069"
         x="302.80707"
         style="font-style:normal;font-variant:normal;font-weight:normal;font-stretch:normal;font-size:7.05555582px;line-height:1.25;font-family:'Kabel LT Std';-inkscape-font-specification:'Kabel LT Std, Normal';font-variant-ligatures:normal;font-variant-caps:normal;font-variant-numeric:normal;font-feature-settings:normal;text-align:end;letter-spacing:0px;word-spacing:0px;writing-mode:lr-tb;text-anchor:end;fill:#000000;fill-opacity:1;stroke:none;stroke-width:0.26458335"
         xml:space="preserve"
         inkscape:label="club_name"><tspan
           y="78.3069"
           x="302.80707"
           id="tspan2821-8"
           sodipodi:role="line"
           class="club_name">DEN</tspan></text>
      <text
         id="text1482-9"
         y="78.759872"
         x="163.70139"
         style="font-style:normal;font-variant:normal;font-weight:normal;font-stretch:normal;font-size:9.87777805px;line-height:1.25;font-family:'Kabel LT Std';-inkscape-font-specification:'Kabel LT Std, Normal';font-variant-ligatures:normal;font-variant-caps:normal;font-variant-numeric:normal;font-feature-settings:normal;text-align:start;letter-spacing:0px;word-spacing:0px;writing-mode:lr-tb;text-anchor:start;fill:#000000;fill-opacity:1;stroke:none;stroke-width:0.26458335"
         xml:space="preserve"
         inkscape:label="name"><tspan
           class="name"
           y="78.759872"
           x="163.70139"
           id="tspan5833-2"
           sodipodi:role="line">Chrstian Bobach</tspan></text>
      <text
         id="text1486-2"
         y="78.404274"
         x="142.48947"
         style="font-style:normal;font-variant:normal;font-weight:normal;font-stretch:normal;font-size:9.87777805px;line-height:1.25;font-family:'Kabel LT Std';-inkscape-font-specification:'Kabel LT Std, Normal';font-variant-ligatures:normal;font-variant-caps:normal;font-variant-numeric:normal;font-feature-settings:normal;text-align:start;letter-spacing:0px;word-spacing:0px;writing-mode:lr-tb;text-anchor:start;fill:#000000;fill-opacity:1;stroke:none;stroke-width:0.26458335"
         xml:space="preserve"
         inkscape:label="bib"><tspan
           y="78.404274"
           x="142.48947"
           id="tspan2823-3"
           sodipodi:role="line"
           class="place">1234</tspan></text>
      <text
         id="text1494-9-1"
         y="78.404274"
         x="375.68054"
         style="font-style:normal;font-variant:normal;font-weight:normal;font-stretch:normal;font-size:9.87777805px;line-height:1.25;font-family:'Kabel LT Std';-inkscape-font-specification:'Kabel LT Std, Normal';font-variant-ligatures:normal;font-variant-caps:normal;font-variant-numeric:normal;font-feature-settings:normal;text-align:end;letter-spacing:0px;word-spacing:0px;writing-mode:lr-tb;text-anchor:end;display:inline;fill:#000000;fill-opacity:1;stroke:none;stroke-width:0.26458335"
         xml:space="preserve"
         inkscape:label="time_diff"><tspan
           y="78.404274"
           x="375.68054"
           id="tspan1246-8"
           sodipodi:role="line"
           class="time_diff">+1:02:00</tspan></text>
    </g>
    <g
       style="display:inline"
       id="g1258-34"
       transform="translate(0.159601,63.500018)"
       class="runner">
      <text
         id="text1494-2"
         y="78.354881"
         x="340.8519"
         style="font-style:normal;font-variant:normal;font-weight:normal;font-stretch:normal;font-size:9.87777805px;line-height:1.25;font-family:'Kabel LT Std';-inkscape-font-specification:'Kabel LT Std, Normal';font-variant-ligatures:normal;font-variant-caps:normal;font-variant-numeric:normal;font-feature-settings:normal;text-align:end;letter-spacing:0px;word-spacing:0px;writing-mode:lr-tb;text-anchor:end;fill:#000000;fill-opacity:1;stroke:none;stroke-width:0.26458335"
         xml:space="preserve"
         inkscape:label="time"><tspan
           y="78.354881"
           x="340.8519"
           id="tspan2819-2"
           sodipodi:role="line"
           class="time">07:02:00</tspan></text>
      <text
         id="text1490-45"
         y="78.3069"
         x="302.80707"
         style="font-style:normal;font-variant:normal;font-weight:normal;font-stretch:normal;font-size:7.05555582px;line-height:1.25;font-family:'Kabel LT Std';-inkscape-font-specification:'Kabel LT Std, Normal';font-variant-ligatures:normal;font-variant-caps:normal;font-variant-numeric:normal;font-feature-settings:normal;text-align:end;letter-spacing:0px;word-spacing:0px;writing-mode:lr-tb;text-anchor:end;fill:#000000;fill-opacity:1;stroke:none;stroke-width:0.26458335"
         xml:space="preserve"
         inkscape:label="club_name"><tspan
           y="78.3069"
           x="302.80707"
           id="tspan2821-1"
           sodipodi:role="line"
           class="club_name">DEN</tspan></text>
      <text
         id="text1482-7"
         y="78.759872"
         x="163.70139"
         style="font-style:normal;font-variant:normal;font-weight:normal;font-stretch:normal;font-size:9.87777805px;line-height:1.25;font-family:'Kabel LT Std';-inkscape-font-specification:'Kabel LT Std, Normal';font-variant-ligatures:normal;font-variant-caps:normal;font-variant-numeric:normal;font-feature-settings:normal;text-align:start;letter-spacing:0px;word-spacing:0px;writing-mode:lr-tb;text-anchor:start;fill:#000000;fill-opacity:1;stroke:none;stroke-width:0.26458335"
         xml:space="preserve"
         inkscape:label="name"><tspan
           class="name"
           y="78.759872"
           x="163.70139"
           id="tspan5833-5"
           sodipodi:role="line">Chrstian Bobach</tspan></text>
      <text
         id="text1486-7"
         y="78.404274"
         x="142.48947"
         style="font-style:normal;font-variant:normal;font-weight:normal;font-stretch:normal;font-size:9.87777805px;line-height:1.25;font-family:'Kabel LT Std';-inkscape-font-specification:'Kabel LT Std, Normal';font-variant-ligatures:normal;font-variant-caps:normal;font-variant-numeric:normal;font-feature-settings:normal;text-align:start;letter-spacing:0px;word-spacing:0px;writing-mode:lr-tb;text-anchor:start;fill:#000000;fill-opacity:1;stroke:none;stroke-width:0.26458335"
         xml:space="preserve"
         inkscape:label="bib"><tspan
           y="78.404274"
           x="142.48947"
           id="tspan2823-1"
           sodipodi:role="line"
           class="place">1234</tspan></text>
      <text
         id="text1494-9-6"
         y="78.404274"
         x="375.68054"
         style="font-style:normal;font-variant:normal;font-weight:normal;font-stretch:normal;font-size:9.87777805px;line-height:1.25;font-family:'Kabel LT Std';-inkscape-font-specification:'Kabel LT Std, Normal';font-variant-ligatures:normal;font-variant-caps:normal;font-variant-numeric:normal;font-feature-settings:normal;text-align:end;letter-spacing:0px;word-spacing:0px;writing-mode:lr-tb;text-anchor:end;display:inline;fill:#000000;fill-opacity:1;stroke:none;stroke-width:0.26458335"
         xml:space="preserve"
         inkscape:label="time_diff"><tspan
           y="78.404274"
           x="375.68054"
           id="tspan1246-9"
           sodipodi:role="line"
           class="time_diff">+1:02:00</tspan></text>
    </g>
    <g
       style="display:inline"
       id="g1258-4"
       transform="translate(0.159601,79.375027)"
       class="runner">
      <text
         id="text1494-01"
         y="78.354881"
         x="340.8519"
         style="font-style:normal;font-variant:normal;font-weight:normal;font-stretch:normal;font-size:9.87777805px;line-height:1.25;font-family:'Kabel LT Std';-inkscape-font-specification:'Kabel LT Std, Normal';font-variant-ligatures:normal;font-variant-caps:normal;font-variant-numeric:normal;font-feature-settings:normal;text-align:end;letter-spacing:0px;word-spacing:0px;writing-mode:lr-tb;text-anchor:end;fill:#000000;fill-opacity:1;stroke:none;stroke-width:0.26458335"
         xml:space="preserve"
         inkscape:label="time"><tspan
           y="78.354881"
           x="340.8519"
           id="tspan2819-37"
           sodipodi:role="line"
           class="time">07:02:00</tspan></text>
      <text
         id="text1490-41"
         y="78.3069"
         x="302.80707"
         style="font-style:normal;font-variant:normal;font-weight:normal;font-stretch:normal;font-size:7.05555582px;line-height:1.25;font-family:'Kabel LT Std';-inkscape-font-specification:'Kabel LT Std, Normal';font-variant-ligatures:normal;font-variant-caps:normal;font-variant-numeric:normal;font-feature-settings:normal;text-align:end;letter-spacing:0px;word-spacing:0px;writing-mode:lr-tb;text-anchor:end;fill:#000000;fill-opacity:1;stroke:none;stroke-width:0.26458335"
         xml:space="preserve"
         inkscape:label="club_name"><tspan
           y="78.3069"
           x="302.80707"
           id="tspan2821-13"
           sodipodi:role="line"
           class="club_name">DEN</tspan></text>
      <text
         id="text1482-03"
         y="78.759872"
         x="163.70139"
         style="font-style:normal;font-variant:normal;font-weight:normal;font-stretch:normal;font-size:9.87777805px;line-height:1.25;font-family:'Kabel LT Std';-inkscape-font-specification:'Kabel LT Std, Normal';font-variant-ligatures:normal;font-variant-caps:normal;font-variant-numeric:normal;font-feature-settings:normal;text-align:start;letter-spacing:0px;word-spacing:0px;writing-mode:lr-tb;text-anchor:start;fill:#000000;fill-opacity:1;stroke:none;stroke-width:0.26458335"
         xml:space="preserve"
         inkscape:label="name"><tspan
           class="name"
           y="78.759872"
           x="163.70139"
           id="tspan5833-21"
           sodipodi:role="line">Chrstian Bobach</tspan></text>
      <text
         id="text1486-75"
         y="78.404274"
         x="142.48947"
         style="font-style:normal;font-variant:normal;font-weight:normal;font-stretch:normal;font-size:9.87777805px;line-height:1.25;font-family:'Kabel LT Std';-inkscape-font-specification:'Kabel LT Std, Normal';font-variant-ligatures:normal;font-variant-caps:normal;font-variant-numeric:normal;font-feature-settings:normal;text-align:start;letter-spacing:0px;word-spacing:0px;writing-mode:lr-tb;text-anchor:start;fill:#000000;fill-opacity:1;stroke:none;stroke-width:0.26458335"
         xml:space="preserve"
         inkscape:label="bib"><tspan
           y="78.404274"
           x="142.48947"
           id="tspan2823-6"
           sodipodi:role="line"
           class="place">1234</tspan></text>
      <text
         id="text1494-9-5"
         y="78.404274"
         x="375.68054"
         style="font-style:normal;font-variant:normal;font-weight:normal;font-stretch:normal;font-size:9.87777805px;line-height:1.25;font-family:'Kabel LT Std';-inkscape-font-specification:'Kabel LT Std, Normal';font-variant-ligatures:normal;font-variant-caps:normal;font-variant-numeric:normal;font-feature-settings:normal;text-align:end;letter-spacing:0px;word-spacing:0px;writing-mode:lr-tb;text-anchor:end;display:inline;fill:#000000;fill-opacity:1;stroke:none;stroke-width:0.26458335"
         xml:space="preserve"
         inkscape:label="time_diff"><tspan
           y="78.404274"
           x="375.68054"
           id="tspan1246-42"
           sodipodi:role="line"
           class="time_diff">+1:02:00</tspan></text>
    </g>
    <g
       style="display:inline"
       id="g1258-8"
       transform="translate(0.159601,95.250027)"
       class="runner">
      <text
         id="text1494-13"
         y="78.354881"
         x="340.8519"
         style="font-style:normal;font-variant:normal;font-weight:normal;font-stretch:normal;font-size:9.87777805px;line-height:1.25;font-family:'Kabel LT Std';-inkscape-font-specification:'Kabel LT Std, Normal';font-variant-ligatures:normal;font-variant-caps:normal;font-variant-numeric:normal;font-feature-settings:normal;text-align:end;letter-spacing:0px;word-spacing:0px;writing-mode:lr-tb;text-anchor:end;fill:#000000;fill-opacity:1;stroke:none;stroke-width:0.26458335"
         xml:space="preserve"
         inkscape:label="time"><tspan
           y="78.354881"
           x="340.8519"
           id="tspan2819-3"
           sodipodi:role="line"
           class="time">07:02:00</tspan></text>
      <text
         id="text1490-3"
         y="78.3069"
         x="302.80707"
         style="font-style:normal;font-variant:normal;font-weight:normal;font-stretch:normal;font-size:7.05555582px;line-height:1.25;font-family:'Kabel LT Std';-inkscape-font-specification:'Kabel LT Std, Normal';font-variant-ligatures:normal;font-variant-caps:normal;font-variant-numeric:normal;font-feature-settings:normal;text-align:end;letter-spacing:0px;word-spacing:0px;writing-mode:lr-tb;text-anchor:end;fill:#000000;fill-opacity:1;stroke:none;stroke-width:0.26458335"
         xml:space="preserve"
         inkscape:label="club_name"><tspan
           y="78.3069"
           x="302.80707"
           id="tspan2821-79"
           sodipodi:role="line"
           class="club_name">DEN</tspan></text>
      <text
         id="text1482-8"
         y="78.759872"
         x="163.70139"
         style="font-style:normal;font-variant:normal;font-weight:normal;font-stretch:normal;font-size:9.87777805px;line-height:1.25;font-family:'Kabel LT Std';-inkscape-font-specification:'Kabel LT Std, Normal';font-variant-ligatures:normal;font-variant-caps:normal;font-variant-numeric:normal;font-feature-settings:normal;text-align:start;letter-spacing:0px;word-spacing:0px;writing-mode:lr-tb;text-anchor:start;fill:#000000;fill-opacity:1;stroke:none;stroke-width:0.26458335"
         xml:space="preserve"
         inkscape:label="name"><tspan
           class="name"
           y="78.759872"
           x="163.70139"
           id="tspan5833-6"
           sodipodi:role="line">Chrstian Bobach</tspan></text>
      <text
         id="text1486-70"
         y="78.404274"
         x="142.48947"
         style="font-style:normal;font-variant:normal;font-weight:normal;font-stretch:normal;font-size:9.87777805px;line-height:1.25;font-family:'Kabel LT Std';-inkscape-font-specification:'Kabel LT Std, Normal';font-variant-ligatures:normal;font-variant-caps:normal;font-variant-numeric:normal;font-feature-settings:normal;text-align:start;letter-spacing:0px;word-spacing:0px;writing-mode:lr-tb;text-anchor:start;fill:#000000;fill-opacity:1;stroke:none;stroke-width:0.26458335"
         xml:space="preserve"
         inkscape:label="bib"><tspan
           y="78.404274"
           x="142.48947"
           id="tspan2823-4"
           sodipodi:role="line"
           class="place">1234</tspan></text>
      <text
         id="text1494-9-8"
         y="78.404274"
         x="375.68054"
         style="font-style:normal;font-variant:normal;font-weight:normal;font-stretch:normal;font-size:9.87777805px;line-height:1.25;font-family:'Kabel LT Std';-inkscape-font-specification:'Kabel LT Std, Normal';font-variant-ligatures:normal;font-variant-caps:normal;font-variant-numeric:normal;font-feature-settings:normal;text-align:end;letter-spacing:0px;word-spacing:0px;writing-mode:lr-tb;text-anchor:end;display:inline;fill:#000000;fill-opacity:1;stroke:none;stroke-width:0.26458335"
         xml:space="preserve"
         inkscape:label="time_diff"><tspan
           y="78.404274"
           x="375.68054"
           id="tspan1246-48"
           sodipodi:role="line"
           class="time_diff">+1:02:00</tspan></text>
    </g>
    <g
       style="display:inline"
       id="g1258-16"
       transform="translate(0.159601,111.12503)"
       class="runner">
      <text
         id="text1494-85"
         y="78.354881"
         x="340.8519"
         style="font-style:normal;font-variant:normal;font-weight:normal;font-stretch:normal;font-size:9.87777805px;line-height:1.25;font-family:'Kabel LT Std';-inkscape-font-specification:'Kabel LT Std, Normal';font-variant-ligatures:normal;font-variant-caps:normal;font-variant-numeric:normal;font-feature-settings:normal;text-align:end;letter-spacing:0px;word-spacing:0px;writing-mode:lr-tb;text-anchor:end;fill:#000000;fill-opacity:1;stroke:none;stroke-width:0.26458335"
         xml:space="preserve"
         inkscape:label="time"><tspan
           y="78.354881"
           x="340.8519"
           id="tspan2819-21"
           sodipodi:role="line"
           class="time">07:02:00</tspan></text>
      <text
         id="text1490-9"
         y="78.3069"
         x="302.80707"
         style="font-style:normal;font-variant:normal;font-weight:normal;font-stretch:normal;font-size:7.05555582px;line-height:1.25;font-family:'Kabel LT Std';-inkscape-font-specification:'Kabel LT Std, Normal';font-variant-ligatures:normal;font-variant-caps:normal;font-variant-numeric:normal;font-feature-settings:normal;text-align:end;letter-spacing:0px;word-spacing:0px;writing-mode:lr-tb;text-anchor:end;fill:#000000;fill-opacity:1;stroke:none;stroke-width:0.26458335"
         xml:space="preserve"
         inkscape:label="club_name"><tspan
           y="78.3069"
           x="302.80707"
           id="tspan2821-96"
           sodipodi:role="line"
           class="club_name">DEN</tspan></text>
      <text
         id="text1482-06"
         y="78.759872"
         x="163.70139"
         style="font-style:normal;font-variant:normal;font-weight:normal;font-stretch:normal;font-size:9.87777805px;line-height:1.25;font-family:'Kabel LT Std';-inkscape-font-specification:'Kabel LT Std, Normal';font-variant-ligatures:normal;font-variant-caps:normal;font-variant-numeric:normal;font-feature-settings:normal;text-align:start;letter-spacing:0px;word-spacing:0px;writing-mode:lr-tb;text-anchor:start;fill:#000000;fill-opacity:1;stroke:none;stroke-width:0.26458335"
         xml:space="preserve"
         inkscape:label="name"><tspan
           class="name"
           y="78.759872"
           x="163.70139"
           id="tspan5833-4"
           sodipodi:role="line">Chrstian Bobach</tspan></text>
      <text
         id="text1486-9"
         y="78.404274"
         x="142.48947"
         style="font-style:normal;font-variant:normal;font-weight:normal;font-stretch:normal;font-size:9.87777805px;line-height:1.25;font-family:'Kabel LT Std';-inkscape-font-specification:'Kabel LT Std, Normal';font-variant-ligatures:normal;font-variant-caps:normal;font-variant-numeric:normal;font-feature-settings:normal;text-align:start;letter-spacing:0px;word-spacing:0px;writing-mode:lr-tb;text-anchor:start;fill:#000000;fill-opacity:1;stroke:none;stroke-width:0.26458335"
         xml:space="preserve"
         inkscape:label="bib"><tspan
           y="78.404274"
           x="142.48947"
           id="tspan2823-9"
           sodipodi:role="line"
           class="place">1234</tspan></text>
      <text
         id="text1494-9-08"
         y="78.404274"
         x="375.68054"
         style="font-style:normal;font-variant:normal;font-weight:normal;font-stretch:normal;font-size:9.87777805px;line-height:1.25;font-family:'Kabel LT Std';-inkscape-font-specification:'Kabel LT Std, Normal';font-variant-ligatures:normal;font-variant-caps:normal;font-variant-numeric:normal;font-feature-settings:normal;text-align:end;letter-spacing:0px;word-spacing:0px;writing-mode:lr-tb;text-anchor:end;display:inline;fill:#000000;fill-opacity:1;stroke:none;stroke-width:0.26458335"
         xml:space="preserve"
         inkscape:label="time_diff"><tspan
           y="78.404274"
           x="375.68054"
           id="tspan1246-93"
           sodipodi:role="line"
           class="time_diff">+1:02:00</tspan></text>
    </g>
    <g
       style="display:inline"
       id="g1258-14"
       transform="translate(0.159601,127.00003)"
       class="runner">
      <text
         id="text1494-89"
         y="78.354881"
         x="340.8519"
         style="font-style:normal;font-variant:normal;font-weight:normal;font-stretch:normal;font-size:9.87777805px;line-height:1.25;font-family:'Kabel LT Std';-inkscape-font-specification:'Kabel LT Std, Normal';font-variant-ligatures:normal;font-variant-caps:normal;font-variant-numeric:normal;font-feature-settings:normal;text-align:end;letter-spacing:0px;word-spacing:0px;writing-mode:lr-tb;text-anchor:end;fill:#000000;fill-opacity:1;stroke:none;stroke-width:0.26458335"
         xml:space="preserve"
         inkscape:label="time"><tspan
           y="78.354881"
           x="340.8519"
           id="tspan2819-67"
           sodipodi:role="line"
           class="time">07:02:00</tspan></text>
      <text
         id="text1490-7"
         y="78.3069"
         x="302.80707"
         style="font-style:normal;font-variant:normal;font-weight:normal;font-stretch:normal;font-size:7.05555582px;line-height:1.25;font-family:'Kabel LT Std';-inkscape-font-specification:'Kabel LT Std, Normal';font-variant-ligatures:normal;font-variant-caps:normal;font-variant-numeric:normal;font-feature-settings:normal;text-align:end;letter-spacing:0px;word-spacing:0px;writing-mode:lr-tb;text-anchor:end;fill:#000000;fill-opacity:1;stroke:none;stroke-width:0.26458335"
         xml:space="preserve"
         inkscape:label="club_name"><tspan
           y="78.3069"
           x="302.80707"
           id="tspan2821-3"
           sodipodi:role="line"
           class="club_name">DEN</tspan></text>
      <text
         id="text1482-71"
         y="78.759872"
         x="163.70139"
         style="font-style:normal;font-variant:normal;font-weight:normal;font-stretch:normal;font-size:9.87777805px;line-height:1.25;font-family:'Kabel LT Std';-inkscape-font-specification:'Kabel LT Std, Normal';font-variant-ligatures:normal;font-variant-caps:normal;font-variant-numeric:normal;font-feature-settings:normal;text-align:start;letter-spacing:0px;word-spacing:0px;writing-mode:lr-tb;text-anchor:start;fill:#000000;fill-opacity:1;stroke:none;stroke-width:0.26458335"
         xml:space="preserve"
         inkscape:label="name"><tspan
           class="name"
           y="78.759872"
           x="163.70139"
           id="tspan5833-22"
           sodipodi:role="line">Chrstian Bobach</tspan></text>
      <text
         id="text1486-15"
         y="78.404274"
         x="142.48947"
         style="font-style:normal;font-variant:normal;font-weight:normal;font-stretch:normal;font-size:9.87777805px;line-height:1.25;font-family:'Kabel LT Std';-inkscape-font-specification:'Kabel LT Std, Normal';font-variant-ligatures:normal;font-variant-caps:normal;font-variant-numeric:normal;font-feature-settings:normal;text-align:start;letter-spacing:0px;word-spacing:0px;writing-mode:lr-tb;text-anchor:start;fill:#000000;fill-opacity:1;stroke:none;stroke-width:0.26458335"
         xml:space="preserve"
         inkscape:label="bib"><tspan
           y="78.404274"
           x="142.48947"
           id="tspan2823-0"
           sodipodi:role="line"
           class="place">1234</tspan></text>
      <text
         id="text1494-9-9"
         y="78.404274"
         x="375.68054"
         style="font-style:normal;font-variant:normal;font-weight:normal;font-stretch:normal;font-size:9.87777805px;line-height:1.25;font-family:'Kabel LT Std';-inkscape-font-specification:'Kabel LT Std, Normal';font-variant-ligatures:normal;font-variant-caps:normal;font-variant-numeric:normal;font-feature-settings:normal;text-align:end;letter-spacing:0px;word-spacing:0px;writing-mode:lr-tb;text-anchor:end;display:inline;fill:#000000;fill-opacity:1;stroke:none;stroke-width:0.26458335"
         xml:space="preserve"
         inkscape:label="time_diff"><tspan
           y="78.404274"
           x="375.68054"
           id="tspan1246-0"
           sodipodi:role="line"
           class="time_diff">+1:02:00</tspan></text>
    </g>
    <g
       style="display:inline"
       id="g1258-1"
       transform="translate(0.159601,142.87503)"
       class="runner">
      <text
         id="text1494-5"
         y="78.354881"
         x="340.8519"
         style="font-style:normal;font-variant:normal;font-weight:normal;font-stretch:normal;font-size:9.87777805px;line-height:1.25;font-family:'Kabel LT Std';-inkscape-font-specification:'Kabel LT Std, Normal';font-variant-ligatures:normal;font-variant-caps:normal;font-variant-numeric:normal;font-feature-settings:normal;text-align:end;letter-spacing:0px;word-spacing:0px;writing-mode:lr-tb;text-anchor:end;fill:#000000;fill-opacity:1;stroke:none;stroke-width:0.26458335"
         xml:space="preserve"
         inkscape:label="time"><tspan
           y="78.354881"
           x="340.8519"
           id="tspan2819-0"
           sodipodi:role="line"
           class="time">07:02:00</tspan></text>
      <text
         id="text1490-6"
         y="78.3069"
         x="302.80707"
         style="font-style:normal;font-variant:normal;font-weight:normal;font-stretch:normal;font-size:7.05555582px;line-height:1.25;font-family:'Kabel LT Std';-inkscape-font-specification:'Kabel LT Std, Normal';font-variant-ligatures:normal;font-variant-caps:normal;font-variant-numeric:normal;font-feature-settings:normal;text-align:end;letter-spacing:0px;word-spacing:0px;writing-mode:lr-tb;text-anchor:end;fill:#000000;fill-opacity:1;stroke:none;stroke-width:0.26458335"
         xml:space="preserve"
         inkscape:label="club_name"><tspan
           y="78.3069"
           x="302.80707"
           id="tspan2821-5"
           sodipodi:role="line"
           class="club_name">DEN</tspan></text>
      <text
         id="text1482-0"
         y="78.759872"
         x="163.70139"
         style="font-style:normal;font-variant:normal;font-weight:normal;font-stretch:normal;font-size:9.87777805px;line-height:1.25;font-family:'Kabel LT Std';-inkscape-font-specification:'Kabel LT Std, Normal';font-variant-ligatures:normal;font-variant-caps:normal;font-variant-numeric:normal;font-feature-settings:normal;text-align:start;letter-spacing:0px;word-spacing:0px;writing-mode:lr-tb;text-anchor:start;fill:#000000;fill-opacity:1;stroke:none;stroke-width:0.26458335"
         xml:space="preserve"
         inkscape:label="name"><tspan
           class="name"
           y="78.759872"
           x="163.70139"
           id="tspan5833-8"
           sodipodi:role="line">Chrstian Bobach</tspan></text>
      <text
         id="text1486-1"
         y="78.404274"
         x="142.48947"
         style="font-style:normal;font-variant:normal;font-weight:normal;font-stretch:normal;font-size:9.87777805px;line-height:1.25;font-family:'Kabel LT Std';-inkscape-font-specification:'Kabel LT Std, Normal';font-variant-ligatures:normal;font-variant-caps:normal;font-variant-numeric:normal;font-feature-settings:normal;text-align:start;letter-spacing:0px;word-spacing:0px;writing-mode:lr-tb;text-anchor:start;fill:#000000;fill-opacity:1;stroke:none;stroke-width:0.26458335"
         xml:space="preserve"
         inkscape:label="bib"><tspan
           y="78.404274"
           x="142.48947"
           id="tspan2823-2"
           sodipodi:role="line"
           class="place">1234</tspan></text>
      <text
         id="text1494-9-2"
         y="78.404274"
         x="375.68054"
         style="font-style:normal;font-variant:normal;font-weight:normal;font-stretch:normal;font-size:9.87777805px;line-height:1.25;font-family:'Kabel LT Std';-inkscape-font-specification:'Kabel LT Std, Normal';font-variant-ligatures:normal;font-variant-caps:normal;font-variant-numeric:normal;font-feature-settings:normal;text-align:end;letter-spacing:0px;word-spacing:0px;writing-mode:lr-tb;text-anchor:end;display:inline;fill:#000000;fill-opacity:1;stroke:none;stroke-width:0.26458335"
         xml:space="preserve"
         inkscape:label="time_diff"><tspan
           y="78.404274"
           x="375.68054"
           id="tspan1246-6"
           sodipodi:role="line"
           class="time_diff">+1:02:00</tspan></text>
    </g>
  </g>
</svg>
