\relax 
\providecommand\hyper@newdestlabel[2]{}
\@setckpt{DECKBLATT.PDF}{
\setcounter{page}{5}
\setcounter{equation}{7}
\setcounter{enumi}{0}
\setcounter{enumii}{0}
\setcounter{enumiii}{0}
\setcounter{enumiv}{0}
\setcounter{footnote}{5}
\setcounter{mpfootnote}{0}
\setcounter{part}{0}
\setcounter{section}{0}
\setcounter{subsection}{0}
\setcounter{subsubsection}{0}
\setcounter{paragraph}{0}
\setcounter{subparagraph}{0}
\setcounter{figure}{2}
\setcounter{table}{2}
\setcounter{parentequation}{0}
\setcounter{Item}{0}
\setcounter{Hfootnote}{5}
\setcounter{bookmark@seq@number}{23}
\setcounter{pp@next@reset}{0}
\setcounter{NAT@ctr}{4}
\setcounter{AM@survey}{0}
\setcounter{section@level}{2}
}
