\relax 
\providecommand\hyper@newdestlabel[2]{}
\catcode `"\active 
\providecommand\HyperFirstAtBeginDocument{\AtBeginDocument}
\HyperFirstAtBeginDocument{\ifx\hyper@anchor\@undefined
\global\let\oldcontentsline\contentsline
\gdef\contentsline#1#2#3#4{\oldcontentsline{#1}{#2}{#3}}
\global\let\oldnewlabel\newlabel
\gdef\newlabel#1#2{\newlabelxx{#1}#2}
\gdef\newlabelxx#1#2#3#4#5#6{\oldnewlabel{#1}{{#2}{#3}}}
\AtEndDocument{\ifx\hyper@anchor\@undefined
\let\contentsline\oldcontentsline
\let\newlabel\oldnewlabel
\fi}
\fi}
\global\let\hyper@last\relax 
\gdef\HyperFirstAtBeginDocument#1{#1}
\providecommand\HyField@AuxAddToFields[1]{}
\providecommand\HyField@AuxAddToCoFields[2]{}
\citation{James2013}
\citation{Hastie2001}
\select@language{german}
\@writefile{toc}{\select@language{german}}
\@writefile{lof}{\select@language{german}}
\@writefile{lot}{\select@language{german}}
\@writefile{toc}{\contentsline {section}{\numberline {1}Literatur\"ubersicht}{1}{section.1}}
\@writefile{toc}{\contentsline {section}{\numberline {2}test}{1}{section.2}}
\@writefile{toc}{\contentsline {section}{\numberline {3}test}{2}{section.3}}
\@writefile{toc}{\contentsline {section}{\numberline {4}test}{3}{section.4}}
\@writefile{toc}{\contentsline {section}{\numberline {5}test}{4}{section.5}}
\@writefile{toc}{\contentsline {section}{\numberline {6}test}{5}{section.6}}
\@writefile{toc}{\contentsline {section}{\numberline {7}test}{6}{section.7}}
\bibstyle{plain}
\bibdata{Literaturverzeichnis.bib}
\bibcite{Hastie2001}{1}
\bibcite{James2013}{2}
