\begin{thebibliography}{1}

\bibitem{Hastie2001}
Trevor Hastie, Robert Tibshirani, and Jerome Friedman.
\newblock {\em ,,The Elements of Statistical Learning - Data Mining, Inference,
  and Prediction''}.
\newblock Springer Science, Berlin Heidelberg, 2001.

\bibitem{James2013}
Gareth James, Daniela Witten, Trevor Hastie, and Robert Tibshirani.
\newblock {\em ,,An Introduction to Statistical Learning - with Applications in
  R''}.
\newblock Springer Science, Berlin, Heidelberg, 2013.

\end{thebibliography}
