\relax 
\providecommand\hyper@newdestlabel[2]{}
\catcode `"\active 
\providecommand\HyperFirstAtBeginDocument{\AtBeginDocument}
\HyperFirstAtBeginDocument{\ifx\hyper@anchor\@undefined
\global\let\oldcontentsline\contentsline
\gdef\contentsline#1#2#3#4{\oldcontentsline{#1}{#2}{#3}}
\global\let\oldnewlabel\newlabel
\gdef\newlabel#1#2{\newlabelxx{#1}#2}
\gdef\newlabelxx#1#2#3#4#5#6{\oldnewlabel{#1}{{#2}{#3}}}
\AtEndDocument{\ifx\hyper@anchor\@undefined
\let\contentsline\oldcontentsline
\let\newlabel\oldnewlabel
\fi}
\fi}
\global\let\hyper@last\relax 
\gdef\HyperFirstAtBeginDocument#1{#1}
\providecommand\HyField@AuxAddToFields[1]{}
\providecommand\HyField@AuxAddToCoFields[2]{}
\AC@reset@newl@bel
\select@language{german}
\@writefile{toc}{\select@language{german}}
\@writefile{lof}{\select@language{german}}
\@writefile{lot}{\select@language{german}}
\@writefile{toc}{\contentsline {section}{I Inhaltsverzeichnis}{I}{section*.1}}
\@writefile{toc}{\contentsline {section}{II Abk\"urzungsverzeichnis}{II}{section*.2}}
\newacro{KQ-Methode}[\AC@hyperlink{KQ-Methode}{\textnormal  {KQ-Methode}}]{\unhbox \voidb@x \cleaders \hbox to.77em{\hss .\hss }\hfill \kern \z@ }
\newacro{MSE}[\AC@hyperlink{MSE}{\textnormal  {MSE}}]{\unhbox \voidb@x \cleaders \hbox to.77em{\hss .\hss }\hfill \kern \z@ }
\newacro{MSPE}[\AC@hyperlink{MSPE}{\textnormal  {MSPE}}]{\unhbox \voidb@x \cleaders \hbox to.77em{\hss .\hss }\hfill \kern \z@ }
\newacro{OLS}[\AC@hyperlink{OLS}{\textnormal  {OLS}}]{\unhbox \voidb@x \cleaders \hbox to.77em{\hss .\hss }\hfill \kern \z@ }
\newacro{RSS}[\AC@hyperlink{RSS}{\textnormal  {RSS}}]{\unhbox \voidb@x \cleaders \hbox to.77em{\hss .\hss }\hfill \kern \z@ }
\newacro{$R^{2}$}[\AC@hyperlink{$R^{2}$}{\textnormal  {$R^{2}$}}]{\unhbox \voidb@x \cleaders \hbox to.77em{\hss .\hss }\hfill \kern \z@ }
\newacro{u.d.NB.}[\AC@hyperlink{u.d.NB.}{\textnormal  {u.d.NB.}}]{\unhbox \voidb@x \cleaders \hbox to.77em{\hss .\hss }\hfill \kern \z@ }
\@writefile{toc}{\contentsline {section}{III Abbildungsverzeichnis}{III}{section*.3}}
\@writefile{toc}{\contentsline {section}{IV Tabellenverzeichnis}{IV}{section*.4}}
\@writefile{toc}{\contentsline {section}{V Symbolverzeichnis}{V}{section*.5}}
\newacro{pi}[\AC@hyperlink{pi}{$ \pi $}]{\unhbox \voidb@x \cleaders \hbox to.77em{\hss .\hss }\hfill \kern \z@ }
\@writefile{toc}{\contentsline {section}{\numberline {1}Einleitung}{1}{section.1}}
\citation{Wooldridge2008}
\citation{Wooldridge2008}
\@writefile{toc}{\contentsline {section}{\numberline {2}Grenzen der Kleinst-Quadrate-Sch\"atzung und Subset Selection}{3}{section.2}}
\@writefile{toc}{\contentsline {subsection}{\numberline {2.1}Multiple lineare Regressionsmodelle und die KQ-Methode}{3}{subsection.2.1}}
\acronymused{KQ-Methode}
\acronymused{OLS}
\citation{Hastie2009}
\citation{James2013}
\citation{Wooldridge2008}
\citation{Hastie2009}
\citation{Hansen2015}
\citation{ZouHastie2005}
\citation{James2013}
\citation{Iturbide2013}
\citation{James2013}
\@writefile{toc}{\contentsline {subsection}{\numberline {2.2}Bewertung der Qualit\"at einer Sch\"atzung}{5}{subsection.2.2}}
\citation{Hastie2009}
\citation{James2013}
\citation{Bishop1995}
\acronymused{MSE}
\acronymused{MSPE}
\citation{Greene2012}
\citation{James2013}
\citation{James2013}
\citation{James2013}
\@writefile{lof}{\contentsline {figure}{\numberline {1}{\ignorespaces Bias-variance-tradeoff}}{8}{figure.1}}
\citation{Leng2006}
\citation{James2013}
\citation{Hastie2009}
\citation{Hastie2009}
\@writefile{toc}{\contentsline {subsection}{\numberline {2.3}Verfahren zur Selektion von Subsets}{9}{subsection.2.3}}
\@writefile{toc}{\contentsline {subsubsection}{\numberline {2.3.1}Best Subset Selection}{9}{subsubsection.2.3.1}}
\citation{James2013}
\acronymused{RSS}
\@writefile{lof}{\contentsline {figure}{\numberline {2}{\ignorespaces Modellwahl bei Best Subset Selection}}{10}{figure.2}}
\citation{James2013}
\citation{Hastie2009}
\citation{James2013}
\citation{Hastie2009}
\citation{Hastie2009}
\citation{Hastie2009}
\citation{Hastie2009}
\acronymused{$R^{2}$}
\@writefile{toc}{\contentsline {subsubsection}{\numberline {2.3.2}Stepwise Selection und der Forward Stagewise Ansatz}{11}{subsubsection.2.3.2}}
\citation{Tibshirani1996}
\citation{ZhangHuang2008}
\@writefile{toc}{\contentsline {section}{\numberline {3}LASSO - Least Absolut Shrinkage and Selection Operator}{12}{section.3}}
\@writefile{toc}{\contentsline {subsection}{\numberline {3.1}Formale Gestalt und L\"osung des Verfahrens}{12}{subsection.3.1}}
\citation{EfronHastie2004}
\citation{Tibshirani1996}
\citation{Tibshirani1996}
\citation{Leng2006}
\citation{Leng2006}
\citation{Osborne1999}
\citation{Schmidt2005}
\citation{Tibshirani1996}
\citation{Hastie2009}
\citation{Hastie2015}
\citation{James2013}
\citation{James2013}
\citation{James2013}
\@writefile{toc}{\contentsline {subsubsection}{\numberline {3.1.1}Die $L_{1}$-Norm und die Geometrie des LASSO-Ansatzes}{14}{subsubsection.3.1.1}}
\citation{Hastie2009}
\citation{Tibshirani1996}
\@writefile{lof}{\contentsline {figure}{\numberline {3}{\ignorespaces Geometrische Darstellung des LASSO-Ansatzes}}{15}{figure.3}}
\acronymused{RSS}
\acronymused{RSS}
\citation{Tibshirani1996}
\citation{Hastie2015}
\citation{Wang2007}
\citation{Wang2007}
\citation{Hastie2015}
\@writefile{toc}{\contentsline {subsubsection}{\numberline {3.1.2}Spezialfall einer orthonormalen Designmatrix}{16}{subsubsection.3.1.2}}
\citation{Wang2007}
\citation{Tibshirani1996}
\citation{DonohoJohnstone1994}
\citation{Tibshirani1996}
\citation{Tibshirani1996}
\citation{Tibshirani1996}
\citation{Schmidt2005}
\citation{Schmidt2005}
\citation{Tibshirani1996}
\citation{Tibshirani1996}
\citation{LawsonHanson1995}
\citation{Tibshirani1996}
\citation{Schmidt2005}
\citation{Tibshirani1996}
\@writefile{toc}{\contentsline {subsubsection}{\numberline {3.1.3}L\"osung bei beliebiger Designmatrix}{18}{subsubsection.3.1.3}}
\citation{Schmidt2005}
\citation{Tibshirani1996}
\citation{Tibshirani1996}
\acronymused{u.d.NB.}
\acronymused{u.d.NB.}
\citation{Tibshirani1996}
\citation{Schmidt2005}
\citation{Schmidt2005}
\citation{Tibshirani1996}
\citation{Schmidt2005}
\citation{EfronHastie2004}
\citation{Fu1998}
\citation{Yang2014}
\@writefile{toc}{\contentsline {subsection}{\numberline {3.2}Verfahren zur Bestimmung des Shrinkage-Parameters}{21}{subsection.3.2}}
\@writefile{toc}{\contentsline {subsubsection}{\numberline {3.2.1}K-fold Cross-validation}{21}{subsubsection.3.2.1}}
\@writefile{toc}{\contentsline {subsubsection}{\numberline {3.2.2}Generalized Cross-validation}{21}{subsubsection.3.2.2}}
\@writefile{toc}{\contentsline {subsection}{\numberline {3.3}Sch\"atzung der Standardfehler}{21}{subsection.3.3}}
\@writefile{toc}{\contentsline {subsection}{\numberline {3.4}Vergleich der Qualit\"at der Sch\"atzresultate}{21}{subsection.3.4}}
\@writefile{lot}{\contentsline {table}{\numberline {1}{\ignorespaces Erste Tabelle}}{22}{table.1}}
\@writefile{toc}{\contentsline {section}{\numberline {4}Title of section 2}{23}{section.4}}
\@writefile{toc}{\contentsline {subsection}{\numberline {4.1}\texttt  {Subsection 1}}{23}{subsection.4.1}}
\@writefile{toc}{\contentsline {subsection}{\numberline {4.2}\texttt  {Subsection 2}}{23}{subsection.4.2}}
\@writefile{lot}{\contentsline {table}{\numberline {2}{\ignorespaces Zweite Tabelle}}{24}{table.2}}
\@writefile{toc}{\contentsline {section}{\numberline {5}Title of section 3}{24}{section.5}}
\@writefile{toc}{\contentsline {subsection}{\numberline {5.1}\texttt  {Subsection 1}}{24}{subsection.5.1}}
\@writefile{toc}{\contentsline {subsection}{\numberline {5.2}\texttt  {Subsection 2}}{24}{subsection.5.2}}
\AC@undonewlabel{acro:OLS}
\newlabel{acro:OLS}{{5.2}{25}{\texttt {Subsection 2}}{section*.6}{}}
\newlabel{acro:OLS@cref}{{[subsection][2][5]5.2}{25}}
\acronymused{OLS}
\AC@undonewlabel{acro:pi}
\newlabel{acro:pi}{{5.2}{25}{\texttt {Subsection 2}}{section*.7}{}}
\newlabel{acro:pi@cref}{{[subsection][2][5]5.2}{25}}
\acronymused{pi}
\bibstyle{myapalike4}
\bibdata{Literaturverzeichnis}
\bibcite{Bishop1995}{{1}{1995}{{Bishop}}{{}}}
\bibcite{DonohoJohnstone1994}{{2}{1994}{{Donoho and Johnstone}}{{}}}
\bibcite{EfronHastie2004}{{3}{2004}{{Efron et~al.}}{{}}}
\bibcite{Fu1998}{{4}{1998}{{Fu}}{{}}}
\bibcite{Greene2012}{{5}{2012}{{Greene}}{{}}}
\bibcite{Hansen2015}{{6}{2015}{{Hansen}}{{}}}
\bibcite{Hastie2009}{{7}{2009}{{Hastie et~al.}}{{}}}
\bibcite{Hastie2015}{{8}{2015}{{Hastie et~al.}}{{}}}
\bibcite{Iturbide2013}{{9}{2013}{{Iturbide et~al.}}{{}}}
\bibcite{James2013}{{10}{2013}{{James et~al.}}{{}}}
\bibcite{LawsonHanson1995}{{11}{1995}{{Lawson and Hanson}}{{}}}
\bibcite{Leng2006}{{12}{2006}{{Leng et~al.}}{{}}}
\@writefile{toc}{\contentsline {section}{VI Literaturverzeichnis}{VI}{section*.8}}
\bibcite{Osborne1999}{{13}{1999}{{Osborne et~al.}}{{}}}
\bibcite{Schmidt2005}{{14}{2005}{{Schmidt}}{{}}}
\bibcite{Tibshirani1996}{{15}{1996}{{Tibshirani}}{{}}}
\bibcite{Wang2007}{{16}{2007}{{Wang}}{{}}}
\bibcite{Wooldridge2008}{{17}{2008}{{Wooldridge}}{{}}}
\bibcite{Yang2014}{{18}{2014}{{Yang et~al.}}{{}}}
\bibcite{ZhangHuang2008}{{19}{2008}{{Zhang and Huang}}{{}}}
\bibcite{ZouHastie2005}{{20}{2005}{{Zou and Hastie}}{{}}}
\@writefile{toc}{\contentsline {section}{VII Appendix}{VIII}{section*.9}}
