{
    "Pclass": {
        "question": "Tu voyages toujours ? Blup blup",
        "reponse": [
            ["En premiere, car je le vaux bien", 1], 
            ["En seconde, je suis radin.e", 2], 
            ["En super eco, je suis fauche.e ...", 3]
        ]
    },

    "Sex": {
        "question": "Sur ta carte d'identitee, tu es :",
        "reponse": [
            ["Une femme", "female"], 
            ["Un homme", "male"]
        ]
    },

    "SibSp": {
        "question": "Avec qui voyages tu ?",
        "reponse": [
            ["Seul.e, c'est la vie ...", 0], 
            ["Avec ma moitiee, c'est notre lune de miel !", 1], 
            ["Tout mes potes !!!", 5], 
            ["Mes gentils collegues de travail", 3]
        ]
    },

    "Parch": {
        "question": "Pour de vrai, avec qui voyages tu ?",
        "reponse": [
            ["Seul.e, je te dis !", 0], 
            ["Mes parents", 2], 
            ["Ma nounou", 1], 
            ["Tout mes ailleux !", 4]
        ]
    },

    "Name": {
        "question": "On t'appelle :",
        "reponse":[
            ["Madamme", "x, Mrs. x"],
            ["Mademoiselle (c'est old scool)", "x, Miss. x"],
            ["Monsieur", "x, Mr. x"],
            ["Docteur", "x, Dr. x"],
            ["Princesse", "x, Princess. x"],
            ["Mon capitaine", "x, Captain. x"]
        ]
    },

    "Embarked": {
        "question": "Ou as-tu pris le grand bateau ?",
        "reponse":[
            ["Cherbourg, vive la France !", "C"],
            ["Southampton, god save the queen !", "S"], 
            ["Queenstown, c'est ma ville !", "Q"]
        ]
    }
}