module gitlab.com/chrisjarrette.com/boot.dev-projects/chirpy

go 1.20

require (
	github.com/go-chi/chi/v5 v5.0.8
	github.com/golang-jwt/jwt/v5 v5.0.0
	github.com/joho/godotenv v1.5.1
	golang.org/x/crypto v0.10.0
)
