
<svg viewBox="0 0 400 600" xmlns="http://www.w3.org/2000/svg" xmlns:svg="http://www.w3.org/2000/svg">
<style>
  .btn { fill: #999; }
  .btn { rx: 15; }
  .btn { stroke:#000 }
  .deck { fill: #999; }
  .deck { stroke:#000}
  .shuttle { fill: #4c4c4c; }
  .shuttle { stroke:#000}
  .jog { fill: #7f7f7f; }
  .jog { stroke:#000}
  .frame {fill:#00f}
  .btn:hover{fill:#0f0}
  .shuttle:hover, .jog:hover{fill:#f00} <!-- must use this to  show elements on top of each other-->

</style>
 <g class="device" id="XBA4X3JOG">
  <rect class="frame" id="frame_1" x="0" y="0"  height="600" width="400"  />
   <g id="button_panel">
  <rect class="btn" id="btn_1" x="0" y="0"  height="100" width="100"  />
  <rect class="btn" id="btn_2" x="0" y="100"  height="100" width="100"  />
  <rect class="btn" id="btn_3" x="0" y="200"  height="100" width="100"   />

  <rect class="btn" id="btn_4" x="100" y="0"  height="100" width="100"   />
  <rect class="btn" id="btn_5" x="100" y="100"  height="100" width="100"   />
  <rect class="btn" id="btn_6" x="100" y="200"  height="100" width="100"   />

  <rect class="btn" id="btn_7" x="200" y="0"  height="100" width="100"   />
  <rect class="btn" id="btn_8" x="200" y="100"  height="100" width="100"  />
  <rect class="btn" id="btn_9" x="200" y="200"  height="100" width="100"   />

  <rect class="btn" id="btn_10" x="300" y="0"  height="100" width="100"   />
  <rect class="btn" id="btn_11" x="300" y="100"  height="100" width="100"   />
  <rect class="btn" id="btn_12" x="300" y="200"  height="100" width="100"  />
  </g>
   <g id="jog_shuttle_1">
    <rect class="deck" x="0" y="300" height="300" id="jog_deck" width="400"/>
    <circle class="shuttle" cx="200" cy="450" id="shuttle_1" r="141"/>
    <circle class="jog" cx="200" cy="450"  id="jog_1" r="120" />
    <circle cx="265" cy="507" fill="none" id="jog_1_1" r="25" stroke="#000000"/>
  </g>
  </g>

</svg>
