{
  "default": {
    "host": "http://localhost:3000/v2/polyfill.min.js",
    "name": "mm-api",
    "minify": true,
    "linter": false,
    "branch": true,
    "watch": "./src",
    "alias": {
      "@": "./src"
    },
    "ignoreWarnings": [
      "JSON2",
      "THIS_IS_UNDEFINED"
    ],
    "env": {
      "EMULATE_USERNAME": "chris.obeirne1",
       "DB_NAME": "WEB_JLC",
      "ASP_ENV": "development"
    },
    "debug": false,
    "disableSession": true
  },
  "files": [
    {
      "name": "index",
      "entry": "./src/index.js",
      "output": "c:\\inetpub\\wwwroot\\shared\\mm-api\\index.asp"
    }
  ]
}
