{
  "experiment": "exp-plant2-6-50-SGD-A10",
  "num_classes": 2,
  "epochs": 50,
  "batch_size": 3,
  "optimizer": "SGD",
  "lr": 0.005,
  "momentum": 0.9,
  "weight_decay": 5e-05,
  "step_size": 10,
  "gamma": 0.5,
  "train_val_split": 0.7,
  "print_frequency": 10,
  "save_frequency": 10,
  "save_images": false,
  "save_masks": false,
  "model_repo": "/media/chris/Vol1TB/FH/Master/model-repository",
  "images_folder": "/home/chris/tmp/datasets/plant2/normalized-nogrey-augmented",
  "test_images_folder": "/home/chris/tmp/datasets/plant2/normalized-nogrey/test",
  "annotation_file": "/home/chris/tmp/datasets/plant2/normalized-nogrey-augmented/instances_default.json",
  "test_annotation_file": "/home/chris/tmp/datasets/plant2/instances_default.json"
}