*** Life<Cell> 10x2 ***

Generation = 0, Population = 3.
--
--
--
--
-0
0-
--
-0
--
--

Generation = 1, Population = 5.
--
--
--
-0
--
--
00
0-
-0
--

Generation = 2, Population = 9.
--
--
-0
0-
-0
00
-1
10
--
-0

Generation = 3, Population = 10.
--
-0
--
-0
01
11
0-
*-
0-
0-

Generation = 4, Population = 10.
-0
0-
--
-1
-*
*-
--
*0
-0
10

*** Life<Cell> 11x7 ***

Generation = 0, Population = 7.
------0
00-----
-------
-------
------0
-------
---0---
0------
-------
-------
-0-----

Generation = 1, Population = 22.
00---0-
110---0
00-----
------0
-----0-
---0--0
0-0-0--
-0-0---
0------
-0-----
0-0----

Generation = 2, Population = 20.
----0--
*-10---
-------
00-----
---00-0
0------
-0---00
0-0----
-0-0---
0------
-0-0---

*** Life<Cell> 4x11 ***

Generation = 0, Population = 8.
-0-00---0-0
-----------
----0------
0---0------

Generation = 1, Population = 17.
0--110-0---
-0-0----0-0
0--010-----
-0-010-----

*** Life<Cell> 8x12 ***

Generation = 0, Population = 17.
-00---0-----
---0--00----
------------
---0-------0
0----0---0--
----0-----00
-------00---
-----0------

Generation = 1, Population = 41.
011--01-----
-0--00-10---
------00---0
0-0-00---00-
-0-0--0-0---
0--0---00-11
----00011000
----0-000---

Generation = 2, Population = 47.
1**0--*-0---
-1-01---10-0
000--01--0--
-0-01100-11-
0-01---01--0
--01-00-10--
0-----1---1-
---010-1--00

*** Life<Cell> 6x5 ***

Generation = 0, Population = 3.
-----
---0-
-----
0---0
-----
-----

Generation = 1, Population = 10.
---0-
--0-0
0--00
-0-0-
0---0
-----

Generation = 2, Population = 8.
-----
00--1
-----
0--10
-----
0---0

*** Life<Cell> 7x8 ***

Generation = 0, Population = 4.
0-------
--------
-0-0-0--
--------
--------
--------
--------

Generation = 1, Population = 10.
-0------
00-0-0--
0-----0-
-0-0-0--
--------
--------
--------

Generation = 2, Population = 11.
-100-0--
--------
10---0-0
--------
-0-0-0--
--------
--------

*** Life<Cell> 7x9 ***

Generation = 0, Population = 8.
00---0---
---------
---------
0--------
-0-------
--0------
-------00

Generation = 1, Population = 16.
110-0-0--
00---0---
0--------
---------
---------
---0---00
--0---011

Generation = 2, Population = 16.
-*1--0-0-
1--------
1----0---
0--------
---0---00
----0----
-0---01*-

Generation = 3, Population = 29.
-**00---0
*-0----0-
-0--0-0--
10-0-0-00
0-0---011
-0----0-0
0-0--1-.1

Generation = 4, Population = 25.
-**-10---
*-1------
11---0-00
--0-0----
1------**
0-0---10-
-0-00--**

Generation = 5, Population = 33.
-**-*10--
*-*00--00
-*0----11
---------
*0--0--**
10--00*10
--0111-**

*** Life<Cell> 1x13 ***

Generation = 0, Population = 1.
----0--------

Generation = 1, Population = 2.
---0-0-------

Generation = 2, Population = 2.
--0---0------

Generation = 3, Population = 4.
-0-0-0-0-----

*** Life<Cell> 2x13 ***

Generation = 0, Population = 2.
--------0----
---0---------

Generation = 1, Population = 6.
---0---0-0---
--0-0---0----

Generation = 2, Population = 6.
------0-0-0--
-0-0-0-------

Generation = 3, Population = 6.
-0-0-------0-
0-------0-0--

*** Life<Cell> 10x9 ***

Generation = 0, Population = 25.
--0------
--000-0--
----0-0--
--0-00-0-
---0---0-
0-----00-
------000
0--------
00-0-----
----0---0

Generation = 1, Population = 36.
-01-0-0--
-0----10-
-----01--
-0-0-1010
0----0--0
-0-0-0-1-
-----0-11
1--0--000
-1------0
00---0-0-
