*** Life<ConwayCell> 10x10 ***

Generation = 0, Population = 4.
*.........
..*.......
..........
..........
....*.....
..........
..........
..........
..........
.........*

Generation = 1, Population = 0.
..........
..........
..........
..........
..........
..........
..........
..........
..........
..........

*** Life<ConwayCell> 3x10 ***

Generation = 0, Population = 6.
.........*
....*..*..
.***......

Generation = 1, Population = 4.
..........
..**......
..**......

Generation = 2, Population = 4.
..........
..**......
..**......

Generation = 3, Population = 4.
..........
..**......
..**......

Generation = 4, Population = 4.
..........
..**......
..**......

Generation = 5, Population = 4.
..........
..**......
..**......

Generation = 6, Population = 4.
..........
..**......
..**......

Generation = 7, Population = 4.
..........
..**......
..**......

Generation = 8, Population = 4.
..........
..**......
..**......

Generation = 9, Population = 4.
..........
..**......
..**......

Generation = 10, Population = 4.
..........
..**......
..**......

Generation = 11, Population = 4.
..........
..**......
..**......

*** Life<ConwayCell> 1x1 ***

Generation = 0, Population = 1.
*

Generation = 1, Population = 0.
.

*** Life<ConwayCell> 4x4 ***

Generation = 0, Population = 16.
****
****
****
****

Generation = 4, Population = 0.
....
....
....
....

Generation = 8, Population = 0.
....
....
....
....

Generation = 12, Population = 0.
....
....
....
....

Generation = 16, Population = 0.
....
....
....
....

Generation = 20, Population = 0.
....
....
....
....

*** Life<ConwayCell> 12x1 ***

Generation = 0, Population = 3.
.
.
*
*
.
.
.
.
.
.
.
*

Generation = 1, Population = 0.
.
.
.
.
.
.
.
.
.
.
.
.

Generation = 2, Population = 0.
.
.
.
.
.
.
.
.
.
.
.
.

*** Life<ConwayCell> 12x12 ***

Generation = 0, Population = 8.
............
.**.........
.**.........
............
.....*......
............
............
............
............
............
..........*.
**..........

Generation = 3, Population = 4.
............
.**.........
.**.........
............
............
............
............
............
............
............
............
............

Generation = 6, Population = 4.
............
.**.........
.**.........
............
............
............
............
............
............
............
............
............

*** Life<ConwayCell> 2x2 ***

Generation = 0, Population = 2.
*.
.*

Generation = 1, Population = 0.
..
..

Generation = 2, Population = 0.
..
..

*** Life<ConwayCell> 55x45 ***

Generation = 0, Population = 1.
*............................................
.............................................
.............................................
.............................................
.............................................
.............................................
.............................................
.............................................
.............................................
.............................................
.............................................
.............................................
.............................................
.............................................
.............................................
.............................................
.............................................
.............................................
.............................................
.............................................
.............................................
.............................................
.............................................
.............................................
.............................................
.............................................
.............................................
.............................................
.............................................
.............................................
.............................................
.............................................
.............................................
.............................................
.............................................
.............................................
.............................................
.............................................
.............................................
.............................................
.............................................
.............................................
.............................................
.............................................
.............................................
.............................................
.............................................
.............................................
.............................................
.............................................
.............................................
.............................................
.............................................
.............................................
.............................................

Generation = 1, Population = 0.
.............................................
.............................................
.............................................
.............................................
.............................................
.............................................
.............................................
.............................................
.............................................
.............................................
.............................................
.............................................
.............................................
.............................................
.............................................
.............................................
.............................................
.............................................
.............................................
.............................................
.............................................
.............................................
.............................................
.............................................
.............................................
.............................................
.............................................
.............................................
.............................................
.............................................
.............................................
.............................................
.............................................
.............................................
.............................................
.............................................
.............................................
.............................................
.............................................
.............................................
.............................................
.............................................
.............................................
.............................................
.............................................
.............................................
.............................................
.............................................
.............................................
.............................................
.............................................
.............................................
.............................................
.............................................
.............................................

*** Life<ConwayCell> 7x4 ***

Generation = 0, Population = 4.
....
....
...*
...*
....
..*.
.*..

Generation = 3, Population = 0.
....
....
....
....
....
....
....

*** Life<ConwayCell> 7x8 ***

Generation = 0, Population = 6.
........
..*....*
.*......
........
.....*..
......*.
.......*

Generation = 3, Population = 0.
........
........
........
........
........
........
........

Generation = 6, Population = 0.
........
........
........
........
........
........
........

Generation = 9, Population = 0.
........
........
........
........
........
........
........

Generation = 12, Population = 0.
........
........
........
........
........
........
........

*** Life<ConwayCell> 6x6 ***

Generation = 0, Population = 5.
*.....
......
...*..
..*.*.
.....*
......

Generation = 1, Population = 3.
......
......
...*..
...**.
......
......

Generation = 2, Population = 4.
......
......
...**.
...**.
......
......

Generation = 3, Population = 4.
......
......
...**.
...**.
......
......

Generation = 4, Population = 4.
......
......
...**.
...**.
......
......
