module gitlab.com/chri.koch/vaccinator

go 1.16

require (
	github.com/go-telegram-bot-api/telegram-bot-api v4.6.4+incompatible // indirect
	github.com/technoweenie/multipartstreamer v1.0.1 // indirect
)
