{
    "assignees": [
      "@sean.melissari"
    ],
    "baseBranches": [
      "development"
    ],
    "postUpgradeTasks": {
        "commands": [
            "kpt pkg sync ."
        ],
        "fileFilters": [
            "scripts/*"
        ]
    },
    "regexManagers": [
        {
            "fileMatch": [
                "^Dockerfile$"
            ],
            "matchStrings": [
                "SONAR_SCANNER_VERSION=\"(?<currentValue>.*?)\""
            ],
            "depNameTemplate": "sonarsource/sonar-scanner-cli-docker",
            "datasourceTemplate": "docker"
        },
        {
            "fileMatch": [
                "^Kptfile$"
            ],
            "matchStrings": [
                "\\s+ref:\\s+(?<currentValue>.*?)\n"
            ],
            "depNameTemplate": "sonarsource/sonar-scanner-cli-docker",
            "datasourceTemplate": "github-tags",
            "versioningTemplate": "loose"
        },
        {
            "fileMatch": [
                "^hardening_manifest.yaml$"
            ],
            "matchStrings": [
                "org\\.opencontainers\\.image\\.version:\\s+(\\s|\"|')?(?<currentValue>.+?)(\\s|\"|'|$)",
                "tags:\\s+-(\\s|\"|')+(?<currentValue>.+?)(\\s|\"|'|$)+"
            ],
            "depNameTemplate": "sonarsource/sonar-scanner-cli-docker",
            "datasourceTemplate": "docker"
        }
    ]
}
  
