{
  "assignees": [
    "@sean.melissari"
  ],
  "baseBranches": [
    "development"
  ],
  "automerge": true,
  "gitLabAutomerge": true,
  "regexManagers": [
    {
      "fileMatch": [
        "^hardening_manifest.yaml$"
      ],
      "matchStrings": [
        "org\\.opencontainers\\.image\\.version:\\s+(\\s|\"|')?(?<currentValue>.+?)(\\s|\"|'|$)"
      ],
      "depNameTemplate": "registry",
      "datasourceTemplate": "docker"
    },
    {
      "fileMatch": [
        "^hardening_manifest.yaml$"
      ],
      "matchStrings": [
        "tags:\\s+-(\\s|\"|')+(?<currentValue>.+?)(\\s|\"|'|$)+"
      ],
      "depNameTemplate": "registry",
      "datasourceTemplate": "docker"
    }
  ]
}
