{
    "assignees": [
      "@jacob.rohlman"
    ],
    "baseBranches": [
      "development"
    ],
    "packageRules": [
      {
        "datasources": ["docker"],
        "packageNames": ["quay.io/helmpack/chart-testing"],
        "major": {
          "enabled": true
        }
      }
    ],
    "automerge": true,
    "gitLabAutomerge": true,
    "regexManagers": [
      {
        "fileMatch": [
          "^hardening_manifest.yaml$"
        ],
        "matchStrings": [
          "org\\.opencontainers\\.image\\.version:\\s+(\\s|\"|')?(?<currentValue>.+?)(\\s|\"|'|$)"
        ],
        "depNameTemplate": "quay.io/helmpack/chart-testing",
        "datasourceTemplate": "docker"
      },
      {
        "fileMatch": [
          "^hardening_manifest.yaml$"
        ],
        "matchStrings": [
          "tags:\\s+-(\\s|\"|')+(?<currentValue>.+?)(\\s|\"|'|$)+"
        ],
        "depNameTemplate": "quay.io/helmpack/chart-testing",
        "datasourceTemplate": "docker"
      }
    ]
  }