{
  "assignees": [
    "@andymaks"
  ],
  "baseBranches": [
    "development"
  ],
  "automerge": false,
  "gitLabAutomerge": false,
  "regexManagers": [
    {
      "fileMatch": [
        "^hardening_manifest.yaml$"
      ],
      "matchStrings": [
        "org\\.opencontainers\\.image\\.version:\\s+(\\s|\"|')?(?<currentValue>.+?)(\\s|\"|'|$)",
        "tags:\\s+-(\\s|\"|')+(?<currentValue>.+?)(\\s|\"|'|$)+"
      ],
      "depNameTemplate": "ansible-lint",
      "datasourceTemplate": "pypi"
    }
  ]
}
