// Jest Snapshot v1, https://goo.gl/fbAQLP

exports[`ToDoComponent renders with full data 1`] = `
<div>
  <span
    className="done"
  >
    Test
  </span>
  |
  <span>
    2023-06-14T12:34:56.000Z
  </span>
  |
  <span
    className="outdated"
  >
    2001-01-03T01:02:03.000Z
  </span>
  |
  <span>
    [
    2023-06-14T12:34:56.000Z
    ]
  </span>
  <div>
    <button
      onClick={[Function]}
    >
      UNDONE
    </button>
  </div>
</div>
`;

exports[`ToDoComponent renders without full data 1`] = `
<div>
  <span>
    Test
  </span>
  |
  <span>
    2023-06-14T12:34:56.000Z
  </span>
  |
  <span />
  |
  <span>
    [
    ]
  </span>
  <div>
    <button
      onClick={[Function]}
    >
      DONE
    </button>
  </div>
</div>
`;
