// Jest Snapshot v1, https://goo.gl/fbAQLP

exports[`DynamicSelect handles change 1`] = `
<div>
  <ForwardRef(FormControl)
    fullWidth={true}
  >
    <ForwardRef(InputLabel)
      id="demo-simple-select-label"
    >
      Item
    </ForwardRef(InputLabel)>
    <ForwardRef(Select)
      id="demo-simple-select"
      label="Item"
      labelId="demo-simple-select-label"
      onChange={[Function]}
      value="test"
    >
      <ForwardRef(MenuItem)
        key="0"
        value="test"
      >
        test
      </ForwardRef(MenuItem)>
    </ForwardRef(Select)>
  </ForwardRef(FormControl)>
  <ForwardRef(ButtonGroup)
    variant="contained"
  >
    <ForwardRef(TextField)
      className="text-dynamic"
      label="Input"
      onChange={[Function]}
      value=""
      variant="outlined"
    />
    <ForwardRef(Button)
      className="button-dynamic"
      onClick={[Function]}
    >
      Add
    </ForwardRef(Button)>
  </ForwardRef(ButtonGroup)>
</div>
`;

exports[`DynamicSelect handles clicking 1`] = `
<div>
  <ForwardRef(FormControl)
    fullWidth={true}
  >
    <ForwardRef(InputLabel)
      id="demo-simple-select-label"
    >
      Item
    </ForwardRef(InputLabel)>
    <ForwardRef(Select)
      id="demo-simple-select"
      label="Item"
      labelId="demo-simple-select-label"
      onChange={[Function]}
      value=""
    >
      <ForwardRef(MenuItem)
        key="0"
        value="test"
      >
        test
      </ForwardRef(MenuItem)>
    </ForwardRef(Select)>
  </ForwardRef(FormControl)>
  <ForwardRef(ButtonGroup)
    variant="contained"
  >
    <ForwardRef(TextField)
      className="text-dynamic"
      label="Input"
      onChange={[Function]}
      value=""
      variant="outlined"
    />
    <ForwardRef(Button)
      className="button-dynamic"
      onClick={[Function]}
    >
      Add
    </ForwardRef(Button)>
  </ForwardRef(ButtonGroup)>
</div>
`;

exports[`DynamicSelect handles input 1`] = `
<div>
  <ForwardRef(FormControl)
    fullWidth={true}
  >
    <ForwardRef(InputLabel)
      id="demo-simple-select-label"
    >
      Item
    </ForwardRef(InputLabel)>
    <ForwardRef(Select)
      id="demo-simple-select"
      label="Item"
      labelId="demo-simple-select-label"
      onChange={[Function]}
      value=""
    />
  </ForwardRef(FormControl)>
  <ForwardRef(ButtonGroup)
    variant="contained"
  >
    <ForwardRef(TextField)
      className="text-dynamic"
      label="Input"
      onChange={[Function]}
      value="test"
      variant="outlined"
    />
    <ForwardRef(Button)
      className="button-dynamic"
      onClick={[Function]}
    >
      Add
    </ForwardRef(Button)>
  </ForwardRef(ButtonGroup)>
</div>
`;

exports[`DynamicSelect renders 1`] = `
<div>
  <ForwardRef(FormControl)
    fullWidth={true}
  >
    <ForwardRef(InputLabel)
      id="demo-simple-select-label"
    >
      Item
    </ForwardRef(InputLabel)>
    <ForwardRef(Select)
      id="demo-simple-select"
      label="Item"
      labelId="demo-simple-select-label"
      onChange={[Function]}
      value=""
    />
  </ForwardRef(FormControl)>
  <ForwardRef(ButtonGroup)
    variant="contained"
  >
    <ForwardRef(TextField)
      className="text-dynamic"
      label="Input"
      onChange={[Function]}
      value=""
      variant="outlined"
    />
    <ForwardRef(Button)
      className="button-dynamic"
      onClick={[Function]}
    >
      Add
    </ForwardRef(Button)>
  </ForwardRef(ButtonGroup)>
</div>
`;
