// Jest Snapshot v1, https://goo.gl/fbAQLP

exports[`TeleAddressFormPage handles correct data after errors 1`] = `
<Fragment>
  <BackButton
    to="/person/0"
  />
  <form
    className="form-data"
    onSubmit={[Function]}
  >
    <TextInput
      className="input-phone"
      error={false}
      label="Jaki jest Pana telefon?"
      onChange={[Function]}
      type="tel"
      value="123"
    />
    <TextInput
      className="input-email"
      error={false}
      label="Jaki jest Pana email?"
      onChange={[Function]}
      type="email"
      value="te@s.t"
    />
    <TextInput
      className="input-street"
      error={false}
      label="Jaka jest Pana ulica?"
      onChange={[Function]}
      value="Testowa"
    />
    <TextInput
      className="input-house-no"
      error={false}
      label="Jaki jest Pana nr domu?"
      onChange={[Function]}
      value="20"
    />
    <TextInput
      className="input-flat-no"
      error={false}
      label="Jaki jest Pana nr mieszkania?"
      onChange={[Function]}
      value="10"
    />
    <TextInput
      className="input-city"
      error={false}
      label="Jakie jest Pana miasto?"
      onChange={[Function]}
      value="Krakow"
    />
    <TextInput
      className="input-country"
      error={false}
      label="Jaki jest Pana kraj?"
      onChange={[Function]}
      value="PL"
    />
    <SendButton
      className="button-send"
      onClick={[Function]}
    />
  </form>
</Fragment>
`;

exports[`TeleAddressFormPage handles data change 1`] = `
<Fragment>
  <BackButton
    to="/person/0"
  />
  <form
    className="form-data"
    onSubmit={[Function]}
  >
    <TextInput
      className="input-phone"
      error={false}
      label="Jaki jest Pani telefon?"
      onChange={[Function]}
      type="tel"
      value="123"
    />
    <TextInput
      className="input-email"
      error={false}
      label="Jaki jest Pani email?"
      onChange={[Function]}
      type="email"
      value="te@s.t"
    />
    <TextInput
      className="input-street"
      error={false}
      label="Jaka jest Pani ulica?"
      onChange={[Function]}
      value="Testowa"
    />
    <TextInput
      className="input-house-no"
      error={false}
      label="Jaki jest Pani nr domu?"
      onChange={[Function]}
      value="20"
    />
    <TextInput
      className="input-flat-no"
      error={false}
      label="Jaki jest Pani nr mieszkania?"
      onChange={[Function]}
      value="10"
    />
    <TextInput
      className="input-city"
      error={false}
      label="Jakie jest Pani miasto?"
      onChange={[Function]}
      value="Krakow"
    />
    <TextInput
      className="input-country"
      error={false}
      label="Jaki jest Pani kraj?"
      onChange={[Function]}
      value="PL"
    />
    <SendButton
      className="button-send"
      onClick={[Function]}
    />
  </form>
</Fragment>
`;

exports[`TeleAddressFormPage handles data change 2`] = `
<Fragment>
  <BackButton
    to="/person/0"
  />
  <form
    className="form-data"
    onSubmit={[Function]}
  >
    <TextInput
      className="input-phone"
      error={false}
      label="Jaki jest Pana telefon?"
      onChange={[Function]}
      type="tel"
      value="123"
    />
    <TextInput
      className="input-email"
      error={false}
      label="Jaki jest Pana email?"
      onChange={[Function]}
      type="email"
      value="te@s.t"
    />
    <TextInput
      className="input-street"
      error={false}
      label="Jaka jest Pana ulica?"
      onChange={[Function]}
      value="Testowa"
    />
    <TextInput
      className="input-house-no"
      error={false}
      label="Jaki jest Pana nr domu?"
      onChange={[Function]}
      value="20"
    />
    <TextInput
      className="input-flat-no"
      error={false}
      label="Jaki jest Pana nr mieszkania?"
      onChange={[Function]}
      value="10"
    />
    <TextInput
      className="input-city"
      error={false}
      label="Jakie jest Pana miasto?"
      onChange={[Function]}
      value="Krakow"
    />
    <TextInput
      className="input-country"
      error={false}
      label="Jaki jest Pana kraj?"
      onChange={[Function]}
      value="PL"
    />
    <SendButton
      className="button-send"
      onClick={[Function]}
    />
  </form>
</Fragment>
`;

exports[`TeleAddressFormPage handles empty data send 1`] = `
<Fragment>
  <BackButton
    to="/person/0"
  />
  <form
    className="form-data"
    onSubmit={[Function]}
  >
    <TextInput
      className="input-phone"
      error={true}
      label="Jaki jest Pana telefon?"
      onChange={[Function]}
      type="tel"
      value=""
    />
    <TextInput
      className="input-email"
      error={true}
      label="Jaki jest Pana email?"
      onChange={[Function]}
      type="email"
      value=""
    />
    <TextInput
      className="input-street"
      error={true}
      label="Jaka jest Pana ulica?"
      onChange={[Function]}
      value=""
    />
    <TextInput
      className="input-house-no"
      error={true}
      label="Jaki jest Pana nr domu?"
      onChange={[Function]}
      value=""
    />
    <TextInput
      className="input-flat-no"
      error={true}
      label="Jaki jest Pana nr mieszkania?"
      onChange={[Function]}
      value=""
    />
    <TextInput
      className="input-city"
      error={true}
      label="Jakie jest Pana miasto?"
      onChange={[Function]}
      value=""
    />
    <TextInput
      className="input-country"
      error={true}
      label="Jaki jest Pana kraj?"
      onChange={[Function]}
      value=""
    />
    <SendButton
      className="button-send"
      onClick={[Function]}
    />
  </form>
</Fragment>
`;

exports[`TeleAddressFormPage handles form submit 1`] = `
<Fragment>
  <BackButton
    to="/person/0"
  />
  <form
    className="form-data"
    onSubmit={[Function]}
  >
    <TextInput
      className="input-phone"
      error={false}
      label="Jaki jest Pana telefon?"
      onChange={[Function]}
      type="tel"
      value=""
    />
    <TextInput
      className="input-email"
      error={false}
      label="Jaki jest Pana email?"
      onChange={[Function]}
      type="email"
      value=""
    />
    <TextInput
      className="input-street"
      error={false}
      label="Jaka jest Pana ulica?"
      onChange={[Function]}
      value=""
    />
    <TextInput
      className="input-house-no"
      error={false}
      label="Jaki jest Pana nr domu?"
      onChange={[Function]}
      value=""
    />
    <TextInput
      className="input-flat-no"
      error={false}
      label="Jaki jest Pana nr mieszkania?"
      onChange={[Function]}
      value=""
    />
    <TextInput
      className="input-city"
      error={false}
      label="Jakie jest Pana miasto?"
      onChange={[Function]}
      value=""
    />
    <TextInput
      className="input-country"
      error={false}
      label="Jaki jest Pana kraj?"
      onChange={[Function]}
      value=""
    />
    <SendButton
      className="button-send"
      onClick={[Function]}
    />
  </form>
</Fragment>
`;

exports[`TeleAddressFormPage renders fully K 1`] = `
<Fragment>
  <BackButton
    to="/person/0"
  />
  <form
    className="form-data"
    onSubmit={[Function]}
  >
    <TextInput
      className="input-phone"
      error={false}
      label="Jaki jest Pani telefon?"
      onChange={[Function]}
      type="tel"
      value=""
    />
    <TextInput
      className="input-email"
      error={false}
      label="Jaki jest Pani email?"
      onChange={[Function]}
      type="email"
      value=""
    />
    <TextInput
      className="input-street"
      error={false}
      label="Jaka jest Pani ulica?"
      onChange={[Function]}
      value=""
    />
    <TextInput
      className="input-house-no"
      error={false}
      label="Jaki jest Pani nr domu?"
      onChange={[Function]}
      value=""
    />
    <TextInput
      className="input-flat-no"
      error={false}
      label="Jaki jest Pani nr mieszkania?"
      onChange={[Function]}
      value=""
    />
    <TextInput
      className="input-city"
      error={false}
      label="Jakie jest Pani miasto?"
      onChange={[Function]}
      value=""
    />
    <TextInput
      className="input-country"
      error={false}
      label="Jaki jest Pani kraj?"
      onChange={[Function]}
      value=""
    />
    <SendButton
      className="button-send"
      onClick={[Function]}
    />
  </form>
</Fragment>
`;

exports[`TeleAddressFormPage renders fully M 1`] = `
<Fragment>
  <BackButton
    to="/person/0"
  />
  <form
    className="form-data"
    onSubmit={[Function]}
  >
    <TextInput
      className="input-phone"
      error={false}
      label="Jaki jest Pana telefon?"
      onChange={[Function]}
      type="tel"
      value=""
    />
    <TextInput
      className="input-email"
      error={false}
      label="Jaki jest Pana email?"
      onChange={[Function]}
      type="email"
      value=""
    />
    <TextInput
      className="input-street"
      error={false}
      label="Jaka jest Pana ulica?"
      onChange={[Function]}
      value=""
    />
    <TextInput
      className="input-house-no"
      error={false}
      label="Jaki jest Pana nr domu?"
      onChange={[Function]}
      value=""
    />
    <TextInput
      className="input-flat-no"
      error={false}
      label="Jaki jest Pana nr mieszkania?"
      onChange={[Function]}
      value=""
    />
    <TextInput
      className="input-city"
      error={false}
      label="Jakie jest Pana miasto?"
      onChange={[Function]}
      value=""
    />
    <TextInput
      className="input-country"
      error={false}
      label="Jaki jest Pana kraj?"
      onChange={[Function]}
      value=""
    />
    <SendButton
      className="button-send"
      onClick={[Function]}
    />
  </form>
</Fragment>
`;

exports[`TeleAddressFormPage renders with exceeded id 1`] = `
<Navigate
  to="/person"
/>
`;

exports[`TeleAddressFormPage renders with teleaddress data 1`] = `
<Navigate
  to="/person/0"
/>
`;

exports[`TeleAddressFormPage renders without id 1`] = `
<Navigate
  to="/person"
/>
`;
