// Jest Snapshot v1, https://goo.gl/fbAQLP

exports[`App renders with token 1`] = `
<div
  className="App"
>
  <Routes>
    <Route
      element={
        <MainPage
          token="test"
        />
      }
      path="/"
    />
    <Route
      element={
        <LoginPage
          onTokenChange={[Function]}
        />
      }
      path="/login"
    />
    <Route
      element={
        <ResourcePage
          token="test"
        />
      }
      path="/:resource/*"
    />
    <Route
      element={<Error404Page />}
      path="/404"
    />
  </Routes>
</div>
`;

exports[`App renders without token 1`] = `
<div
  className="App"
>
  <Routes>
    <Route
      element={<MainPage />}
      path="/"
    />
    <Route
      element={
        <LoginPage
          onTokenChange={[Function]}
        />
      }
      path="/login"
    />
    <Route
      element={<ResourcePage />}
      path="/:resource/*"
    />
    <Route
      element={<Error404Page />}
      path="/404"
    />
  </Routes>
</div>
`;
