// Jest Snapshot v1, https://goo.gl/fbAQLP

exports[`BackButton renders 1`] = `
<div>
  <ForwardRef(Button)
    component={
      Object {
        "$$typeof": Symbol(react.forward_ref),
        "render": [Function],
      }
    }
    startIcon={<Memo />}
    to="/test-to"
    variant="outlined"
  >
    Back
  </ForwardRef(Button)>
</div>
`;
