// Jest Snapshot v1, https://goo.gl/fbAQLP

exports[`TodoItemsList renders 1`] = `
<ul>
  <TaskComponent
    className="task-component-0"
    id={0}
    key="0"
    onDeleteClick={[Function]}
    onRemoveClick={[Function]}
    task={
      Object {
        "created": 2000-02-01T05:30:20.000Z,
        "removed": false,
        "text": "test 1",
      }
    }
  />
  <TaskComponent
    className="task-component-1"
    id={1}
    key="1"
    onDeleteClick={[Function]}
    onRemoveClick={[Function]}
    task={
      Object {
        "created": 2005-06-05T05:55:55.000Z,
        "removed": true,
        "text": "test 2",
      }
    }
  />
</ul>
`;

exports[`TodoItemsList renders empty 1`] = `<ul />`;
