// Jest Snapshot v1, https://goo.gl/fbAQLP

exports[`PersonalDetailsComponent renders 1`] = `
<Fragment>
  <ForwardRef(TableContainer)
    component={
      Object {
        "$$typeof": Symbol(react.forward_ref),
        "propTypes": Object {
          "children": [Function],
          "className": [Function],
          "classes": [Function],
          "component": [Function],
          "elevation": [Function],
          "square": [Function],
          "sx": [Function],
          "variant": [Function],
        },
        "render": [Function],
      }
    }
  >
    <ForwardRef(Table)
      aria-label="simple table"
      sx={
        Object {
          "minWidth": 650,
        }
      }
    >
      <ForwardRef(TableHead)>
        <ForwardRef(TableRow)>
          <ForwardRef(TableCell)>
            first name
          </ForwardRef(TableCell)>
          <ForwardRef(TableCell)>
            middle name name
          </ForwardRef(TableCell)>
          <ForwardRef(TableCell)>
            last name
          </ForwardRef(TableCell)>
          <ForwardRef(TableCell)>
            pesel
          </ForwardRef(TableCell)>
          <ForwardRef(TableCell)
            rowSpan={2}
          >
            <Image
              alt="alt"
              src="src"
            />
          </ForwardRef(TableCell)>
        </ForwardRef(TableRow)>
      </ForwardRef(TableHead)>
      <ForwardRef(TableBody)>
        <ForwardRef(TableRow)>
          <ForwardRef(TableCell)>
            Test
          </ForwardRef(TableCell)>
          <ForwardRef(TableCell)>
            Test
          </ForwardRef(TableCell)>
          <ForwardRef(TableCell)>
            testowy
          </ForwardRef(TableCell)>
          <ForwardRef(TableCell)>
            9878
          </ForwardRef(TableCell)>
        </ForwardRef(TableRow)>
      </ForwardRef(TableBody)>
    </ForwardRef(Table)>
  </ForwardRef(TableContainer)>
</Fragment>
`;
