// Jest Snapshot v1, https://goo.gl/fbAQLP

exports[`Error404Page renders 1`] = `
<div>
  Erorr 404: Not found!
  <br />
  <ForwardRef(Button)
    onClick={[Function]}
  >
    &lt; Main Page
  </ForwardRef(Button)>
</div>
`;
