[
    {
        "code":"AMZ",
        "value":"AMZ Gravel"
    } ,
    {
        "code":"AR",
        "value":"Asphalt Rubble"
    } ,
    {
        "code":"C1000",
        "value":"Caliber 1000"
    } ,
    {
        "code":"CC",
        "value":"Crushed Concrete"
    } ,
    {
        "code":"CF",
        "value":"Clean Fill"
    } ,
    {
        "code":"CON",
        "value":"Concrete Rubble"
    } 
]