[
    {
        "code":2121,
        "value":"Case Loader"
    } ,
    {
        "code":2129,
        "value":"Volvo Loader"
    } ,
    {
        "code":2359,
        "value":"Volvo Excavator"
    } ,
    {
        "code":2345,
        "value":"Hitachi Rubber TireBackhoe"
    } ,
    {
        "code":2700,
        "value":"Bobcat Skidsteer"
    } ,
    {
        "code":2357,
        "value":"CAT Large Backhoe"
    } 
]