[
    {
        "ticketId": 20014,
        "operator": "Joy",
        "supervisor": "Garry",
        "date": "2020-01-12T18:30:00.000Z",
        "truckNumber": "CA023432",
        "loads": [
            {
                "materialType": "AR",
                "stockSite": "DY",
                "equipmentLoadCode": 2359,
                "operation": "in"
            },
            {
                "materialType": "AR",
                "stockSite": "DY",
                "equipmentLoadCode": 2129,
                "operation": "in"
            },
            {
                "materialType": "AR",
                "stockSite": "DY",
                "equipmentLoadCode": 2700,
                "operation": "in"
            }
        ]
    },
    {
        "ticketId": 20004,
        "operator": "Kill",
        "supervisor": "Rinder",
        "date": "2020-01-01T18:30:00.000Z",
        "truckNumber": "CA023132",
        "loads": [
            {
                "materialType": "AR",
                "stockSite": "DY",
                "equipmentLoadCode": 2129,
                "operation": "out"
            }
        ]
    }
]