 MICRO =            1
nx=  512 ny=  512 nz=  512 ns= ******** nprocs=   44
 Volume fraction of phase            1  =   0.20103383064270020     
 Volume fraction of phase            2  =   0.79896616935729980     
 Phase            1  conductivity tensor is:
   5.0000000000000000        0.0000000000000000        0.0000000000000000     
   0.0000000000000000        5.0000000000000000        0.0000000000000000     
   0.0000000000000000        0.0000000000000000        5.0000000000000000     
 Phase            2  conductivity tensor is:
   1.0240000000000001E-006   0.0000000000000000        0.0000000000000000     
   0.0000000000000000        1.0240000000000001E-006   0.0000000000000000     
   0.0000000000000000        0.0000000000000000        1.0240000000000001E-006
 Applied field components:
 ex =    1.0000000000000000       ey =    1.0000000000000000       ez =    1.0000000000000000     
  Initial Energy =    202367444.48983765       gg =    121958306.29599649     
 Energy =    54806249.515701294       gg =    1073761.5072703932     
 Number of conjugate steps =          100
 Root took    111.23183560703183       s for          100 conjugate steps.
 Elapsed time=   111.23183560703183       s for          100 conjugate steps.

  Current in x direction =   0.25142304746321137     
  Current in y direction =   0.28631641529391444     
  Current in z direction =   0.27893729927506927     
 Energy =    49631086.171890259       gg =    245803.47733632868     
 Number of conjugate steps =          200
 Root took    111.00004545104457       s for          200 conjugate steps.
 Elapsed time=   222.23188105807640       s for          200 conjugate steps.

  Current in x direction =   0.23025052826218262     
  Current in y direction =   0.25623542413895251     
  Current in z direction =   0.25307486617749447     
 Energy =    47952506.601989746       gg =    119173.14904455660     
 Number of conjugate steps =          300
 Root took    110.27795506000984       s for          300 conjugate steps.
 Elapsed time=   332.50983611808624       s for          300 conjugate steps.

  Current in x direction =   0.22533343734888472     
  Current in y direction =   0.24522172869714576     
  Current in z direction =   0.24399286785139090     
 Energy =    47105911.949066162       gg =    59571.004516121342     
 Number of conjugate steps =          400
 Root took    111.35683876799885       s for          400 conjugate steps.
 Elapsed time=   443.86667488608509       s for          400 conjugate steps.

  Current in x direction =   0.22307631927496158     
  Current in y direction =   0.23795273264902772     
  Current in z direction =   0.24090373873711599     
 Energy =    46686533.957275391       gg =    30000.721942329947     
 Number of conjugate steps =          500
 Root took    110.29482021497097       s for          500 conjugate steps.
 Elapsed time=   554.16149510105606       s for          500 conjugate steps.

  Current in x direction =   0.22137966885936025     
  Current in y direction =   0.23501739727752285     
  Current in z direction =   0.23928650540177693     
 Energy =    46477274.652938843       gg =    12874.919695710048     
 Number of conjugate steps =          600
 Root took    111.29911550297402       s for          600 conjugate steps.
 Elapsed time=   665.46061060403008       s for          600 conjugate steps.

  Current in x direction =   0.22142158998999995     
  Current in y direction =   0.23154548389983803     
  Current in z direction =   0.23959829107571012     
 Energy =    46388150.873489380       gg =    5602.2746963101918     
 Number of conjugate steps =          700
 Root took    110.28049182199175       s for          700 conjugate steps.
 Elapsed time=   775.74110242602183       s for          700 conjugate steps.

  Current in x direction =   0.22174168966380847     
  Current in y direction =   0.23046253273402217     
  Current in z direction =   0.23903309487242486     
 Energy =    46353430.600936890       gg =    1952.1736475252105     
 Number of conjugate steps =          800
 Root took    111.28608986595646       s for          800 conjugate steps.
 Elapsed time=   887.02719229197828       s for          800 conjugate steps.

  Current in x direction =   0.22171557577804957     
  Current in y direction =   0.23011458666539120     
  Current in z direction =   0.23888978252560170     
 Energy =    46340678.121673584       gg =    781.47309196820504     
 Number of conjugate steps =          900
 Root took    110.27119706803933       s for          900 conjugate steps.
 Elapsed time=   997.29838936001761       s for          900 conjugate steps.

  Current in x direction =   0.22165626116387083     
  Current in y direction =   0.22997002131898533     
  Current in z direction =   0.23890363548437962     
 Energy =    46335675.538589478       gg =    310.39743265881259     
 Number of conjugate steps =         1000
 Root took    110.26647299301112       s for         1000 conjugate steps.
 Elapsed time=   1107.5648623530287       s for         1000 conjugate steps.

  Current in x direction =   0.22169537860416086     
  Current in y direction =   0.22982464690905108     
  Current in z direction =   0.23893534803027661     
 Energy =    46333731.859664917       gg =    118.19337279840931     
 Number of conjugate steps =         1100
 Root took    110.26102488499600       s for         1100 conjugate steps.
 Elapsed time=   1217.8258872380247       s for         1100 conjugate steps.

  Current in x direction =   0.22157595160209073     
  Current in y direction =   0.22971914464001925     
  Current in z direction =   0.23913131460713433     
 Energy =    46332897.634948730       gg =    51.276780360630966     
 Number of conjugate steps =         1200
 Root took    110.73449382302351       s for         1200 conjugate steps.
 Elapsed time=   1328.5603810610482       s for         1200 conjugate steps.

  Current in x direction =   0.22151159367592499     
  Current in y direction =   0.22977333149802701     
  Current in z direction =   0.23912905470848403     
 Energy =    46332539.059997559       gg =    23.345312610272373     
 Number of conjugate steps =         1300
 Root took    110.25669290899532       s for         1300 conjugate steps.
 Elapsed time=   1438.8170739700436       s for         1300 conjugate steps.

  Current in x direction =   0.22150186544794004     
  Current in y direction =   0.22979080128307625     
  Current in z direction =   0.23911596985461525     
 Energy =    46332374.943786621       gg =    11.796308144958944     
 Number of conjugate steps =         1400
 Root took    110.79606830899138       s for         1400 conjugate steps.
 Elapsed time=   1549.6131422790349       s for         1400 conjugate steps.

  Current in x direction =   0.22150215371246898     
  Current in y direction =   0.22979652212099871     
  Current in z direction =   0.23910751544336145     
 Energy =    46332293.133422852       gg =    6.6523125894664528     
 Number of conjugate steps =         1500
 Root took    110.29300120903645       s for         1500 conjugate steps.
 Elapsed time=   1659.9061434880714       s for         1500 conjugate steps.

  Current in x direction =   0.22149241588665095     
  Current in y direction =   0.22981613986213559     
  Current in z direction =   0.23909641632845327     
 Energy =    46332232.111145020       gg =    6.1099517125491154     
 Number of conjugate steps =         1600
 Root took    110.27688885101816       s for         1600 conjugate steps.
 Elapsed time=   1770.1830323390896       s for         1600 conjugate steps.

  Current in x direction =   0.22150218403448507     
  Current in y direction =   0.22982372269584647     
  Current in z direction =   0.23907815592993645     
 Energy =    46332158.583297729       gg =    9.2896267109127653     
 Number of conjugate steps =         1700
 Root took    110.79963565705111       s for         1700 conjugate steps.
 Elapsed time=   1880.9826679961407       s for         1700 conjugate steps.

  Current in x direction =   0.22149795294147218     
  Current in y direction =   0.22981183691429069     
  Current in z direction =   0.23909317717149173     
 Energy =    46332017.917144775       gg =    20.538903319815070     
 Number of conjugate steps =         1800
 Root took    110.28300734801451       s for         1800 conjugate steps.
 Elapsed time=   1991.2656753441552       s for         1800 conjugate steps.

  Current in x direction =   0.22146401885475062     
  Current in y direction =   0.22981710416805082     
  Current in z direction =   0.23911974777870915     
 Energy =    46331663.345443726       gg =    51.761416742337730     
 Number of conjugate steps =         1900
 Root took    110.28053467400605       s for         1900 conjugate steps.
 Elapsed time=   2101.5462100181612       s for         1900 conjugate steps.

  Current in x direction =   0.22142777631795735     
  Current in y direction =   0.22989881218885297     
  Current in z direction =   0.23906899888293112     
 Energy =    46330847.514465332       gg =    106.78480782224290     
 Number of conjugate steps =         2000
 Root took    110.28144438302843       s for         2000 conjugate steps.
 Elapsed time=   2211.8276544011896       s for         2000 conjugate steps.

  Current in x direction =   0.22151596934309317     
  Current in y direction =   0.22987707593561404     
  Current in z direction =   0.23899038541148507     
 Energy =    46329715.325012207       gg =    110.00641141522692     
 Number of conjugate steps =         2100
 Root took    110.29022824601270       s for         2100 conjugate steps.
 Elapsed time=   2322.1178826472024       s for         2100 conjugate steps.

  Current in x direction =   0.22158613903410224     
  Current in y direction =   0.22977575340289758     
  Current in z direction =   0.23900466726769470     
 Energy =    46328735.669433594       gg =    82.824541559403144     
 Number of conjugate steps =         2200
 Root took    110.69040807103738       s for         2200 conjugate steps.
 Elapsed time=   2432.8082907182397       s for         2200 conjugate steps.

  Current in x direction =   0.22150392855746048     
  Current in y direction =   0.22975511201756693     
  Current in z direction =   0.23909292129843646     
 Energy =    46328188.889526367       gg =    34.429286647666316     
 Number of conjugate steps =         2300
 Root took    110.86712953500682       s for         2300 conjugate steps.
 Elapsed time=   2543.6754202532466       s for         2300 conjugate steps.

  Current in x direction =   0.22151455859895242     
  Current in y direction =   0.22974361362802626     
  Current in z direction =   0.23908564180170877     
 Energy =    46327948.159454346       gg =    15.177789668445445     
 Number of conjugate steps =         2400
 Root took    110.28835097799310       s for         2400 conjugate steps.
 Elapsed time=   2653.9637712312397       s for         2400 conjugate steps.

  Current in x direction =   0.22151567452455267     
  Current in y direction =   0.22976100973706215     
  Current in z direction =   0.23906354259528936     
 Energy =    46327852.869384766       gg =    5.9412128065981165     
 Number of conjugate steps =         2500
 Root took    110.30240864498774       s for         2500 conjugate steps.
 Elapsed time=   2764.2661798762274       s for         2500 conjugate steps.

  Current in x direction =   0.22151898024963967     
  Current in y direction =   0.22976152011272427     
  Current in z direction =   0.23905830651116317     
 Energy =    46327811.918914795       gg =    2.9239865768756212     
 Number of conjugate steps =         2600
 Root took    110.34122721297899       s for         2600 conjugate steps.
 Elapsed time=   2874.6074070892064       s for         2600 conjugate steps.

  Current in x direction =   0.22150117779126635     
  Current in y direction =   0.22977575058971056     
  Current in z direction =   0.23906126828330215     
 Energy =    46327788.256103516       gg =    1.9218106748804828     
 Number of conjugate steps =         2700
 Root took    110.32726766599808       s for         2700 conjugate steps.
 Elapsed time=   2984.9346747552045       s for         2700 conjugate steps.

  Current in x direction =   0.22149060687721309     
  Current in y direction =   0.22978016130043988     
  Current in z direction =   0.23906707590723300     
 Energy =    46327770.662872314       gg =    1.7019991167403581     
 Number of conjugate steps =         2800
 Root took    110.64340700500179       s for         2800 conjugate steps.
 Elapsed time=   3095.5780817602063       s for         2800 conjugate steps.

  Current in x direction =   0.22148220547828623     
  Current in y direction =   0.22977999171074268     
  Current in z direction =   0.23907538473473841     
 Energy =    46327750.934310913       gg =    2.1430874161862565     
 Number of conjugate steps =         2900
 Root took    110.34789617202478       s for         2900 conjugate steps.
 Elapsed time=   3205.9259779322310       s for         2900 conjugate steps.

  Current in x direction =   0.22146913159916870     
  Current in y direction =   0.22977968834437759     
  Current in z direction =   0.23908846811004159     
 Energy =    46327726.110183716       gg =    2.9073146537913312     
 Number of conjugate steps =         3000
 Root took    110.85083895700518       s for         3000 conjugate steps.
 Elapsed time=   3316.7768168892362       s for         3000 conjugate steps.

  Current in x direction =   0.22145435492182500     
  Current in y direction =   0.22979467364655928     
  Current in z direction =   0.23908788958045482     
 Energy =    46327683.076690674       gg =    5.7843562736017340     
 Number of conjugate steps =         3100
 Root took    110.30713715701131       s for         3100 conjugate steps.
 Elapsed time=   3427.0839540462475       s for         3100 conjugate steps.

  Current in x direction =   0.22144865814726455     
  Current in y direction =   0.22980754365404282     
  Current in z direction =   0.23908007504853679     
 Energy =    46327592.257720947       gg =    12.289188208399853     
 Number of conjugate steps =         3200
 Root took    110.32868288399186       s for         3200 conjugate steps.
 Elapsed time=   3537.4126369302394       s for         3200 conjugate steps.

  Current in x direction =   0.22143484613924519     
  Current in y direction =   0.22981901525683587     
  Current in z direction =   0.23908106221800651     
 Energy =    46327397.296585083       gg =    27.881057959265917     
 Number of conjugate steps =         3300
 Root took    110.69553604198154       s for         3300 conjugate steps.
 Elapsed time=   3648.1081729722209       s for         3300 conjugate steps.

  Current in x direction =   0.22144104168075585     
  Current in y direction =   0.22979497775346192     
  Current in z direction =   0.23909599873413087     
 Energy =    46327064.422637939       gg =    34.621019686839567     
 Number of conjugate steps =         3400
 Root took    110.49350080301519       s for         3400 conjugate steps.
 Elapsed time=   3758.6016737752361       s for         3400 conjugate steps.

  Current in x direction =   0.22148895585871564     
  Current in y direction =   0.22974789073304172     
  Current in z direction =   0.23909021155400639     
 Energy =    46326730.787399292       gg =    28.658154001678000     
 Number of conjugate steps =         3500
 Root took    110.34126001299592       s for         3500 conjugate steps.
 Elapsed time=   3868.9429337882320       s for         3500 conjugate steps.

  Current in x direction =   0.22149006575900718     
  Current in y direction =   0.22975260261345271     
  Current in z direction =   0.23907941829603063     
 Energy =    46326534.679275513       gg =    12.165404787617582     
 Number of conjugate steps =         3600
 Root took    110.33368827699451       s for         3600 conjugate steps.
 Elapsed time=   3979.2766220652265       s for         3600 conjugate steps.

  Current in x direction =   0.22149949554934589     
  Current in y direction =   0.22975706614072131     
  Current in z direction =   0.23906260266706711     
 Energy =    46326450.840744019       gg =    5.4655103910399108     
 Number of conjugate steps =         3700
 Root took    110.34473262401298       s for         3700 conjugate steps.
 Elapsed time=   4089.6213546892395       s for         3700 conjugate steps.

  Current in x direction =   0.22148190727274436     
  Current in y direction =   0.22976588845901016     
  Current in z direction =   0.23907011928794969     
 Energy =    46326413.148025513       gg =    2.3186200303213043     
 Number of conjugate steps =         3800
 Root took    110.77197040204192       s for         3800 conjugate steps.
 Elapsed time=   4200.3933250912814       s for         3800 conjugate steps.

  Current in x direction =   0.22147874543312862     
  Current in y direction =   0.22977616694684333     
  Current in z direction =   0.23906244102595256     
 Energy =    46326397.742065430       gg =   0.99425395933064653     
 Number of conjugate steps =         3900
 Root took    110.65978905803058       s for         3900 conjugate steps.
 Elapsed time=   4311.0531141493120       s for         3900 conjugate steps.

  Current in x direction =   0.22148431271154101     
  Current in y direction =   0.22976948615512638     
  Current in z direction =   0.23906332495124549     
 Energy =    46326388.660110474       gg =   0.95557759077404647     
 Number of conjugate steps =         4000
 Root took    110.37994285399327       s for         4000 conjugate steps.
 Elapsed time=   4421.4330570033053       s for         4000 conjugate steps.

  Current in x direction =   0.22148017490738936     
  Current in y direction =   0.22977230711826221     
  Current in z direction =   0.23906450653793648     
 Energy =    46326378.993530273       gg =    1.0574670651339557     
 Number of conjugate steps =         4100
 Root took    110.33261548599694       s for         4100 conjugate steps.
 Elapsed time=   4531.7656724893022       s for         4100 conjugate steps.

  Current in x direction =   0.22147678409050839     
  Current in y direction =   0.22977251176558183     
  Current in z direction =   0.23906754865908675     
 Energy =    46326368.433135986       gg =    1.0888065285960382     
 Number of conjugate steps =         4200
 Root took    110.34317107300740       s for         4200 conjugate steps.
 Elapsed time=   4642.1088435623096       s for         4200 conjugate steps.

  Current in x direction =   0.22147347105857990     
  Current in y direction =   0.22976874718803658     
  Current in z direction =   0.23907446885697878     
 Energy =    46326355.762786865       gg =    1.4167387389538377     
 Number of conjugate steps =         4300
 Root took    110.34881649701856       s for         4300 conjugate steps.
 Elapsed time=   4752.4576600593282       s for         4300 conjugate steps.

  Current in x direction =   0.22146747115355103     
  Current in y direction =   0.22977820797020804     
  Current in z direction =   0.23907081930659377     
 Energy =    46326336.061203003       gg =    2.7795441972275623     
 Number of conjugate steps =         4400
 Root took    110.85428610997042       s for         4400 conjugate steps.
 Elapsed time=   4863.3119461692986       s for         4400 conjugate steps.

  Current in x direction =   0.22146586947345015     
  Current in y direction =   0.22977577510781846     
  Current in z direction =   0.23907456019383844     
 Energy =    46326294.490509033       gg =    6.3904619246068730     
 Number of conjugate steps =         4500
 Root took    110.31742891197791       s for         4500 conjugate steps.
 Elapsed time=   4973.6293750812765       s for         4500 conjugate steps.

  Current in x direction =   0.22146722176880718     
  Current in y direction =   0.22976436625821756     
  Current in z direction =   0.23908399724550014     
 Energy =    46326197.793365479       gg =    12.856611207258272     
 Number of conjugate steps =         4600
 Root took    110.84180124296108       s for         4600 conjugate steps.
 Elapsed time=   5084.4711763242376       s for         4600 conjugate steps.

  Current in x direction =   0.22147271501288696     
  Current in y direction =   0.22974863039801630     
  Current in z direction =   0.23909279886784818     
 Energy =    46326035.056762695       gg =    17.244955662997128     
 Number of conjugate steps =         4700
 Root took    110.32180012698518       s for         4700 conjugate steps.
 Elapsed time=   5194.7929764512228       s for         4700 conjugate steps.

  Current in x direction =   0.22147809791477460     
  Current in y direction =   0.22973690089580054     
  Current in z direction =   0.23909672065443471     
 Energy =    46325883.500106812       gg =    12.237883162640633     
 Number of conjugate steps =         4800
 Root took    110.36055367602967       s for         4800 conjugate steps.
 Elapsed time=   5305.1535301272525       s for         4800 conjugate steps.

  Current in x direction =   0.22145647182639278     
  Current in y direction =   0.22975758776735783     
  Current in z direction =   0.23909540139064511     
 Energy =    46325789.975769043       gg =    7.1231825180858577     
 Number of conjugate steps =         4900
 Root took    110.92040052899392       s for         4900 conjugate steps.
 Elapsed time=   5416.0739306562464       s for         4900 conjugate steps.

  Current in x direction =   0.22145867278947362     
  Current in y direction =   0.22976965646469727     
  Current in z direction =   0.23907973822786599     
 Energy =    46325738.263244629       gg =    3.3573669873701366     
 Number of conjugate steps =         5000
 Root took    110.31704372301465       s for         5000 conjugate steps.
 Elapsed time=   5526.3909743792610       s for         5000 conjugate steps.

  Current in x direction =   0.22145618497517436     
  Current in y direction =   0.22976919164443654     
  Current in z direction =   0.23908192027396241     
 Energy =    46325716.393112183       gg =    1.3660667553972499     
 Number of conjugate steps =         5100
 Root took    110.30644493299769       s for         5100 conjugate steps.
 Elapsed time=   5636.6974193122587       s for         5100 conjugate steps.

  Current in x direction =   0.22146748525450982     
  Current in y direction =   0.22977054333556757     
  Current in z direction =   0.23906894234978526     
 Energy =    46325707.360305786       gg =   0.57724044643043904     
 Number of conjugate steps =         5200
 Root took    110.31419304100564       s for         5200 conjugate steps.
 Elapsed time=   5747.0116123532644       s for         5200 conjugate steps.

  Current in x direction =   0.22146953347998524     
  Current in y direction =   0.22977218548303380     
  Current in z direction =   0.23906511738293890     
 Energy =    46325703.180938721       gg =   0.37633696398710648     
 Number of conjugate steps =         5300
 Root took    110.34643778903410       s for         5300 conjugate steps.
 Elapsed time=   5857.3580501422985       s for         5300 conjugate steps.

  Current in x direction =   0.22147443928441046     
  Current in y direction =   0.22976883203874687     
  Current in z direction =   0.23906350276487789     
 Energy =    46325698.976974487       gg =   0.46677352323406374     
 Number of conjugate steps =         5400
 Root took    110.80707480997080       s for         5400 conjugate steps.
 Elapsed time=   5968.1651249522693       s for         5400 conjugate steps.

  Current in x direction =   0.22147622786751719     
  Current in y direction =   0.22976603932442458     
  Current in z direction =   0.23906444426355750     
 Energy =    46325692.555130005       gg =   0.86651421775771986     
 Number of conjugate steps =         5500
 Root took    110.85037692199694       s for         5500 conjugate steps.
 Elapsed time=   6079.0155018742662       s for         5500 conjugate steps.

  Current in x direction =   0.22147986776761772     
  Current in y direction =   0.22976332961430204     
  Current in z direction =   0.23906341843742229     
 Energy =    46325681.554901123       gg =    1.4413457315650471     
 Number of conjugate steps =         5600
 Root took    110.32709429896204       s for         5600 conjugate steps.
 Elapsed time=   6189.3425961732282       s for         5600 conjugate steps.

  Current in x direction =   0.22147759846523024     
  Current in y direction =   0.22975573772950339     
  Current in z direction =   0.23907311562303366     
 Energy =    46325662.004516602       gg =    2.7574051549110452     
 Number of conjugate steps =         5700
 Root took    110.33266592497239       s for         5700 conjugate steps.
 Elapsed time=   6299.6752620982006       s for         5700 conjugate steps.

  Current in x direction =   0.22147401260991956     
  Current in y direction =   0.22975213878306525     
  Current in z direction =   0.23908000913746691     
 Energy =    46325615.192337036       gg =    6.7065496543154790     
 Number of conjugate steps =         5800
 Root took    110.28231463901466       s for         5800 conjugate steps.
 Elapsed time=   6409.9575767372153       s for         5800 conjugate steps.

  Current in x direction =   0.22148414038300845     
  Current in y direction =   0.22974962727190251     
  Current in z direction =   0.23907169524214025     
 Energy =    46325538.391387939       gg =    9.0620329718809849     
 Number of conjugate steps =         5900
 Root took    111.72228205599822       s for         5900 conjugate steps.
 Elapsed time=   6521.6798587932135       s for         5900 conjugate steps.

  Current in x direction =   0.22148482930263519     
  Current in y direction =   0.22976288138450729     
  Current in z direction =   0.23905660782214766     
 Energy =    46325450.343017578       gg =    7.7510484066653991     
 Number of conjugate steps =         6000
 Root took    110.82502544601448       s for         6000 conjugate steps.
 Elapsed time=   6632.5048842392280       s for         6000 conjugate steps.

  Current in x direction =   0.22148931040719544     
  Current in y direction =   0.22976613415033045     
  Current in z direction =   0.23904756195176033     
 Energy =    46325378.301574707       gg =    5.9649008722107197     
 Number of conjugate steps =         6100
 Root took    110.34284452896100       s for         6100 conjugate steps.
 Elapsed time=   6742.8477287681890       s for         6100 conjugate steps.

  Current in x direction =   0.22148806300654544     
  Current in y direction =   0.22975355149270779     
  Current in z direction =   0.23906031851845938     
 Energy =    46325332.384277344       gg =    3.3433645557840022     
 Number of conjugate steps =         6200
 Root took    110.80727308103815       s for         6200 conjugate steps.
 Elapsed time=   6853.6550018492271       s for         6200 conjugate steps.

  Current in x direction =   0.22149093364228856     
  Current in y direction =   0.22975084956369901     
  Current in z direction =   0.23905946548735663     
 Energy =    46325308.584991455       gg =    1.5522891074004415     
 Number of conjugate steps =         6300
 Root took    110.31164612597786       s for         6300 conjugate steps.
 Elapsed time=   6963.9666479752050       s for         6300 conjugate steps.

  Current in x direction =   0.22149046000304162     
  Current in y direction =   0.22974789614794600     
  Current in z direction =   0.23906253810762382     
 Energy =    46325295.809158325       gg =   0.90912067957555887     
 Number of conjugate steps =         6400
 Root took    110.34027026599506       s for         6400 conjugate steps.
 Elapsed time=   7074.3069182412000       s for         6400 conjugate steps.

  Current in x direction =   0.22148043458424180     
  Current in y direction =   0.22975713766185785     
  Current in z direction =   0.23906313164048437     
 Energy =    46325289.769378662       gg =   0.36988033440844714     
 Number of conjugate steps =         6500
 Root took    110.30748195003252       s for         6500 conjugate steps.
 Elapsed time=   7184.6144001912326       s for         6500 conjugate steps.

  Current in x direction =   0.22147449903855254     
  Current in y direction =   0.22976236801711200     
  Current in z direction =   0.23906374667341473     
 Energy =    46325287.093750000       gg =   0.22987280330246690     
 Number of conjugate steps =         6600
 Root took    110.40880390902748       s for         6600 conjugate steps.
 Elapsed time=   7295.0232041002600       s for         6600 conjugate steps.

  Current in x direction =   0.22147046422033648     
  Current in y direction =   0.22976419792711977     
  Current in z direction =   0.23906591172292443     
 Energy =    46325284.431533813       gg =   0.36930042324664841     
 Number of conjugate steps =         6700
 Root took    110.34964465198573       s for         6700 conjugate steps.
 Elapsed time=   7405.3728487522458       s for         6700 conjugate steps.

  Current in x direction =   0.22146924195316314     
  Current in y direction =   0.22976521731677921     
  Current in z direction =   0.23906607493941898     
 Energy =    46325279.366348267       gg =   0.56431264616989052     
 Number of conjugate steps =         6800
 Root took    110.33446012198692       s for         6800 conjugate steps.
 Elapsed time=   7515.7073088742327       s for         6800 conjugate steps.

  Current in x direction =   0.22146352922533380     
  Current in y direction =   0.22976829140143715     
  Current in z direction =   0.23906863811950305     
 Energy =    46325272.669677734       gg =   0.75026712997450795     
 Number of conjugate steps =         6900
 Root took    110.31945555302082       s for         6900 conjugate steps.
 Elapsed time=   7626.0267644272535       s for         6900 conjugate steps.

  Current in x direction =   0.22146518497466311     
  Current in y direction =   0.22977193488879349     
  Current in z direction =   0.23906323907257671     
 Energy =    46325262.559707642       gg =    1.4605828434206385     
 Number of conjugate steps =         7000
 Root took    110.67594832100440       s for         7000 conjugate steps.
 Elapsed time=   7736.7027127482579       s for         7000 conjugate steps.

  Current in x direction =   0.22146729279654104     
  Current in y direction =   0.22977252495129818     
  Current in z direction =   0.23906039058733436     
 Energy =    46325235.755325317       gg =    4.2478684851681336     
 Number of conjugate steps =         7100
 Root took    110.79742145299679       s for         7100 conjugate steps.
 Elapsed time=   7847.5001342012547       s for         7100 conjugate steps.

  Current in x direction =   0.22148176377947879     
  Current in y direction =   0.22977090466502489     
  Current in z direction =   0.23904714033243080     
 Energy =    46325174.967666626       gg =    7.7443705838630752     
 Number of conjugate steps =         7200
 Root took    110.30960731499363       s for         7200 conjugate steps.
 Elapsed time=   7957.8097415162483       s for         7200 conjugate steps.

  Current in x direction =   0.22150275687557558     
  Current in y direction =   0.22972765963256445     
  Current in z direction =   0.23906848660153074     
 Energy =    46325098.149230957       gg =    6.3397904707982917     
 Number of conjugate steps =         7300
 Root took    110.36276435904438       s for         7300 conjugate steps.
 Elapsed time=   8068.1725058752927       s for         7300 conjugate steps.

  Current in x direction =   0.22151342205765262     
  Current in y direction =   0.22973739608535654     
  Current in z direction =   0.23904694022941703     
 Energy =    46325050.713760376       gg =    3.3203380890997387     
 Number of conjugate steps =         7400
 Root took    110.34136702999240       s for         7400 conjugate steps.
 Elapsed time=   8178.5138729052851       s for         7400 conjugate steps.

  Current in x direction =   0.22150752882477376     
  Current in y direction =   0.22973272726230809     
  Current in z direction =   0.23905679543156400     
 Energy =    46325028.382446289       gg =    1.3759629484886060     
 Number of conjugate steps =         7500
 Root took    110.34297356696334       s for         7500 conjugate steps.
 Elapsed time=   8288.8568464722484       s for         7500 conjugate steps.

  Current in x direction =   0.22148701761254491     
  Current in y direction =   0.22974617736386116     
  Current in z direction =   0.23906352378536913     
 Energy =    46325018.329467773       gg =   0.71332391037707110     
 Number of conjugate steps =         7600
 Root took    110.65842855902156       s for         7600 conjugate steps.
 Elapsed time=   8399.5152750312700       s for         7600 conjugate steps.

  Current in x direction =   0.22148252359790052     
  Current in y direction =   0.22975087267981509     
  Current in z direction =   0.23906317275405456     
 Energy =    46325012.995285034       gg =   0.39275422077112271     
 Number of conjugate steps =         7700
 Root took    110.33810585498577       s for         7700 conjugate steps.
 Elapsed time=   8509.8533808862558       s for         7700 conjugate steps.

  Current in x direction =   0.22147866345207287     
  Current in y direction =   0.22975388503411553     
  Current in z direction =   0.23906394105272183     
 Energy =    46325009.832519531       gg =   0.24291172858996538     
 Number of conjugate steps =         7800
 Root took    110.84204974095337       s for         7800 conjugate steps.
 Elapsed time=   8620.6954306272091       s for         7800 conjugate steps.

  Current in x direction =   0.22147453780023826     
  Current in y direction =   0.22975831447390407     
  Current in z direction =   0.23906359006334388     
 Energy =    46325007.767715454       gg =   0.19055238556977114     
 Number of conjugate steps =         7900
 Root took    110.29168213100638       s for         7900 conjugate steps.
 Elapsed time=   8730.9871127582155       s for         7900 conjugate steps.

  Current in x direction =   0.22147090640498207     
  Current in y direction =   0.22976062616414994     
  Current in z direction =   0.23906487897518613     
 Energy =    46325005.574920654       gg =   0.25527670783732975     
 Number of conjugate steps =         8000
 Root took    110.29464882897446       s for         8000 conjugate steps.
 Elapsed time=   8841.2817615871900       s for         8000 conjugate steps.

  Current in x direction =   0.22146537272739178     
  Current in y direction =   0.22976825157464292     
  Current in z direction =   0.23906275459088730     
 Energy =    46325002.265182495       gg =   0.43310669101845961     
 Number of conjugate steps =         8100
 Root took    110.32760569197126       s for         8100 conjugate steps.
 Elapsed time=   8951.6093672791612       s for         8100 conjugate steps.

  Current in x direction =   0.22146468622744150     
  Current in y direction =   0.22977130995862247     
  Current in z direction =   0.23906033344677730     
 Energy =    46324996.557159424       gg =   0.70368433449150236     
 Number of conjugate steps =         8200
 Root took    110.62910513300449       s for         8200 conjugate steps.
 Elapsed time=   9062.2384724121657       s for         8200 conjugate steps.

  Current in x direction =   0.22145912169915488     
  Current in y direction =   0.22977174067008418     
  Current in z direction =   0.23906538214202006     
 Energy =    46324986.475021362       gg =    1.5314141186200012     
 Number of conjugate steps =         8300
 Root took    110.36357420397690       s for         8300 conjugate steps.
 Elapsed time=   9172.6020466161426       s for         8300 conjugate steps.

  Current in x direction =   0.22145411590217934     
  Current in y direction =   0.22976969832369676     
  Current in z direction =   0.23907228004269793     
 Energy =    46324963.534545898       gg =    3.3177398389080568     
 Number of conjugate steps =         8400
 Root took    110.28448125603609       s for         8400 conjugate steps.
 Elapsed time=   9282.8865278721787       s for         8400 conjugate steps.

  Current in x direction =   0.22146328656811914     
  Current in y direction =   0.22976434637352972     
  Current in z direction =   0.23906811958417681     
 Energy =    46324918.098602295       gg =    5.1243631284314235     
 Number of conjugate steps =         8500
 Root took    110.28721099800896       s for         8500 conjugate steps.
 Elapsed time=   9393.1737388701877       s for         8500 conjugate steps.

  Current in x direction =   0.22147539056775672     
  Current in y direction =   0.22976025560893482     
  Current in z direction =   0.23905942915471490     
 Energy =    46324861.116622925       gg =    5.2001612748645192     
 Number of conjugate steps =         8600
 Root took    110.92754754499765       s for         8600 conjugate steps.
 Elapsed time=   9504.1012864151853       s for         8600 conjugate steps.

  Current in x direction =   0.22146855018101763     
  Current in y direction =   0.22975682417694143     
  Current in z direction =   0.23906885201083744     
 Energy =    46324828.591201782       gg =    1.8460781838015565     
 Number of conjugate steps =         8700
 Root took    110.74678862903966       s for         8700 conjugate steps.
 Elapsed time=   9614.8480750442250       s for         8700 conjugate steps.

  Current in x direction =   0.22147043388605839     
  Current in y direction =   0.22975074839941365     
  Current in z direction =   0.23907255929920929     
 Energy =    46324816.882827759       gg =   0.69141180735534202     
 Number of conjugate steps =         8800
 Root took    110.36686801700853       s for         8800 conjugate steps.
 Elapsed time=   9725.2149430612335       s for         8800 conjugate steps.

  Current in x direction =   0.22147212080554396     
  Current in y direction =   0.22975387463528060     
  Current in z direction =   0.23906757176970472     
 Energy =    46324812.442932129       gg =   0.25865727151853318     
 Number of conjugate steps =         8900
 Root took    110.39892312500160       s for         8900 conjugate steps.
 Elapsed time=   9835.6138661862351       s for         8900 conjugate steps.

  Current in x direction =   0.22147385488237628     
  Current in y direction =   0.22975651998526436     
  Current in z direction =   0.23906312610611191     
 Energy =    46324810.717987061       gg =   0.12031764115028296     
 Number of conjugate steps =         9000
 Root took    110.41390622500330       s for         9000 conjugate steps.
 Elapsed time=   9946.0277724112384       s for         9000 conjugate steps.

  Current in x direction =   0.22147298791038375     
  Current in y direction =   0.22975847563260471     
  Current in z direction =   0.23906201178454561     
 Energy =    46324809.671768188       gg =   0.10736580178841160     
 Number of conjugate steps =         9100
 Root took    110.40915188402869       s for         9100 conjugate steps.
 Elapsed time=   10056.436924295267       s for         9100 conjugate steps.

  Current in x direction =   0.22146964263495164     
  Current in y direction =   0.22976268607391762     
  Current in z direction =   0.23906113095301360     
 Energy =    46324808.183578491       gg =   0.21769377944328308     
 Number of conjugate steps =         9200
 Root took    110.83126730099320       s for         9200 conjugate steps.
 Elapsed time=   10167.268191596260       s for         9200 conjugate steps.

  Current in x direction =   0.22146899823327421     
  Current in y direction =   0.22976212318868794     
  Current in z direction =   0.23906231606001666     
 Energy =    46324804.149536133       gg =   0.65237420771469590     
 Number of conjugate steps =         9300
 Root took    110.39517169602914       s for         9300 conjugate steps.
 Elapsed time=   10277.663363292289       s for         9300 conjugate steps.

  Current in x direction =   0.22147043370306549     
  Current in y direction =   0.22976008441952725     
  Current in z direction =   0.23906285923228310     
 Energy =    46324791.361755371       gg =    2.0669266059117275     
 Number of conjugate steps =         9400
 Root took    110.85315757803619       s for         9400 conjugate steps.
 Elapsed time=   10388.516520870326       s for         9400 conjugate steps.

  Current in x direction =   0.22146867003493326     
  Current in y direction =   0.22975435009505152     
  Current in z direction =   0.23907016664313915     
 Energy =    46324759.028869629       gg =    4.3709743722236984     
 Number of conjugate steps =         9500
 Root took    110.38093467900762       s for         9500 conjugate steps.
 Elapsed time=   10498.897455549333       s for         9500 conjugate steps.

  Current in x direction =   0.22145907517068308     
  Current in y direction =   0.22976200856333190     
  Current in z direction =   0.23907162105688673     
 Energy =    46324711.200119019       gg =    4.3887649376782285     
 Number of conjugate steps =         9600
 Root took    110.40745726600289       s for         9600 conjugate steps.
 Elapsed time=   10609.304912815336       s for         9600 conjugate steps.

  Current in x direction =   0.22146711608723982     
  Current in y direction =   0.22975891448439359     
  Current in z direction =   0.23906596165814054     
 Energy =    46324680.919982910       gg =    1.9086196717853612     
 Number of conjugate steps =         9700
 Root took    110.43367835204117       s for         9700 conjugate steps.
 Elapsed time=   10719.738591167377       s for         9700 conjugate steps.

  Current in x direction =   0.22147093378446955     
  Current in y direction =   0.22976185319071746     
  Current in z direction =   0.23905875394379414     
 Energy =    46324669.523376465       gg =   0.68227095227015544     
 Number of conjugate steps =         9800
 Root took    110.72302204399602       s for         9800 conjugate steps.
 Elapsed time=   10830.461613211373       s for         9800 conjugate steps.

  Current in x direction =   0.22146988003226031     
  Current in y direction =   0.22976224807374193     
  Current in z direction =   0.23905924300344558     
 Energy =    46324664.853073120       gg =   0.31229936443721085     
 Number of conjugate steps =         9900
 Root took    115.15785716200480       s for         9900 conjugate steps.
 Elapsed time=   10945.619470373378       s for         9900 conjugate steps.

  Current in x direction =   0.22146776978983682     
  Current in y direction =   0.22975968562717697     
  Current in z direction =   0.23906384610700243     
 Energy =    46324662.578475952       gg =   0.14324864334003712     
 Number of conjugate steps =        10000
 Root took    110.39060301799327       s for        10000 conjugate steps.
 Elapsed time=   11056.010073391371       s for        10000 conjugate steps.

  Current in x direction =   0.22147014278280189     
  Current in y direction =   0.22976034287934832     
  Current in z direction =   0.23906078195626149     

  Current in x direction =   0.22147014278280189     
  Current in y direction =   0.22976034287934832     
  Current in z direction =   0.23906078195626149     

