<svg xmlns="http://www.w3.org/2000/svg" width="26.398" height="26.398" viewBox="0 0 26.398 26.398">
  <path id="Icon_awesome-arrow-circle-up" data-name="Icon awesome-arrow-circle-up" d="M.563,13.762a13.2,13.2,0,1,0,13.2-13.2A13.2,13.2,0,0,0,.563,13.762Zm7.643-1.538,3.853,4.018V6.523a1.274,1.274,0,0,1,1.277-1.277h.852a1.274,1.274,0,0,1,1.277,1.277v9.718l3.853-4.018a1.279,1.279,0,0,1,1.826-.021l.58.585a1.272,1.272,0,0,1,0,1.8l-7.057,7.063a1.272,1.272,0,0,1-1.8,0L5.794,14.592a1.272,1.272,0,0,1,0-1.8l.58-.585A1.285,1.285,0,0,1,8.205,12.224Z" transform="translate(-0.563 -0.563)" fill="#ff0347"/>
</svg>
