<svg xmlns="http://www.w3.org/2000/svg" width="26.093" height="26.139" viewBox="0 0 26.093 26.139">
  <path id="Icon_feather-phone-call" data-name="Icon feather-phone-call" d="M18.025,6.093a5.742,5.742,0,0,1,4.536,4.536M18.025,1.5a10.335,10.335,0,0,1,9.129,9.118m-1.148,9.164v3.445a2.3,2.3,0,0,1-2.5,2.3A22.725,22.725,0,0,1,13.593,22a22.392,22.392,0,0,1-6.89-6.89A22.725,22.725,0,0,1,3.177,5.152a2.3,2.3,0,0,1,2.285-2.5H8.907a2.3,2.3,0,0,1,2.3,1.975,14.744,14.744,0,0,0,.8,3.227,2.3,2.3,0,0,1-.517,2.423l-1.458,1.458a18.373,18.373,0,0,0,6.89,6.89l1.458-1.458a2.3,2.3,0,0,1,2.423-.517,14.745,14.745,0,0,0,3.227.8A2.3,2.3,0,0,1,26.006,19.781Z" transform="translate(-2.167 -0.396)" fill="none" stroke="#fff" stroke-linecap="round" stroke-linejoin="round" stroke-width="2"/>
</svg>
