<svg xmlns="http://www.w3.org/2000/svg" width="23.816" height="20.031" viewBox="0 0 23.816 20.031">
  <g id="Icon_feather-user-plus" data-name="Icon feather-user-plus" transform="translate(0 -3)">
    <path id="Path_14109" data-name="Path 14109" d="M15.693,28.177V26.285A3.785,3.785,0,0,0,11.908,22.5H5.285A3.785,3.785,0,0,0,1.5,26.285v1.892" transform="translate(0 -6.646)" fill="none" stroke="#fff" stroke-linecap="round" stroke-linejoin="round" stroke-width="3"/>
    <path id="Path_14110" data-name="Path 14110" d="M14.319,8.285A3.785,3.785,0,1,1,10.535,4.5,3.785,3.785,0,0,1,14.319,8.285Z" transform="translate(-1.938)" fill="none" stroke="#fff" stroke-linecap="round" stroke-linejoin="round" stroke-width="3"/>
    <path id="Path_14111" data-name="Path 14111" d="M30,12v5.677" transform="translate(-10.523 -2.769)" fill="none" stroke="#fff" stroke-linecap="round" stroke-linejoin="round" stroke-width="3"/>
    <path id="Path_14112" data-name="Path 14112" d="M31.177,16.5H25.5" transform="translate(-8.861 -4.431)" fill="none" stroke="#fff" stroke-linecap="round" stroke-linejoin="round" stroke-width="3"/>
  </g>
</svg>
