<svg xmlns="http://www.w3.org/2000/svg" width="29.76" height="22.648" viewBox="0 0 29.76 22.648">
  <g id="Email" transform="translate(0 -57.75)">
    <g id="Group_1886" data-name="Group 1886" transform="translate(0 57.75)">
      <path id="Path_613" data-name="Path 613" d="M26.127,57.75H3.639A3.642,3.642,0,0,0,0,61.389V76.759A3.642,3.642,0,0,0,3.639,80.4H26.121a3.642,3.642,0,0,0,3.639-3.639V61.4A3.638,3.638,0,0,0,26.127,57.75ZM28.1,76.759a1.979,1.979,0,0,1-1.977,1.977H3.639a1.979,1.979,0,0,1-1.977-1.977V61.4a1.979,1.979,0,0,1,1.977-1.977H26.121A1.979,1.979,0,0,1,28.1,61.4V76.759Z" transform="translate(0 -57.75)" fill="#fff"/>
      <path id="Path_614" data-name="Path 614" d="M71.088,116.886l7.278-6.527a.833.833,0,0,0-1.115-1.238l-10.037,9.009-1.958-1.749c-.006-.006-.012-.012-.012-.018a1.232,1.232,0,0,0-.135-.117l-7.968-7.131a.833.833,0,0,0-1.108,1.244l7.365,6.582-7.334,6.866a.835.835,0,0,0-.037,1.176.851.851,0,0,0,.61.265.833.833,0,0,0,.566-.222l7.445-6.964,2.02,1.8a.829.829,0,0,0,1.108-.006L69.85,118l7.4,7.032A.833.833,0,0,0,78.428,125a.835.835,0,0,0-.031-1.176Z" transform="translate(-52.319 -105.753)" fill="#fff"/>
    </g>
  </g>
</svg>
