[
  {
    "status" : "used",
    "id"     : 3999562,
    "eventId": 4576
  },
  {
    "status" : "used",
    "id"     : 3997507,
    "eventId": 4576
  },
  {
    "status" : "used",
    "id"     : 3997504,
    "eventId": 4576
  },
  {
    "status" : "used",
    "id"     : 3997510,
    "eventId": 4576
  }
]
