M48
; DRILL file {KiCad 8.0.2} date 2024-05-25T16:23:28-0600
; FORMAT={-:-/ absolute / inch / decimal}
; #@! TF.CreationDate,2024-05-25T16:23:28-06:00
; #@! TF.GenerationSoftware,Kicad,Pcbnew,8.0.2
; #@! TF.FileFunction,MixedPlating,1,2
FMAT,2
INCH
; #@! TA.AperFunction,Plated,PTH,ViaDrill
T1C0.0157
; #@! TA.AperFunction,Plated,PTH,ComponentDrill
T2C0.0236
; #@! TA.AperFunction,Plated,PTH,ComponentDrill
T3C0.0315
; #@! TA.AperFunction,Plated,PTH,ComponentDrill
T4C0.0394
; #@! TA.AperFunction,Plated,PTH,ComponentDrill
T5C0.0402
; #@! TA.AperFunction,Plated,PTH,ComponentDrill
T6C0.0591
; #@! TA.AperFunction,Plated,PTH,ComponentDrill
T7C0.0760
; #@! TA.AperFunction,NonPlated,NPTH,ComponentDrill
T8C0.0315
; #@! TA.AperFunction,NonPlated,NPTH,ComponentDrill
T9C0.0390
; #@! TA.AperFunction,NonPlated,NPTH,ComponentDrill
T10C0.1039
%
G90
G05
T1
X1.0354Y-2.374
X1.0354Y-2.4134
X1.0748Y-2.374
X1.0748Y-2.4134
X1.1142Y-2.374
X1.1142Y-2.4134
X1.185Y-1.9055
X1.185Y-2.0945
X1.5787Y-2.374
X1.5787Y-2.4134
X1.6181Y-2.374
X1.6181Y-2.4134
X1.6575Y-2.374
X1.6575Y-2.4134
X2.3268Y-2.374
X2.3268Y-2.4134
X2.3661Y-2.374
X2.3661Y-2.4134
X2.4055Y-2.374
X2.4055Y-2.4134
X2.7964Y-2.0146
X2.8256Y-1.9854
X2.8898Y-1.9803
X2.8898Y-2.6299
X3.126Y-2.7274
X3.126Y-2.7687
X3.1614Y-2.374
X3.1614Y-2.4134
X3.2008Y-2.374
X3.2008Y-2.4134
X3.2402Y-2.374
X3.2402Y-2.4134
X7.3378Y-1.8583
X7.5071Y-2.1575
X7.6535Y-2.0394
X7.6535Y-2.2677
X7.7323Y-2.0394
X7.7323Y-2.1575
X7.7323Y-2.2677
X7.8602Y-1.7638
X8.5394Y-2.5315
X8.5433Y-2.4026
X8.5689Y-1.9803
X8.6181Y-2.128
X8.7223Y-2.3485
X8.7756Y-2.128
X8.7756Y-2.2067
X8.7894Y-2.5335
X8.8248Y-2.3937
X8.8425Y-1.7244
X8.8937Y-2.3937
X8.9626Y-2.3683
X9.063Y-1.7323
X9.0709Y-2.374
X9.1398Y-2.3445
X9.1594Y-1.9114
X9.1614Y-1.7283
X9.1929Y-2.2037
X9.2087Y-2.374
X9.2087Y-2.3248
X9.2874Y-2.4724
X9.3268Y-1.9803
X9.3661Y-2.1969
X9.4252Y-1.685
X9.4252Y-1.7638
X9.4252Y-2.3346
X9.4547Y-1.9508
X9.4646Y-1.8031
X9.5138Y-2.2559
X9.622Y-1.8031
X9.7008Y-1.9114
X9.7008Y-2.0689
X9.8189Y-1.8031
X9.8287Y-1.9114
X9.8287Y-1.9803
X9.8307Y-2.2992
X9.9075Y-2.5512
X9.9075Y-2.9252
X9.939Y-5.7835
X9.9803Y-1.9252
X10.0157Y-1.8031
X10.0197Y-1.9252
X10.0394Y-2.0197
X10.0709Y-1.9803
X10.0984Y-1.9409
X10.1929Y-2.4331
X10.2126Y-1.8031
X10.2126Y-2.3346
X10.2165Y-2.2165
X10.3071Y-2.4291
X10.3504Y-2.3839
X10.3602Y-2.0787
X10.3622Y-2.2835
X10.3817Y-1.939
X10.3819Y-1.8524
X10.3819Y-1.8957
X10.3819Y-1.9823
X10.3819Y-2.0236
X10.4567Y-2.248
X10.4587Y-1.8524
X10.4587Y-1.9016
X10.4587Y-1.9508
X10.5354Y-2.0748
X10.5966Y-2.6634
X10.5966Y-2.7048
X10.6457Y-2.5709
X10.685Y-1.8031
X10.685Y-1.8524
X10.686Y-2.2195
X10.7638Y-2.7776
X10.8229Y-2.6644
X10.8229Y-2.7038
X10.8819Y-1.8031
X10.9311Y-2.128
X11.0394Y-1.8031
X11.2362Y-1.8031
X11.374Y-2.5709
X11.4331Y-1.8031
X11.4724Y-1.685
X11.4724Y-1.7638
X11.6083Y-5.5315
X11.6693Y-2.2756
X12.0945Y-3.0669
X12.0945Y-3.2362
X12.1378Y-3.1102
X12.1378Y-3.9843
X12.1772Y-3.0669
X12.1772Y-4.7362
X12.2087Y-5.2067
X12.2165Y-3.1102
X12.2579Y-5.3701
X12.2598Y-3.0669
X13.126Y-2.374
X13.126Y-2.4134
X13.1654Y-2.374
X13.1654Y-2.4134
X13.2047Y-2.374
X13.2047Y-2.4134
X13.3976Y-2.6693
X13.4409Y-2.0
X13.4764Y-2.7008
X13.5157Y-2.7008
X13.5787Y-1.9793
X13.5787Y-2.0207
X13.5787Y-2.6142
X13.9606Y-2.374
X13.9606Y-2.4134
X14.0Y-2.374
X14.0Y-2.4134
X14.0394Y-2.374
X14.0394Y-2.4134
X14.7126Y-2.378
X14.7126Y-2.4173
X14.752Y-2.378
X14.752Y-2.4173
X14.7913Y-2.378
X14.7913Y-2.4173
X15.189Y-1.9055
X15.189Y-2.0945
X15.252Y-2.378
X15.252Y-2.4173
X15.2913Y-2.378
X15.2913Y-2.4173
X15.3307Y-2.378
X15.3307Y-2.4173
X15.3701Y-1.9409
X15.378Y-2.0079
T3
X6.4724Y-2.0289
X6.5512Y-2.0289
X6.6299Y-2.0289
X6.7087Y-2.0289
X6.7874Y-2.0289
T4
X6.4287Y-2.1969
X6.5287Y-2.1969
X6.6287Y-2.1969
X6.7287Y-2.1969
X6.8287Y-2.1969
T5
X9.4921Y-2.1417
X9.4921Y-2.1417
X11.252Y-2.1417
X11.539Y-2.1417
T6
X7.1476Y-5.6654
X7.3445Y-5.6457
X11.2136Y-3.6693
X13.126Y-5.6614
X13.3228Y-5.6417
T7
X1.1476Y-3.0
X1.1476Y-6.0
X1.2414Y-4.9154
X1.2414Y-5.6654
X1.3351Y-3.75
X1.3445Y-2.9803
X1.3445Y-5.9803
X1.4289Y-4.5
X1.4382Y-4.8957
X1.4382Y-5.6457
X1.532Y-3.7303
X1.6117Y-4.9154
X1.6257Y-4.4803
X1.8086Y-4.8957
X1.8976Y-3.0
X1.8976Y-6.0
X2.0851Y-4.9154
X2.0945Y-2.9803
X2.0945Y-5.9803
X2.2726Y-3.75
X2.2726Y-5.6654
X2.282Y-4.8957
X2.4601Y-4.5
X2.4695Y-3.7303
X2.4695Y-5.6457
X2.6476Y-3.0
X2.657Y-4.4803
X2.8351Y-4.9154
X2.8351Y-6.0
X2.8445Y-2.9803
X3.0226Y-3.75
X3.032Y-4.8957
X3.032Y-5.9803
X3.2101Y-4.5
X3.2195Y-3.7303
X3.3976Y-3.0
X3.407Y-4.4803
X3.4914Y-5.6654
X3.5851Y-4.9154
X3.5945Y-2.9803
X3.6882Y-5.6457
X3.7726Y-3.75
X3.7726Y-6.0
X3.782Y-4.8957
X3.9601Y-4.5
X3.9695Y-3.7303
X3.9695Y-5.9803
X4.1476Y-3.0
X4.157Y-4.4803
X4.3305Y-4.9154
X4.3445Y-2.9803
X4.5226Y-3.75
X4.5273Y-4.8957
X4.7101Y-4.5
X4.7195Y-3.7303
X4.8976Y-3.0
X4.907Y-4.4803
X5.0851Y-4.9154
X5.0945Y-2.9803
X5.2726Y-3.75
X5.282Y-4.8957
X5.4094Y-1.9016
X5.4291Y-2.0984
X5.4601Y-4.5
X5.4695Y-3.7303
X5.6476Y-3.0
X5.657Y-4.4803
X5.8351Y-4.9154
X5.8445Y-2.9803
X6.0226Y-3.75
X6.032Y-4.8957
X6.2101Y-4.5
X6.2195Y-3.7303
X6.3976Y-3.0
X6.407Y-4.4803
X6.5851Y-4.9154
X6.5945Y-2.9803
X6.7726Y-3.75
X6.782Y-4.8957
X6.9601Y-4.5
X6.9695Y-3.7303
X7.1476Y-3.0
X7.1476Y-5.6654
X7.157Y-4.4803
X7.3351Y-4.9154
X7.3445Y-2.9803
X7.3445Y-5.6457
X7.5226Y-3.75
X7.532Y-4.8957
X7.7101Y-4.5
X7.7195Y-3.7303
X7.8976Y-3.0
X7.907Y-4.4803
X8.0851Y-4.9154
X8.0945Y-2.9803
X8.2726Y-3.75
X8.2726Y-6.0
X8.282Y-4.8957
X8.4601Y-4.5
X8.4695Y-3.7303
X8.4695Y-5.9803
X8.6476Y-3.0
X8.657Y-4.4803
X8.7414Y-5.6654
X8.8351Y-4.9154
X8.8445Y-2.9803
X8.9382Y-5.6457
X9.0226Y-3.75
X9.0226Y-6.0
X9.032Y-4.8957
X9.2101Y-4.5
X9.2195Y-3.7303
X9.2195Y-5.9803
X9.3976Y-3.0
X9.407Y-4.4803
X9.5851Y-4.9154
X9.5945Y-2.9803
X9.7726Y-6.0
X9.7726Y-3.75
X9.7726Y-5.6654
X9.782Y-4.8957
X9.9601Y-4.5
X9.9695Y-5.9803
X9.9695Y-3.7303
X9.9695Y-5.6457
X10.1476Y-3.0
X10.157Y-4.4803
X10.3445Y-2.9803
X10.4289Y-4.9154
X10.5226Y-3.75
X10.5226Y-5.6654
X10.5226Y-6.0
X10.6257Y-4.8957
X10.7101Y-4.5
X10.7195Y-3.7303
X10.7195Y-5.6457
X10.7195Y-5.9803
X10.7992Y-4.9154
X10.907Y-4.4803
X10.9961Y-4.8957
X11.0851Y-3.0
X11.1939Y-3.4724
X11.1939Y-3.8494
X11.2136Y-4.0463
X11.2726Y-4.9154
X11.2726Y-5.6654
X11.2726Y-6.0
X11.282Y-2.9803
X11.4695Y-4.8957
X11.4695Y-5.6457
X11.4695Y-5.9803
X12.752Y-3.0039
X12.752Y-3.752
X12.752Y-4.5
X12.752Y-4.9134
X12.9488Y-2.9843
X12.9488Y-3.7323
X12.9488Y-4.4803
X12.9488Y-4.8937
X13.5Y-3.0039
X13.5Y-3.752
X13.5Y-4.5
X13.5Y-4.9134
X13.6969Y-2.9843
X13.6969Y-3.7323
X13.6969Y-4.4803
X13.6969Y-4.8937
X14.248Y-3.0039
X14.248Y-3.752
X14.248Y-4.5
X14.248Y-4.9134
X14.248Y-5.6614
X14.4449Y-2.9843
X14.4449Y-3.7323
X14.4449Y-4.4803
X14.4449Y-4.8937
X14.4449Y-5.6417
X14.9173Y-5.3465
X14.937Y-5.5433
X14.9961Y-3.0039
X14.9961Y-3.7539
X14.9961Y-4.5039
X15.1929Y-2.9843
X15.1929Y-3.7343
X15.1929Y-4.4843
T8
X1.0016Y-1.8701
X1.0016Y-2.1299
X15.3291Y-1.8701
X15.3291Y-2.1299
T9
X8.9608Y-1.7944
X8.9608Y-1.8744
X9.2608Y-1.8344
T10
X9.6004Y-1.9057
X11.4303Y-2.3778
T2
G00X0.8622Y-1.8185
M15
G01X0.8307Y-1.8185
M16
G05
G00X0.8622Y-2.1815
M15
G01X0.8307Y-2.1815
M16
G05
G00X1.0455Y-1.8185
M15
G01X1.0022Y-1.8185
M16
G05
G00X1.0455Y-2.1815
M15
G01X1.0022Y-2.1815
M16
G05
G00X15.2852Y-1.8185
M15
G01X15.3285Y-1.8185
M16
G05
G00X15.2852Y-2.1815
M15
G01X15.3285Y-2.1815
M16
G05
G00X15.4685Y-1.8185
M15
G01X15.5Y-1.8185
M16
G05
G00X15.4685Y-2.1815
M15
G01X15.5Y-2.1815
M16
G05
M30
