(kicad_sch (version 20230121) (generator eeschema)

  (uuid 5740c959-93d8-47fd-8f68-62f0109e753d)

  (paper "A4")

  (lib_symbols
    (symbol "SigilCircuit:Signature" (pin_names (offset 1.016)) (in_bom yes) (on_board yes)
      (property "Reference" "G" (at 0 1.27 0)
        (effects (font (size 1.27 1.27)))
      )
      (property "Value" "SigilCircuit_Signature" (at 0 -1.27 0)
        (effects (font (size 1.27 1.27)))
      )
      (property "Footprint" "" (at 0 0 0)
        (effects (font (size 1.27 1.27)) hide)
      )
      (property "Datasheet" "" (at 0 0 0)
        (effects (font (size 1.27 1.27)) hide)
      )
      (symbol "Signature_0_1"
        (rectangle (start -5.08 2.54) (end 5.08 -2.54)
          (stroke (width 0) (type default))
          (fill (type background))
        )
      )
    )
    (symbol "chippydootles_components:Conn_02x12_Odd_Even" (pin_names (offset 1.016) hide) (in_bom yes) (on_board yes)
      (property "Reference" "J2" (at 1.27 18.2118 0)
        (effects (font (size 1.27 1.27)))
      )
      (property "Value" "CLP-112-02" (at 1.27 15.9004 0)
        (effects (font (size 1.27 1.27)))
      )
      (property "Footprint" "chippydootles_components:SAMTEC-CLP-112-02-X-D" (at 1.27 20.32 0)
        (effects (font (size 1.27 1.27)) hide)
      )
      (property "Datasheet" "~" (at 0 0 0)
        (effects (font (size 1.27 1.27)) hide)
      )
      (property "Description" "CONN HEADER SMD 24POS 1.27MM" (at 0 25.4 0)
        (effects (font (size 1.27 1.27)) hide)
      )
      (property "TYPE" "SMD" (at 1.27 2.54 0)
        (effects (font (size 1.27 1.27)) hide)
      )
      (property "Digikey Part Number" "CLP-112-02-F-D-P-TR" (at 0 27.94 0)
        (effects (font (size 1.27 1.27)) hide)
      )
      (property "MPN" "CLP-112-02-F-D-P-TR" (at 0 30.48 0)
        (effects (font (size 1.27 1.27)) hide)
      )
      (property "Manufacturer" "Samtec Inc." (at 0 22.86 0)
        (effects (font (size 1.27 1.27)) hide)
      )
      (property "ki_keywords" "connector" (at 0 0 0)
        (effects (font (size 1.27 1.27)) hide)
      )
      (property "ki_description" "Generic connector, double row, 02x12, odd/even pin numbering scheme (row 1 odd numbers, row 2 even numbers), script generated (kicad-library-utils/schlib/autogen/connector/)" (at 0 0 0)
        (effects (font (size 1.27 1.27)) hide)
      )
      (property "ki_fp_filters" "Connector*:*_2x??_*" (at 0 0 0)
        (effects (font (size 1.27 1.27)) hide)
      )
      (symbol "Conn_02x12_Odd_Even_1_1"
        (rectangle (start -1.27 -15.113) (end 0 -15.367)
          (stroke (width 0.1524) (type default))
          (fill (type none))
        )
        (rectangle (start -1.27 -12.573) (end 0 -12.827)
          (stroke (width 0.1524) (type default))
          (fill (type none))
        )
        (rectangle (start -1.27 -10.033) (end 0 -10.287)
          (stroke (width 0.1524) (type default))
          (fill (type none))
        )
        (rectangle (start -1.27 -7.493) (end 0 -7.747)
          (stroke (width 0.1524) (type default))
          (fill (type none))
        )
        (rectangle (start -1.27 -4.953) (end 0 -5.207)
          (stroke (width 0.1524) (type default))
          (fill (type none))
        )
        (rectangle (start -1.27 -2.413) (end 0 -2.667)
          (stroke (width 0.1524) (type default))
          (fill (type none))
        )
        (rectangle (start -1.27 0.127) (end 0 -0.127)
          (stroke (width 0.1524) (type default))
          (fill (type none))
        )
        (rectangle (start -1.27 2.667) (end 0 2.413)
          (stroke (width 0.1524) (type default))
          (fill (type none))
        )
        (rectangle (start -1.27 5.207) (end 0 4.953)
          (stroke (width 0.1524) (type default))
          (fill (type none))
        )
        (rectangle (start -1.27 7.747) (end 0 7.493)
          (stroke (width 0.1524) (type default))
          (fill (type none))
        )
        (rectangle (start -1.27 10.287) (end 0 10.033)
          (stroke (width 0.1524) (type default))
          (fill (type none))
        )
        (rectangle (start -1.27 12.827) (end 0 12.573)
          (stroke (width 0.1524) (type default))
          (fill (type none))
        )
        (rectangle (start -1.27 13.97) (end 3.81 -16.51)
          (stroke (width 0.254) (type default))
          (fill (type background))
        )
        (rectangle (start 3.81 -15.113) (end 2.54 -15.367)
          (stroke (width 0.1524) (type default))
          (fill (type none))
        )
        (rectangle (start 3.81 -12.573) (end 2.54 -12.827)
          (stroke (width 0.1524) (type default))
          (fill (type none))
        )
        (rectangle (start 3.81 -10.033) (end 2.54 -10.287)
          (stroke (width 0.1524) (type default))
          (fill (type none))
        )
        (rectangle (start 3.81 -7.493) (end 2.54 -7.747)
          (stroke (width 0.1524) (type default))
          (fill (type none))
        )
        (rectangle (start 3.81 -4.953) (end 2.54 -5.207)
          (stroke (width 0.1524) (type default))
          (fill (type none))
        )
        (rectangle (start 3.81 -2.413) (end 2.54 -2.667)
          (stroke (width 0.1524) (type default))
          (fill (type none))
        )
        (rectangle (start 3.81 0.127) (end 2.54 -0.127)
          (stroke (width 0.1524) (type default))
          (fill (type none))
        )
        (rectangle (start 3.81 2.667) (end 2.54 2.413)
          (stroke (width 0.1524) (type default))
          (fill (type none))
        )
        (rectangle (start 3.81 5.207) (end 2.54 4.953)
          (stroke (width 0.1524) (type default))
          (fill (type none))
        )
        (rectangle (start 3.81 7.747) (end 2.54 7.493)
          (stroke (width 0.1524) (type default))
          (fill (type none))
        )
        (rectangle (start 3.81 10.287) (end 2.54 10.033)
          (stroke (width 0.1524) (type default))
          (fill (type none))
        )
        (rectangle (start 3.81 12.827) (end 2.54 12.573)
          (stroke (width 0.1524) (type default))
          (fill (type none))
        )
        (pin passive line (at -5.08 12.7 0) (length 3.81)
          (name "Pin_1" (effects (font (size 1.27 1.27))))
          (number "1" (effects (font (size 1.27 1.27))))
        )
        (pin passive line (at 7.62 2.54 180) (length 3.81)
          (name "Pin_10" (effects (font (size 1.27 1.27))))
          (number "10" (effects (font (size 1.27 1.27))))
        )
        (pin passive line (at -5.08 0 0) (length 3.81)
          (name "Pin_11" (effects (font (size 1.27 1.27))))
          (number "11" (effects (font (size 1.27 1.27))))
        )
        (pin passive line (at 7.62 0 180) (length 3.81)
          (name "Pin_12" (effects (font (size 1.27 1.27))))
          (number "12" (effects (font (size 1.27 1.27))))
        )
        (pin passive line (at -5.08 -2.54 0) (length 3.81)
          (name "Pin_13" (effects (font (size 1.27 1.27))))
          (number "13" (effects (font (size 1.27 1.27))))
        )
        (pin passive line (at 7.62 -2.54 180) (length 3.81)
          (name "Pin_14" (effects (font (size 1.27 1.27))))
          (number "14" (effects (font (size 1.27 1.27))))
        )
        (pin passive line (at -5.08 -5.08 0) (length 3.81)
          (name "Pin_15" (effects (font (size 1.27 1.27))))
          (number "15" (effects (font (size 1.27 1.27))))
        )
        (pin passive line (at 7.62 -5.08 180) (length 3.81)
          (name "Pin_16" (effects (font (size 1.27 1.27))))
          (number "16" (effects (font (size 1.27 1.27))))
        )
        (pin passive line (at -5.08 -7.62 0) (length 3.81)
          (name "Pin_17" (effects (font (size 1.27 1.27))))
          (number "17" (effects (font (size 1.27 1.27))))
        )
        (pin passive line (at 7.62 -7.62 180) (length 3.81)
          (name "Pin_18" (effects (font (size 1.27 1.27))))
          (number "18" (effects (font (size 1.27 1.27))))
        )
        (pin passive line (at -5.08 -10.16 0) (length 3.81)
          (name "Pin_19" (effects (font (size 1.27 1.27))))
          (number "19" (effects (font (size 1.27 1.27))))
        )
        (pin passive line (at 7.62 12.7 180) (length 3.81)
          (name "Pin_2" (effects (font (size 1.27 1.27))))
          (number "2" (effects (font (size 1.27 1.27))))
        )
        (pin passive line (at 7.62 -10.16 180) (length 3.81)
          (name "Pin_20" (effects (font (size 1.27 1.27))))
          (number "20" (effects (font (size 1.27 1.27))))
        )
        (pin passive line (at -5.08 -12.7 0) (length 3.81)
          (name "Pin_21" (effects (font (size 1.27 1.27))))
          (number "21" (effects (font (size 1.27 1.27))))
        )
        (pin passive line (at 7.62 -12.7 180) (length 3.81)
          (name "Pin_22" (effects (font (size 1.27 1.27))))
          (number "22" (effects (font (size 1.27 1.27))))
        )
        (pin passive line (at -5.08 -15.24 0) (length 3.81)
          (name "Pin_23" (effects (font (size 1.27 1.27))))
          (number "23" (effects (font (size 1.27 1.27))))
        )
        (pin passive line (at 7.62 -15.24 180) (length 3.81)
          (name "Pin_24" (effects (font (size 1.27 1.27))))
          (number "24" (effects (font (size 1.27 1.27))))
        )
        (pin passive line (at -5.08 10.16 0) (length 3.81)
          (name "Pin_3" (effects (font (size 1.27 1.27))))
          (number "3" (effects (font (size 1.27 1.27))))
        )
        (pin passive line (at 7.62 10.16 180) (length 3.81)
          (name "Pin_4" (effects (font (size 1.27 1.27))))
          (number "4" (effects (font (size 1.27 1.27))))
        )
        (pin passive line (at -5.08 7.62 0) (length 3.81)
          (name "Pin_5" (effects (font (size 1.27 1.27))))
          (number "5" (effects (font (size 1.27 1.27))))
        )
        (pin passive line (at 7.62 7.62 180) (length 3.81)
          (name "Pin_6" (effects (font (size 1.27 1.27))))
          (number "6" (effects (font (size 1.27 1.27))))
        )
        (pin passive line (at -5.08 5.08 0) (length 3.81)
          (name "Pin_7" (effects (font (size 1.27 1.27))))
          (number "7" (effects (font (size 1.27 1.27))))
        )
        (pin passive line (at 7.62 5.08 180) (length 3.81)
          (name "Pin_8" (effects (font (size 1.27 1.27))))
          (number "8" (effects (font (size 1.27 1.27))))
        )
        (pin passive line (at -5.08 2.54 0) (length 3.81)
          (name "Pin_9" (effects (font (size 1.27 1.27))))
          (number "9" (effects (font (size 1.27 1.27))))
        )
      )
    )
    (symbol "chippydootles_components:Standoff_SMD_M2x0.4" (pin_numbers hide) (pin_names (offset 1.016) hide) (in_bom yes) (on_board yes)
      (property "Reference" "H1" (at 2.54 1.2446 0)
        (effects (font (size 1.27 1.27)) (justify left))
      )
      (property "Value" "Standoff_SMD_M2x0.4" (at 2.54 -1.0668 0)
        (effects (font (size 1.27 1.27)) (justify left))
      )
      (property "Footprint" "chippydootles_components:SMD_M2_SPACER" (at 1.27 6.35 0)
        (effects (font (size 1.27 1.27)) hide)
      )
      (property "Datasheet" "~" (at 0 0 0)
        (effects (font (size 1.27 1.27)) hide)
      )
      (property "Digikey Part Number" "732-7090-1-ND" (at 0.635 10.16 0)
        (effects (font (size 1.27 1.27)) hide)
      )
      (property "Description" "ROUND STANDOFF M2X0.4 STEEL 4MM" (at 0.635 8.255 0)
        (effects (font (size 1.27 1.27)) hide)
      )
      (property "MPN" "9774040243R" (at 0 12.065 0)
        (effects (font (size 1.27 1.27)) hide)
      )
      (property "Manufacturer" "Würth Elektronik" (at 0.635 13.97 0)
        (effects (font (size 1.27 1.27)) hide)
      )
      (property "TYPE" "SMD" (at 0 0 0)
        (effects (font (size 1.27 1.27)) hide)
      )
      (property "ki_keywords" "mounting hole" (at 0 0 0)
        (effects (font (size 1.27 1.27)) hide)
      )
      (property "ki_description" "Mounting Hole with connection" (at 0 0 0)
        (effects (font (size 1.27 1.27)) hide)
      )
      (property "ki_fp_filters" "MountingHole*Pad*" (at 0 0 0)
        (effects (font (size 1.27 1.27)) hide)
      )
      (symbol "Standoff_SMD_M2x0.4_0_1"
        (circle (center 0 1.27) (radius 1.27)
          (stroke (width 1.27) (type default))
          (fill (type none))
        )
      )
      (symbol "Standoff_SMD_M2x0.4_1_1"
        (pin input line (at 0 -2.54 90) (length 2.54)
          (name "1" (effects (font (size 1.27 1.27))))
          (number "1" (effects (font (size 1.27 1.27))))
        )
      )
    )
    (symbol "power:+3V0" (power) (pin_names (offset 0)) (in_bom yes) (on_board yes)
      (property "Reference" "#PWR" (at 0 -3.81 0)
        (effects (font (size 1.27 1.27)) hide)
      )
      (property "Value" "+3V0" (at 0 3.556 0)
        (effects (font (size 1.27 1.27)))
      )
      (property "Footprint" "" (at 0 0 0)
        (effects (font (size 1.27 1.27)) hide)
      )
      (property "Datasheet" "" (at 0 0 0)
        (effects (font (size 1.27 1.27)) hide)
      )
      (property "ki_keywords" "power-flag" (at 0 0 0)
        (effects (font (size 1.27 1.27)) hide)
      )
      (property "ki_description" "Power symbol creates a global label with name \"+3V0\"" (at 0 0 0)
        (effects (font (size 1.27 1.27)) hide)
      )
      (symbol "+3V0_0_1"
        (polyline
          (pts
            (xy -0.762 1.27)
            (xy 0 2.54)
          )
          (stroke (width 0) (type default))
          (fill (type none))
        )
        (polyline
          (pts
            (xy 0 0)
            (xy 0 2.54)
          )
          (stroke (width 0) (type default))
          (fill (type none))
        )
        (polyline
          (pts
            (xy 0 2.54)
            (xy 0.762 1.27)
          )
          (stroke (width 0) (type default))
          (fill (type none))
        )
      )
      (symbol "+3V0_1_1"
        (pin power_in line (at 0 0 90) (length 0) hide
          (name "+3V0" (effects (font (size 1.27 1.27))))
          (number "1" (effects (font (size 1.27 1.27))))
        )
      )
    )
    (symbol "power:GND" (power) (pin_names (offset 0)) (in_bom yes) (on_board yes)
      (property "Reference" "#PWR" (at 0 -6.35 0)
        (effects (font (size 1.27 1.27)) hide)
      )
      (property "Value" "GND" (at 0 -3.81 0)
        (effects (font (size 1.27 1.27)))
      )
      (property "Footprint" "" (at 0 0 0)
        (effects (font (size 1.27 1.27)) hide)
      )
      (property "Datasheet" "" (at 0 0 0)
        (effects (font (size 1.27 1.27)) hide)
      )
      (property "ki_keywords" "power-flag" (at 0 0 0)
        (effects (font (size 1.27 1.27)) hide)
      )
      (property "ki_description" "Power symbol creates a global label with name \"GND\" , ground" (at 0 0 0)
        (effects (font (size 1.27 1.27)) hide)
      )
      (symbol "GND_0_1"
        (polyline
          (pts
            (xy 0 0)
            (xy 0 -1.27)
            (xy 1.27 -1.27)
            (xy 0 -2.54)
            (xy -1.27 -1.27)
            (xy 0 -1.27)
          )
          (stroke (width 0) (type default))
          (fill (type none))
        )
      )
      (symbol "GND_1_1"
        (pin power_in line (at 0 0 270) (length 0) hide
          (name "GND" (effects (font (size 1.27 1.27))))
          (number "1" (effects (font (size 1.27 1.27))))
        )
      )
    )
  )

  (junction (at 210.82 25.4) (diameter 0) (color 0 0 0 0)
    (uuid 38f2d955-ea7a-4a21-aba6-02ae23f1bd4a)
  )
  (junction (at 223.52 25.4) (diameter 0) (color 0 0 0 0)
    (uuid 417f13e4-c121-485a-a6b5-8b55e70350b8)
  )
  (junction (at 223.52 27.305) (diameter 0) (color 0 0 0 0)
    (uuid 66103bb0-2722-44a4-9230-b5d52de60996)
  )
  (junction (at 227.33 54.61) (diameter 0) (color 0 0 0 0)
    (uuid c091a32d-65cf-49aa-b2ae-f4c8713496f7)
  )
  (junction (at 236.22 25.4) (diameter 0) (color 0 0 0 0)
    (uuid dabe541b-b164-4180-97a4-5ca761b86800)
  )

  (wire (pts (xy 227.33 54.61) (xy 228.6 54.61))
    (stroke (width 0) (type default))
    (uuid 00981842-5bf6-43aa-8592-e86343501abe)
  )
  (polyline (pts (xy 257.81 52.07) (xy 257.81 83.82))
    (stroke (width 0) (type default))
    (uuid 012cbd44-2cec-47f9-9df7-7c1cfb36dea1)
  )
  (polyline (pts (xy 226.06 68.58) (xy 187.96 68.58))
    (stroke (width 0) (type default))
    (uuid 07abdd3b-8fe1-4468-87d5-bc419afaf937)
  )
  (polyline (pts (xy 280.67 55.88) (xy 280.67 52.07))
    (stroke (width 0) (type default))
    (uuid 08128d9b-7ff4-4dd6-8ee8-0f24c8dc559f)
  )

  (wire (pts (xy 243.84 80.01) (xy 241.3 80.01))
    (stroke (width 0) (type default))
    (uuid 0a3cc030-c9dd-4d74-9d50-715ed2b361a2)
  )
  (polyline (pts (xy 226.06 81.28) (xy 219.71 81.28))
    (stroke (width 0) (type default))
    (uuid 0d031119-75da-4b9c-b62b-a192f1317d34)
  )
  (polyline (pts (xy 226.06 71.12) (xy 187.96 71.12))
    (stroke (width 0) (type default))
    (uuid 0d033a60-831b-4e25-b206-d841966748db)
  )

  (wire (pts (xy 243.84 54.61) (xy 241.3 54.61))
    (stroke (width 0) (type default))
    (uuid 0d0bb7b2-a6e5-46d2-9492-a1aa6e5a7b2f)
  )
  (wire (pts (xy 226.06 67.31) (xy 228.6 67.31))
    (stroke (width 0) (type default))
    (uuid 10109f84-4940-47f8-8640-91f185ac9bc1)
  )
  (polyline (pts (xy 248.92 66.04) (xy 243.84 66.04))
    (stroke (width 0) (type default))
    (uuid 10bb0008-d9df-47e7-98b5-5d7171523580)
  )
  (polyline (pts (xy 199.39 82.55) (xy 199.39 83.82))
    (stroke (width 0) (type default))
    (uuid 10d510ce-ef5c-4787-8d64-f5482c32e076)
  )
  (polyline (pts (xy 264.16 52.07) (xy 264.16 83.82))
    (stroke (width 0) (type default))
    (uuid 1166f9ba-8156-42b8-8032-307f875b02cb)
  )
  (polyline (pts (xy 280.67 66.04) (xy 248.92 66.04))
    (stroke (width 0) (type default))
    (uuid 14776836-1774-41bc-bf33-13ac4fbfebfb)
  )

  (wire (pts (xy 226.06 54.61) (xy 227.33 54.61))
    (stroke (width 0) (type default))
    (uuid 15875808-74d5-4210-b8ca-aa8fbc04ae21)
  )
  (polyline (pts (xy 187.96 55.88) (xy 189.23 55.88))
    (stroke (width 0) (type default))
    (uuid 17446503-a41c-4fc6-aa56-903856681d7c)
  )
  (polyline (pts (xy 252.73 55.88) (xy 243.84 55.88))
    (stroke (width 0) (type default))
    (uuid 1b53480b-2b00-4449-89b3-4090b6735559)
  )

  (wire (pts (xy 223.52 27.305) (xy 223.52 25.4))
    (stroke (width 0) (type default))
    (uuid 1baa5073-7dce-4002-8404-7f43af687e2e)
  )
  (polyline (pts (xy 280.67 52.07) (xy 187.96 52.07))
    (stroke (width 0) (type default))
    (uuid 24c70aab-5437-4b1e-9f0c-11fa8753c844)
  )

  (wire (pts (xy 229.87 28.575) (xy 229.87 27.305))
    (stroke (width 0) (type default))
    (uuid 32ec0b75-a8be-464d-988b-95c1680ebd8d)
  )
  (wire (pts (xy 261.62 25.4) (xy 236.22 25.4))
    (stroke (width 0) (type default))
    (uuid 35354519-a28c-40c4-befd-0943e98dea53)
  )
  (wire (pts (xy 228.6 77.47) (xy 226.06 77.47))
    (stroke (width 0) (type default))
    (uuid 46918595-4a45-48e8-84c0-961b4db7f35f)
  )
  (polyline (pts (xy 280.67 55.88) (xy 280.67 83.82))
    (stroke (width 0) (type default))
    (uuid 46fc8e2e-2089-4be6-ada8-5d95e58529b9)
  )

  (wire (pts (xy 241.3 57.15) (xy 243.84 57.15))
    (stroke (width 0) (type default))
    (uuid 5038e144-5119-49db-b6cf-f7c345f1cf03)
  )
  (polyline (pts (xy 220.98 83.82) (xy 187.96 83.82))
    (stroke (width 0) (type default))
    (uuid 533cab23-6c5e-4064-b603-138e004bcc80)
  )
  (polyline (pts (xy 250.19 58.42) (xy 243.84 58.42))
    (stroke (width 0) (type default))
    (uuid 53a1f403-a76e-4aed-b037-28faac0deb6d)
  )

  (wire (pts (xy 241.3 62.23) (xy 243.84 62.23))
    (stroke (width 0) (type default))
    (uuid 54365317-1355-4216-bb75-829375abc4ec)
  )
  (wire (pts (xy 226.06 69.85) (xy 228.6 69.85))
    (stroke (width 0) (type default))
    (uuid 55e740a3-0735-4744-896e-2bf5437093b9)
  )
  (wire (pts (xy 243.84 74.93) (xy 241.3 74.93))
    (stroke (width 0) (type default))
    (uuid 5fc27c35-3e1c-4f96-817c-93b5570858a6)
  )
  (polyline (pts (xy 280.67 73.66) (xy 243.84 73.66))
    (stroke (width 0) (type default))
    (uuid 6186c88c-24ff-4154-914c-d040dcad592e)
  )
  (polyline (pts (xy 252.73 63.5) (xy 243.84 63.5))
    (stroke (width 0) (type default))
    (uuid 63c8f3cf-722f-4fdf-bd2e-2c5eef398e2d)
  )

  (wire (pts (xy 226.06 82.55) (xy 228.6 82.55))
    (stroke (width 0) (type default))
    (uuid 67f6e996-3c99-493c-8f6f-e739e2ed5d7a)
  )
  (polyline (pts (xy 226.06 78.74) (xy 187.96 78.74))
    (stroke (width 0) (type default))
    (uuid 6a47c211-e587-42c7-8413-e24f028f2982)
  )

  (wire (pts (xy 210.82 25.4) (xy 185.42 25.4))
    (stroke (width 0) (type default))
    (uuid 6b25f522-8e2d-4cd8-9d5d-a2b80f60133b)
  )
  (polyline (pts (xy 280.67 55.88) (xy 252.73 55.88))
    (stroke (width 0) (type default))
    (uuid 6d0414b0-35c6-492d-8aad-288825b45b02)
  )

  (wire (pts (xy 226.06 64.77) (xy 228.6 64.77))
    (stroke (width 0) (type default))
    (uuid 71c31975-2c45-4d18-a25a-18e07a55d11e)
  )
  (wire (pts (xy 226.06 62.23) (xy 228.6 62.23))
    (stroke (width 0) (type default))
    (uuid 746ba970-8279-4e7b-aed3-f28687777c21)
  )
  (polyline (pts (xy 271.78 52.07) (xy 271.78 83.82))
    (stroke (width 0) (type default))
    (uuid 7b0a3a97-df85-4e59-9845-fcf594d82d84)
  )
  (polyline (pts (xy 226.06 76.2) (xy 187.96 76.2))
    (stroke (width 0) (type default))
    (uuid 7becdb47-900c-49de-9143-53c79adcc32c)
  )
  (polyline (pts (xy 280.67 68.58) (xy 243.84 68.58))
    (stroke (width 0) (type default))
    (uuid 80c0cd95-cf80-4d6f-974c-aa6d22a41f14)
  )
  (polyline (pts (xy 226.06 55.88) (xy 226.06 55.88))
    (stroke (width 0) (type default))
    (uuid 8204bedb-f9f4-46e2-9b77-7f8c0ab6a99c)
  )
  (polyline (pts (xy 226.06 60.96) (xy 187.96 60.96))
    (stroke (width 0) (type default))
    (uuid 8c775820-6361-409c-805b-6ec50b96e393)
  )
  (polyline (pts (xy 280.67 71.12) (xy 243.84 71.12))
    (stroke (width 0) (type default))
    (uuid 8ccd94db-ef61-46b5-ad09-35b46b12fb2b)
  )
  (polyline (pts (xy 199.39 53.34) (xy 199.39 82.55))
    (stroke (width 0) (type default))
    (uuid 9d9c62bf-57ec-4fd8-b68e-f6ec865d1d47)
  )

  (wire (pts (xy 223.52 29.21) (xy 223.52 27.305))
    (stroke (width 0) (type default))
    (uuid 9dab0cb7-2557-4419-963b-5ae736517f62)
  )
  (polyline (pts (xy 226.06 63.5) (xy 187.96 63.5))
    (stroke (width 0) (type default))
    (uuid a0f45d1b-3676-434f-a8d0-0815585f722c)
  )
  (polyline (pts (xy 280.67 68.58) (xy 275.59 68.58))
    (stroke (width 0) (type default))
    (uuid a14e181d-4b5f-4f60-a004-eb052f69f9e5)
  )
  (polyline (pts (xy 280.67 78.74) (xy 243.84 78.74))
    (stroke (width 0) (type default))
    (uuid a17c86aa-bd08-484c-a3e8-d18bab1a1620)
  )

  (wire (pts (xy 243.84 64.77) (xy 241.3 64.77))
    (stroke (width 0) (type default))
    (uuid a3e4f0ae-9f86-49e9-b386-ed8b42e012fb)
  )
  (polyline (pts (xy 187.96 83.82) (xy 187.96 55.88))
    (stroke (width 0) (type default))
    (uuid a4de5e21-f597-465a-aabd-2c72d3bec862)
  )

  (wire (pts (xy 241.3 67.31) (xy 243.84 67.31))
    (stroke (width 0) (type default))
    (uuid a690fc6c-55d9-47e6-b533-faa4b67e20f3)
  )
  (wire (pts (xy 243.84 77.47) (xy 241.3 77.47))
    (stroke (width 0) (type default))
    (uuid a795f1ba-cdd5-4cc5-9a52-08586e982934)
  )
  (wire (pts (xy 229.87 27.305) (xy 223.52 27.305))
    (stroke (width 0) (type default))
    (uuid a99470f4-b68e-4bb2-8a18-890cdc3dd0fd)
  )
  (wire (pts (xy 243.84 59.69) (xy 241.3 59.69))
    (stroke (width 0) (type default))
    (uuid ac264c30-3e9a-4be2-b97a-9949b68bd497)
  )
  (polyline (pts (xy 226.06 58.42) (xy 187.96 58.42))
    (stroke (width 0) (type default))
    (uuid b5f732ce-01da-462e-adca-3c1d4024e79f)
  )
  (polyline (pts (xy 280.67 63.5) (xy 252.73 63.5))
    (stroke (width 0) (type default))
    (uuid b91b5d04-fe92-4260-983d-7c3cdfc4be50)
  )
  (polyline (pts (xy 280.67 76.2) (xy 250.19 76.2))
    (stroke (width 0) (type default))
    (uuid bd663446-f7f8-4615-85a9-f5a87cd2dba6)
  )

  (wire (pts (xy 226.06 74.93) (xy 228.6 74.93))
    (stroke (width 0) (type default))
    (uuid c022004a-c968-410e-b59e-fbab0e561e9d)
  )
  (polyline (pts (xy 226.06 66.04) (xy 187.96 66.04))
    (stroke (width 0) (type default))
    (uuid c11a971f-7a56-4228-8ce6-918762206981)
  )

  (wire (pts (xy 243.84 69.85) (xy 241.3 69.85))
    (stroke (width 0) (type default))
    (uuid c144caa5-b0d4-4cef-840a-d4ad178a2102)
  )
  (polyline (pts (xy 226.06 55.88) (xy 187.96 55.88))
    (stroke (width 0) (type default))
    (uuid c1fdf354-d49f-4acb-87b7-f661f832a828)
  )

  (wire (pts (xy 223.52 25.4) (xy 210.82 25.4))
    (stroke (width 0) (type default))
    (uuid c201e1b2-fc01-4110-bdaa-a33290468c83)
  )
  (polyline (pts (xy 226.06 73.66) (xy 187.96 73.66))
    (stroke (width 0) (type default))
    (uuid c260156f-3c1e-451f-bd5c-912b50821806)
  )
  (polyline (pts (xy 280.67 58.42) (xy 250.19 58.42))
    (stroke (width 0) (type default))
    (uuid c397b684-fd25-477d-b338-89db71f7382e)
  )
  (polyline (pts (xy 207.01 53.34) (xy 207.01 83.82))
    (stroke (width 0) (type default))
    (uuid c694f1ab-bded-4eb0-92de-03a37bf44cd0)
  )
  (polyline (pts (xy 213.36 53.34) (xy 213.36 83.82))
    (stroke (width 0) (type default))
    (uuid d393c8b6-26b8-42b1-880a-4dee7cb579cc)
  )
  (polyline (pts (xy 250.19 76.2) (xy 243.84 76.2))
    (stroke (width 0) (type default))
    (uuid d62f733f-fcdc-4936-8875-889d789a30ba)
  )

  (wire (pts (xy 226.06 80.01) (xy 228.6 80.01))
    (stroke (width 0) (type default))
    (uuid dd00c2e1-6027-4717-b312-4fab3ee52002)
  )
  (wire (pts (xy 226.06 59.69) (xy 228.6 59.69))
    (stroke (width 0) (type default))
    (uuid e10b5627-3247-4c86-b9f6-ef474ca11543)
  )
  (wire (pts (xy 236.22 25.4) (xy 223.52 25.4))
    (stroke (width 0) (type default))
    (uuid e12e827e-36be-4503-8eef-6fc7e8bc5d49)
  )
  (wire (pts (xy 227.33 50.165) (xy 227.33 54.61))
    (stroke (width 0) (type default))
    (uuid e2ccf06e-9f49-4a46-a734-2dd8f80bba57)
  )
  (polyline (pts (xy 280.67 60.96) (xy 243.84 60.96))
    (stroke (width 0) (type default))
    (uuid e4c4be0c-1f07-4b47-8c6b-c890e023e4d8)
  )
  (polyline (pts (xy 187.96 52.07) (xy 187.96 55.88))
    (stroke (width 0) (type default))
    (uuid e5cd3993-0479-4ce0-b1f6-962a8b3a8677)
  )
  (polyline (pts (xy 280.67 83.82) (xy 220.98 83.82))
    (stroke (width 0) (type default))
    (uuid e6ecb770-bc20-40f7-ada2-e3441f695422)
  )

  (wire (pts (xy 228.6 57.15) (xy 226.06 57.15))
    (stroke (width 0) (type default))
    (uuid e8314017-7be6-4011-9179-37449a29b311)
  )
  (polyline (pts (xy 280.67 81.28) (xy 243.84 81.28))
    (stroke (width 0) (type default))
    (uuid ef66508d-f267-4f58-a851-8f9c22f5ebe1)
  )

  (wire (pts (xy 241.3 72.39) (xy 243.84 72.39))
    (stroke (width 0) (type default))
    (uuid efeac2a2-7682-4dc7-83ee-f6f1b23da506)
  )
  (polyline (pts (xy 219.71 81.28) (xy 187.96 81.28))
    (stroke (width 0) (type default))
    (uuid f21f7558-51c5-4ee7-b5b6-eca8052bac28)
  )

  (wire (pts (xy 243.84 82.55) (xy 241.3 82.55))
    (stroke (width 0) (type default))
    (uuid f3490fa5-5a27-423b-af60-53609669542c)
  )
  (wire (pts (xy 228.6 72.39) (xy 226.06 72.39))
    (stroke (width 0) (type default))
    (uuid f4f99e3d-7269-4f6a-a759-16ad2a258779)
  )

  (rectangle (start 152.4 17.145) (end 282.575 39.37)
    (stroke (width 0.508) (type dash))
    (fill (type none))
    (uuid 2762ed7d-2e48-4464-a32a-43da27155094)
  )
  (rectangle (start 152.4 41.275) (end 282.575 85.725)
    (stroke (width 0.508) (type dash))
    (fill (type none))
    (uuid d6d0bcf0-d2c7-4d2e-97ce-110acd4b7a3b)
  )

  (text "AIN6" (at 205.74 63.5 0)
    (effects (font (size 1.27 1.27)) (justify right bottom))
    (uuid 04d60995-4f82-4f17-8f82-2f27a0a779cc)
  )
  (text "AIN0" (at 270.51 66.04 0)
    (effects (font (size 1.27 1.27)) (justify right bottom))
    (uuid 0938c137-668b-4d2f-b92b-cadb1df72bdb)
  )
  (text "Graphics Placeholder, I use this library symbol to \nplacehold the copper or mask artwork. In the case of \nthis template it is holding the example footprint\nwhich reads small 90 in arabic."
    (at 44.45 58.42 0)
    (effects (font (size 1.27 1.27)) (justify left bottom))
    (uuid 0f615cd1-03c4-4f5d-b1e5-7db81cde4c13)
  )
  (text "AIN10" (at 205.74 81.28 0)
    (effects (font (size 1.27 1.27)) (justify right bottom))
    (uuid 0fc912fd-5036-4a55-b598-a9af40810824)
  )
  (text "touch" (at 219.71 58.42 0)
    (effects (font (size 1.27 1.27)) (justify right bottom))
    (uuid 1765d6b9-ca0e-49c2-8c3c-8ab35eb3909b)
  )
  (text "AIN9" (at 205.74 71.12 0)
    (effects (font (size 1.27 1.27)) (justify right bottom))
    (uuid 18cf1537-83e6-4374-a277-6e3e21479ab0)
  )
  (text "AIN2" (at 270.51 60.96 0)
    (effects (font (size 1.27 1.27)) (justify right bottom))
    (uuid 1b98de85-f9de-4825-baf2-c96991615275)
  )
  (text "AIN11" (at 270.51 81.28 0)
    (effects (font (size 1.27 1.27)) (justify right bottom))
    (uuid 2a6ee718-8cdf-4fa6-be7c-8fe885d98fd7)
  )
  (text "WO2" (at 212.09 83.82 0)
    (effects (font (size 1.27 1.27)) (justify right bottom))
    (uuid 2d16cb66-2809-411d-912c-d3db0f48bd04)
  )
  (text "touch" (at 255.27 71.12 0)
    (effects (font (size 1.27 1.27)) (justify right bottom))
    (uuid 2d4d8c24-5b38-445b-8733-2a81ba21d33e)
  )
  (text "touch" (at 219.71 76.2 0)
    (effects (font (size 1.27 1.27)) (justify right bottom))
    (uuid 2ec9be40-1d5a-4e2d-8a4d-4be2d3c079d5)
  )
  (text "WO5" (at 212.09 60.96 0)
    (effects (font (size 1.27 1.27)) (justify right bottom))
    (uuid 3c66e6e2-f12d-4b23-910e-e478d272dfd5)
  )
  (text "WO3" (at 262.89 58.42 0)
    (effects (font (size 1.27 1.27)) (justify right bottom))
    (uuid 40b38567-9d6a-4691-bccf-1b4dbe39957b)
  )
  (text "touch" (at 219.71 63.5 0)
    (effects (font (size 1.27 1.27)) (justify right bottom))
    (uuid 414f80f7-b2d5-43c3-a018-819efe44fe30)
  )
  (text "ADC0" (at 205.74 54.61 0)
    (effects (font (size 1.27 1.27)) (justify right bottom))
    (uuid 419f7ab8-2430-4732-94e5-0f5438269ec9)
  )
  (text "WO0" (at 262.89 81.28 0)
    (effects (font (size 1.27 1.27)) (justify right bottom))
    (uuid 55cff608-ab38-48d9-ac09-2d0a877ceca1)
  )
  (text "AIN5" (at 205.74 60.96 0)
    (effects (font (size 1.27 1.27)) (justify right bottom))
    (uuid 5698a460-6e24-4857-84d8-4a43acd2325d)
  )
  (text "These are the plated through holes for the M.2 Screws\nMake sure these don't move in PCBnew.\nThey are connected to ground for easier design\naccess to ground for the pcb art."
    (at 154.305 34.925 0)
    (effects (font (size 1.27 1.27)) (justify left bottom))
    (uuid 5fd8c127-624f-40d8-9fa4-8740b8dc5dc4)
  )
  (text "touch" (at 255.27 76.2 0)
    (effects (font (size 1.27 1.27)) (justify right bottom))
    (uuid 5fe7a4eb-9f04-4df6-a1fa-36c071e280d7)
  )
  (text "TxD" (at 195.58 83.82 0)
    (effects (font (size 1.27 1.27)) (justify right bottom))
    (uuid 621c8eb9-ae87-439a-b350-badb5d559a5a)
  )
  (text "AIN3" (at 270.51 58.42 0)
    (effects (font (size 1.27 1.27)) (justify right bottom))
    (uuid 6f44a349-1ba9-4965-b217-aa1589a07228)
  )
  (text "RxD" (at 195.58 78.74 0)
    (effects (font (size 1.27 1.27)) (justify right bottom))
    (uuid 72cc7949-68f8-4ef8-adcb-a65c1d042672)
  )
  (text "ADC0" (at 270.51 54.61 0)
    (effects (font (size 1.27 1.27)) (justify right bottom))
    (uuid 74096bdc-b668-408c-af3a-b048c20bd605)
  )
  (text "touch" (at 219.71 73.66 0)
    (effects (font (size 1.27 1.27)) (justify right bottom))
    (uuid 7b75907b-b2ae-4362-89fa-d520339aaa5c)
  )
  (text "This pinout is for the tiny90F \nwhich may be retired \nin favor of the p-da-90f.\nPinout in that case\nwill change"
    (at 156.845 74.295 0)
    (effects (font (size 1.27 1.27)) (justify left bottom))
    (uuid 7dd72875-6191-439c-bbec-958f979d8034)
  )
  (text "VREFA" (at 196.85 60.96 0)
    (effects (font (size 1.27 1.27)) (justify right bottom))
    (uuid 8220ba36-5fda-4461-95e2-49a5bc0c76af)
  )
  (text "MOSI" (at 279.4 63.5 0)
    (effects (font (size 1.27 1.27)) (justify right bottom))
    (uuid 8cb5a828-8cef-4784-b78d-175b49646952)
  )
  (text "The Pendant family is and ATTINY 3217, Hybrid cap powered series.\nThe tiny90 series of boards is built around a single 3.0V rail.\nWhen designing to use the tiny90 pendant base board\nkeep in mind there is no space on the underside of the face plate where\nthe 90F hybrid cap is located. There is a drawing in PCBnew to help visualize where\nto keepout."
    (at 26.67 45.72 0)
    (effects (font (size 1.27 1.27)) (justify left bottom))
    (uuid 8fbab3d0-cb5e-47c7-8764-6fa3c0e4e5f7)
  )
  (text "TCA0" (at 212.09 54.61 0)
    (effects (font (size 1.27 1.27)) (justify right bottom))
    (uuid 911056ff-fca2-480a-8257-8f5cbfb694d6)
  )
  (text "My Pendant Template\n" (at 26.035 29.845 0)
    (effects (font (size 5.08 5.08) (thickness 0.4064) bold) (justify left bottom))
    (uuid 91349f83-77ea-4a1f-91e5-dda835053567)
  )
  (text "MISO" (at 279.4 60.96 0)
    (effects (font (size 1.27 1.27)) (justify right bottom))
    (uuid 9b07d532-5f76-4469-8dbf-25ac27eef589)
  )
  (text "The pendant family is still under development \nand subject to change"
    (at 30.48 112.395 0)
    (effects (font (size 6.4516 6.4516) (thickness 1.2903) bold) (justify left bottom))
    (uuid 9b9ff261-94d5-4bb8-ad4c-12cb3a6d70c6)
  )
  (text "touch" (at 255.27 68.58 0)
    (effects (font (size 1.27 1.27)) (justify right bottom))
    (uuid 9bb406d9-c650-4e67-9a26-3195d4de542e)
  )
  (text "WO4" (at 212.09 58.42 0)
    (effects (font (size 1.27 1.27)) (justify right bottom))
    (uuid 9c8eae28-a7c3-4e6a-bd81-98cf70031070)
  )
  (text "touch" (at 255.27 83.82 0)
    (effects (font (size 1.27 1.27)) (justify right bottom))
    (uuid a10b569c-d672-485d-9c05-2cb4795deeca)
  )
  (text "UDPI" (at 279.4 66.04 0)
    (effects (font (size 1.27 1.27)) (justify right bottom))
    (uuid a26bdee6-0e16-4ea6-87f7-fb32c714896e)
  )
  (text "touch" (at 219.71 66.04 0)
    (effects (font (size 1.27 1.27)) (justify right bottom))
    (uuid a419542a-0c78-421e-9ac7-81d3afba6186)
  )
  (text "touch" (at 255.27 73.66 0)
    (effects (font (size 1.27 1.27)) (justify right bottom))
    (uuid a6891c49-3648-41ce-811e-fccb4c4653af)
  )
  (text "SCL" (at 279.4 81.28 0)
    (effects (font (size 1.27 1.27)) (justify right bottom))
    (uuid b2001159-b6cb-4000-85f5-34f6c410920f)
  )
  (text "AIN7" (at 205.74 66.04 0)
    (effects (font (size 1.27 1.27)) (justify right bottom))
    (uuid b45059f3-613f-4b7a-a70a-ed75a9e941e6)
  )
  (text "touch" (at 219.71 60.96 0)
    (effects (font (size 1.27 1.27)) (justify right bottom))
    (uuid c480dba7-51ff-4a4f-9251-e48b2784c64a)
  )
  (text "This is the header pinout with some, but not all,\nuseful pin functions listed. For more in depth functions\nand other options such as alternate pins, please see \nthe 3217 data sheet."
    (at 153.67 50.8 0)
    (effects (font (size 1.27 1.27)) (justify left bottom))
    (uuid d1b1d193-e70c-4c72-a0f3-486cef761b28)
  )
  (text "AIN4" (at 205.74 58.42 0)
    (effects (font (size 1.27 1.27)) (justify right bottom))
    (uuid d8370835-89ad-4b62-9f40-d0c10470788a)
  )
  (text "touch" (at 255.27 78.74 0)
    (effects (font (size 1.27 1.27)) (justify right bottom))
    (uuid db902262-2864-4997-aeff-8abaa132424a)
  )
  (text "TCA0" (at 262.89 54.61 0)
    (effects (font (size 1.27 1.27)) (justify right bottom))
    (uuid dc628a9d-67e8-4a03-b99f-8cc7a42af6ef)
  )
  (text "AIN1" (at 270.51 63.5 0)
    (effects (font (size 1.27 1.27)) (justify right bottom))
    (uuid dde4c43d-f33e-48ba-86f3-779fdfce00c2)
  )
  (text "WO1" (at 212.09 81.28 0)
    (effects (font (size 1.27 1.27)) (justify right bottom))
    (uuid f2392fe0-54af-4e02-8793-9ba2471944b5)
  )
  (text "SDA" (at 195.58 81.28 0)
    (effects (font (size 1.27 1.27)) (justify right bottom))
    (uuid f74eb612-4697-4cb4-afe4-9f94828b954d)
  )
  (text "touch" (at 255.27 81.28 0)
    (effects (font (size 1.27 1.27)) (justify right bottom))
    (uuid fab1abc4-c49d-4b88-8c7f-939d7feb7b6c)
  )
  (text "touch" (at 219.71 81.28 0)
    (effects (font (size 1.27 1.27)) (justify right bottom))
    (uuid fb191df4-267d-4797-80dd-be346b8eeb99)
  )
  (text "CS" (at 195.58 58.42 0)
    (effects (font (size 1.27 1.27)) (justify right bottom))
    (uuid fbb5e77c-4b41-4796-ad13-1b9e2bbc3c81)
  )
  (text "SCK" (at 279.4 58.42 0)
    (effects (font (size 1.27 1.27)) (justify right bottom))
    (uuid fdc57161-f7f8-4584-b0ec-8c1aa24339c6)
  )
  (text "AIN8" (at 205.74 73.66 0)
    (effects (font (size 1.27 1.27)) (justify right bottom))
    (uuid fec6f717-d723-4676-89ef-8ea691e209c2)
  )

  (global_label "GND" (shape input) (at 223.52 29.21 270) (fields_autoplaced)
    (effects (font (size 1.27 1.27)) (justify right))
    (uuid 0f41a909-27c4-4be2-9d5e-9ae2108c8ff5)
    (property "Intersheetrefs" "${INTERSHEET_REFS}" (at 3.81 -5.08 0)
      (effects (font (size 1.27 1.27)) hide)
    )
  )
  (global_label "PC1" (shape input) (at 243.84 77.47 0) (fields_autoplaced)
    (effects (font (size 1.27 1.27)) (justify left))
    (uuid 13abf99d-5265-4779-8973-e94370fd18ff)
    (property "Intersheetrefs" "${INTERSHEET_REFS}" (at 270.51 29.21 0)
      (effects (font (size 1.27 1.27)) (justify left) hide)
    )
  )
  (global_label "PB2" (shape input) (at 226.06 82.55 180) (fields_autoplaced)
    (effects (font (size 1.27 1.27)) (justify right))
    (uuid 1860e030-7a36-4298-b7fc-a16d48ab15ba)
    (property "Intersheetrefs" "${INTERSHEET_REFS}" (at 304.8 29.21 0)
      (effects (font (size 1.27 1.27)) (justify left) hide)
    )
  )
  (global_label "PB5" (shape input) (at 226.06 72.39 180) (fields_autoplaced)
    (effects (font (size 1.27 1.27)) (justify right))
    (uuid 23bb2798-d93a-4696-a962-c305c4298a0c)
    (property "Intersheetrefs" "${INTERSHEET_REFS}" (at 304.8 29.21 0)
      (effects (font (size 1.27 1.27)) (justify left) hide)
    )
  )
  (global_label "PB3" (shape input) (at 226.06 77.47 180) (fields_autoplaced)
    (effects (font (size 1.27 1.27)) (justify right))
    (uuid 32667662-ae86-4904-b198-3e95f11851bf)
    (property "Intersheetrefs" "${INTERSHEET_REFS}" (at 304.8 29.21 0)
      (effects (font (size 1.27 1.27)) (justify left) hide)
    )
  )
  (global_label "PA5" (shape input) (at 226.06 59.69 180) (fields_autoplaced)
    (effects (font (size 1.27 1.27)) (justify right))
    (uuid 3f5fe6b7-98fc-4d3e-9567-f9f7202d1455)
    (property "Intersheetrefs" "${INTERSHEET_REFS}" (at 304.8 29.21 0)
      (effects (font (size 1.27 1.27)) (justify left) hide)
    )
  )
  (global_label "PA3" (shape input) (at 243.84 57.15 0) (fields_autoplaced)
    (effects (font (size 1.27 1.27)) (justify left))
    (uuid 47baf4b1-0938-497d-88f9-671136aa8be7)
    (property "Intersheetrefs" "${INTERSHEET_REFS}" (at 270.51 29.21 0)
      (effects (font (size 1.27 1.27)) (justify left) hide)
    )
  )
  (global_label "PB0" (shape input) (at 243.84 80.01 0) (fields_autoplaced)
    (effects (font (size 1.27 1.27)) (justify left))
    (uuid 4e3d7c0d-12e3-42f2-b944-e4bcdbbcac2a)
    (property "Intersheetrefs" "${INTERSHEET_REFS}" (at 270.51 29.21 0)
      (effects (font (size 1.27 1.27)) (justify left) hide)
    )
  )
  (global_label "PA7" (shape input) (at 226.06 64.77 180) (fields_autoplaced)
    (effects (font (size 1.27 1.27)) (justify right))
    (uuid 62c076a3-d618-44a2-9042-9a08b3576787)
    (property "Intersheetrefs" "${INTERSHEET_REFS}" (at 304.8 29.21 0)
      (effects (font (size 1.27 1.27)) (justify left) hide)
    )
  )
  (global_label "PB1" (shape input) (at 226.06 80.01 180) (fields_autoplaced)
    (effects (font (size 1.27 1.27)) (justify right))
    (uuid 6a44418c-7bb4-4e99-8836-57f153c19721)
    (property "Intersheetrefs" "${INTERSHEET_REFS}" (at 304.8 29.21 0)
      (effects (font (size 1.27 1.27)) (justify left) hide)
    )
  )
  (global_label "PB6" (shape input) (at 226.06 69.85 180) (fields_autoplaced)
    (effects (font (size 1.27 1.27)) (justify right))
    (uuid 6e105729-aba0-497c-a99e-c32d2b3ddb6d)
    (property "Intersheetrefs" "${INTERSHEET_REFS}" (at 304.8 29.21 0)
      (effects (font (size 1.27 1.27)) (justify left) hide)
    )
  )
  (global_label "PC5" (shape input) (at 243.84 67.31 0) (fields_autoplaced)
    (effects (font (size 1.27 1.27)) (justify left))
    (uuid 749dfe75-c0d6-4872-9330-29c5bbcb8ff8)
    (property "Intersheetrefs" "${INTERSHEET_REFS}" (at 270.51 29.21 0)
      (effects (font (size 1.27 1.27)) (justify left) hide)
    )
  )
  (global_label "PC0" (shape input) (at 243.84 82.55 0) (fields_autoplaced)
    (effects (font (size 1.27 1.27)) (justify left))
    (uuid 8322f275-268c-4e87-a69f-4cfbf05e747f)
    (property "Intersheetrefs" "${INTERSHEET_REFS}" (at 270.51 29.21 0)
      (effects (font (size 1.27 1.27)) (justify left) hide)
    )
  )
  (global_label "PC2" (shape input) (at 243.84 74.93 0) (fields_autoplaced)
    (effects (font (size 1.27 1.27)) (justify left))
    (uuid 87371631-aa02-498a-998a-09bdb74784c1)
    (property "Intersheetrefs" "${INTERSHEET_REFS}" (at 270.51 29.21 0)
      (effects (font (size 1.27 1.27)) (justify left) hide)
    )
  )
  (global_label "PB4" (shape input) (at 226.06 74.93 180) (fields_autoplaced)
    (effects (font (size 1.27 1.27)) (justify right))
    (uuid 9ccf03e8-755a-4cd9-96fc-30e1d08fa253)
    (property "Intersheetrefs" "${INTERSHEET_REFS}" (at 304.8 29.21 0)
      (effects (font (size 1.27 1.27)) (justify left) hide)
    )
  )
  (global_label "PA6" (shape input) (at 226.06 62.23 180) (fields_autoplaced)
    (effects (font (size 1.27 1.27)) (justify right))
    (uuid afb8e687-4a13-41a1-b8c0-89a749e897fe)
    (property "Intersheetrefs" "${INTERSHEET_REFS}" (at 304.8 29.21 0)
      (effects (font (size 1.27 1.27)) (justify left) hide)
    )
  )
  (global_label "3V0" (shape input) (at 226.06 54.61 180) (fields_autoplaced)
    (effects (font (size 1.27 1.27)) (justify right))
    (uuid b1169a2d-8998-4b50-a48d-c520bcc1b8e1)
    (property "Intersheetrefs" "${INTERSHEET_REFS}" (at 220.2282 54.5306 0)
      (effects (font (size 1.27 1.27)) (justify right) hide)
    )
  )
  (global_label "PB7" (shape input) (at 226.06 67.31 180) (fields_autoplaced)
    (effects (font (size 1.27 1.27)) (justify right))
    (uuid c1d83899-e380-49f9-a87d-8e78bc089ebf)
    (property "Intersheetrefs" "${INTERSHEET_REFS}" (at 304.8 29.21 0)
      (effects (font (size 1.27 1.27)) (justify left) hide)
    )
  )
  (global_label "PC4" (shape input) (at 243.84 69.85 0) (fields_autoplaced)
    (effects (font (size 1.27 1.27)) (justify left))
    (uuid cbdcaa78-3bbc-413f-91bf-2709119373ce)
    (property "Intersheetrefs" "${INTERSHEET_REFS}" (at 270.51 29.21 0)
      (effects (font (size 1.27 1.27)) (justify left) hide)
    )
  )
  (global_label "GND" (shape input) (at 243.84 54.61 0) (fields_autoplaced)
    (effects (font (size 1.27 1.27)) (justify left))
    (uuid d1262c4d-2245-4c4f-8f35-7bb32cd9e21e)
    (property "Intersheetrefs" "${INTERSHEET_REFS}" (at 270.51 29.21 0)
      (effects (font (size 1.27 1.27)) (justify left) hide)
    )
  )
  (global_label "PC3" (shape input) (at 243.84 72.39 0) (fields_autoplaced)
    (effects (font (size 1.27 1.27)) (justify left))
    (uuid d8603679-3e7b-4337-8dbc-1827f5f54d8a)
    (property "Intersheetrefs" "${INTERSHEET_REFS}" (at 270.51 29.21 0)
      (effects (font (size 1.27 1.27)) (justify left) hide)
    )
  )
  (global_label "PA2" (shape input) (at 243.84 59.69 0) (fields_autoplaced)
    (effects (font (size 1.27 1.27)) (justify left))
    (uuid e615f7aa-337e-474d-9615-2ad82b1c44ca)
    (property "Intersheetrefs" "${INTERSHEET_REFS}" (at 270.51 29.21 0)
      (effects (font (size 1.27 1.27)) (justify left) hide)
    )
  )
  (global_label "PA0" (shape input) (at 243.84 64.77 0) (fields_autoplaced)
    (effects (font (size 1.27 1.27)) (justify left))
    (uuid eb667eea-300e-4ca7-8a6f-4b00de80cd45)
    (property "Intersheetrefs" "${INTERSHEET_REFS}" (at 270.51 29.21 0)
      (effects (font (size 1.27 1.27)) (justify left) hide)
    )
  )
  (global_label "PA1" (shape input) (at 243.84 62.23 0) (fields_autoplaced)
    (effects (font (size 1.27 1.27)) (justify left))
    (uuid ef8fe2ac-6a7f-4682-9418-b801a1b10a3b)
    (property "Intersheetrefs" "${INTERSHEET_REFS}" (at 270.51 29.21 0)
      (effects (font (size 1.27 1.27)) (justify left) hide)
    )
  )
  (global_label "PA4" (shape input) (at 226.06 57.15 180) (fields_autoplaced)
    (effects (font (size 1.27 1.27)) (justify right))
    (uuid f1830a1b-f0cc-47ae-a2c9-679c82032f14)
    (property "Intersheetrefs" "${INTERSHEET_REFS}" (at 304.8 29.21 0)
      (effects (font (size 1.27 1.27)) (justify left) hide)
    )
  )

  (symbol (lib_id "chippydootles_components:Standoff_SMD_M2x0.4") (at 185.42 22.86 0) (unit 1)
    (in_bom yes) (on_board yes) (dnp no)
    (uuid 00000000-0000-0000-0000-00005e0bbc3d)
    (property "Reference" "H1" (at 187.96 21.6154 0)
      (effects (font (size 1.27 1.27)) (justify left))
    )
    (property "Value" "MountingHole_Pad" (at 187.96 23.9268 0)
      (effects (font (size 1.27 1.27)) (justify left))
    )
    (property "Footprint" "chippydootles_components:SMD_M2_SPACER_NOPASTE" (at 186.69 16.51 0)
      (effects (font (size 1.27 1.27)) hide)
    )
    (property "Datasheet" "~" (at 185.42 22.86 0)
      (effects (font (size 1.27 1.27)) hide)
    )
    (property "Digikey Part Number" "732-7090-1-ND" (at 186.055 12.7 0)
      (effects (font (size 1.27 1.27)) hide)
    )
    (property "Description" "ROUND STANDOFF M2X0.4 STEEL 4MM" (at 186.055 14.605 0)
      (effects (font (size 1.27 1.27)) hide)
    )
    (property "MPN" "9774040243R" (at 185.42 10.795 0)
      (effects (font (size 1.27 1.27)) hide)
    )
    (property "Manufacturer" "Würth Elektronik" (at 186.055 8.89 0)
      (effects (font (size 1.27 1.27)) hide)
    )
    (property "TYPE" "SMD" (at 185.42 22.86 0)
      (effects (font (size 1.27 1.27)) hide)
    )
    (pin "1" (uuid 04cadaed-dddf-4e51-9b74-198a6ec13fa7))
    (instances
      (project "AnwaarPendant"
        (path "/5740c959-93d8-47fd-8f68-62f0109e753d"
          (reference "H1") (unit 1)
        )
      )
    )
  )

  (symbol (lib_id "chippydootles_components:Standoff_SMD_M2x0.4") (at 210.82 22.86 0) (unit 1)
    (in_bom yes) (on_board yes) (dnp no)
    (uuid 00000000-0000-0000-0000-00005e0bc930)
    (property "Reference" "H2" (at 213.36 21.6154 0)
      (effects (font (size 1.27 1.27)) (justify left))
    )
    (property "Value" "MountingHole_Pad" (at 213.36 23.9268 0)
      (effects (font (size 1.27 1.27)) (justify left))
    )
    (property "Footprint" "chippydootles_components:SMD_M2_SPACER_NOPASTE" (at 212.09 16.51 0)
      (effects (font (size 1.27 1.27)) hide)
    )
    (property "Datasheet" "~" (at 210.82 22.86 0)
      (effects (font (size 1.27 1.27)) hide)
    )
    (property "Digikey Part Number" "732-7090-1-ND" (at 211.455 12.7 0)
      (effects (font (size 1.27 1.27)) hide)
    )
    (property "Description" "ROUND STANDOFF M2X0.4 STEEL 4MM" (at 211.455 14.605 0)
      (effects (font (size 1.27 1.27)) hide)
    )
    (property "MPN" "9774040243R" (at 210.82 10.795 0)
      (effects (font (size 1.27 1.27)) hide)
    )
    (property "Manufacturer" "Würth Elektronik" (at 211.455 8.89 0)
      (effects (font (size 1.27 1.27)) hide)
    )
    (property "TYPE" "SMD" (at 210.82 22.86 0)
      (effects (font (size 1.27 1.27)) hide)
    )
    (pin "1" (uuid 082f06cb-b9ad-4299-9ea6-65f633c2cad7))
    (instances
      (project "AnwaarPendant"
        (path "/5740c959-93d8-47fd-8f68-62f0109e753d"
          (reference "H2") (unit 1)
        )
      )
    )
  )

  (symbol (lib_id "chippydootles_components:Standoff_SMD_M2x0.4") (at 236.22 22.86 0) (unit 1)
    (in_bom yes) (on_board yes) (dnp no)
    (uuid 00000000-0000-0000-0000-00005e0bce63)
    (property "Reference" "H3" (at 238.76 21.6154 0)
      (effects (font (size 1.27 1.27)) (justify left))
    )
    (property "Value" "MountingHole_Pad" (at 238.76 23.9268 0)
      (effects (font (size 1.27 1.27)) (justify left))
    )
    (property "Footprint" "chippydootles_components:SMD_M2_SPACER_NOPASTE" (at 237.49 16.51 0)
      (effects (font (size 1.27 1.27)) hide)
    )
    (property "Datasheet" "~" (at 236.22 22.86 0)
      (effects (font (size 1.27 1.27)) hide)
    )
    (property "Digikey Part Number" "732-7090-1-ND" (at 236.855 12.7 0)
      (effects (font (size 1.27 1.27)) hide)
    )
    (property "Description" "ROUND STANDOFF M2X0.4 STEEL 4MM" (at 236.855 14.605 0)
      (effects (font (size 1.27 1.27)) hide)
    )
    (property "MPN" "9774040243R" (at 236.22 10.795 0)
      (effects (font (size 1.27 1.27)) hide)
    )
    (property "Manufacturer" "Würth Elektronik" (at 236.855 8.89 0)
      (effects (font (size 1.27 1.27)) hide)
    )
    (property "TYPE" "SMD" (at 236.22 22.86 0)
      (effects (font (size 1.27 1.27)) hide)
    )
    (pin "1" (uuid a6b18b0a-040b-4abe-8dd1-e62f1d441492))
    (instances
      (project "AnwaarPendant"
        (path "/5740c959-93d8-47fd-8f68-62f0109e753d"
          (reference "H3") (unit 1)
        )
      )
    )
  )

  (symbol (lib_id "chippydootles_components:Standoff_SMD_M2x0.4") (at 261.62 22.86 0) (unit 1)
    (in_bom yes) (on_board yes) (dnp no)
    (uuid 00000000-0000-0000-0000-00005e0bd44b)
    (property "Reference" "H4" (at 264.16 21.6154 0)
      (effects (font (size 1.27 1.27)) (justify left))
    )
    (property "Value" "MountingHole_Pad" (at 264.16 23.9268 0)
      (effects (font (size 1.27 1.27)) (justify left))
    )
    (property "Footprint" "chippydootles_components:SMD_M2_SPACER_NOPASTE" (at 262.89 16.51 0)
      (effects (font (size 1.27 1.27)) hide)
    )
    (property "Datasheet" "~" (at 261.62 22.86 0)
      (effects (font (size 1.27 1.27)) hide)
    )
    (property "Digikey Part Number" "732-7090-1-ND" (at 262.255 12.7 0)
      (effects (font (size 1.27 1.27)) hide)
    )
    (property "Description" "ROUND STANDOFF M2X0.4 STEEL 4MM" (at 262.255 14.605 0)
      (effects (font (size 1.27 1.27)) hide)
    )
    (property "MPN" "9774040243R" (at 261.62 10.795 0)
      (effects (font (size 1.27 1.27)) hide)
    )
    (property "Manufacturer" "Würth Elektronik" (at 262.255 8.89 0)
      (effects (font (size 1.27 1.27)) hide)
    )
    (property "TYPE" "SMD" (at 261.62 22.86 0)
      (effects (font (size 1.27 1.27)) hide)
    )
    (pin "1" (uuid 6e64920c-c183-47dd-ac0b-0b612d9429b8))
    (instances
      (project "AnwaarPendant"
        (path "/5740c959-93d8-47fd-8f68-62f0109e753d"
          (reference "H4") (unit 1)
        )
      )
    )
  )

  (symbol (lib_id "SigilCircuit:Signature") (at 31.115 54.61 0) (unit 1)
    (in_bom yes) (on_board yes) (dnp no)
    (uuid 00000000-0000-0000-0000-00005f84fc40)
    (property "Reference" "G2" (at 36.9062 53.4416 0)
      (effects (font (size 1.27 1.27)) (justify left))
    )
    (property "Value" "Anwaar" (at 36.9062 55.753 0)
      (effects (font (size 1.27 1.27)) (justify left))
    )
    (property "Footprint" "chippydootles_art:anwaar" (at 31.115 54.61 0)
      (effects (font (size 1.27 1.27)) hide)
    )
    (property "Datasheet" "" (at 31.115 54.61 0)
      (effects (font (size 1.27 1.27)) hide)
    )
    (instances
      (project "AnwaarPendant"
        (path "/5740c959-93d8-47fd-8f68-62f0109e753d"
          (reference "G2") (unit 1)
        )
      )
    )
  )

  (symbol (lib_id "chippydootles_components:Conn_02x12_Odd_Even") (at 233.68 67.31 0) (unit 1)
    (in_bom yes) (on_board yes) (dnp no)
    (uuid 00000000-0000-0000-0000-00006190672f)
    (property "Reference" "J1" (at 234.95 49.0982 0)
      (effects (font (size 1.27 1.27)))
    )
    (property "Value" "Header Pinout" (at 234.95 51.4096 0)
      (effects (font (size 1.27 1.27)))
    )
    (property "Footprint" "chippydootles_components:SAMTEC-FTS-112-03-X-DV" (at 234.95 46.99 0)
      (effects (font (size 1.27 1.27)) hide)
    )
    (property "Datasheet" "~" (at 233.68 67.31 0)
      (effects (font (size 1.27 1.27)) hide)
    )
    (property "Description" "CONN HEADER SMD 24POS 1.27MM" (at 233.68 41.91 0)
      (effects (font (size 1.27 1.27)) hide)
    )
    (property "TYPE" "SMD" (at 234.95 64.77 0)
      (effects (font (size 1.27 1.27)) hide)
    )
    (property "Digikey Part Number" "CLP-112-02-F-D-P-TR" (at 233.68 39.37 0)
      (effects (font (size 1.27 1.27)) hide)
    )
    (property "MPN" "CLP-112-02-F-D-P-TR" (at 233.68 36.83 0)
      (effects (font (size 1.27 1.27)) hide)
    )
    (property "Manufacturer" "Samtec Inc." (at 233.68 44.45 0)
      (effects (font (size 1.27 1.27)) hide)
    )
    (pin "1" (uuid 9611124b-0f3a-428f-9feb-f748205448f2))
    (pin "10" (uuid b9edb058-a318-4701-8fe8-7d35f9156afb))
    (pin "11" (uuid e90e8e50-8bc6-4dc6-b69b-3835d88d297a))
    (pin "12" (uuid 5b12bb61-076d-4c1f-9a6d-b399c284e4b7))
    (pin "13" (uuid 237297a1-afb3-46e7-b820-3f38e676d83b))
    (pin "14" (uuid 1c297131-deeb-400e-918a-e0d68f026d4d))
    (pin "15" (uuid 3648d3c3-5400-457c-89fe-064ddcd81a54))
    (pin "16" (uuid d80c1717-ac3d-4079-bb28-2615cdffe16d))
    (pin "17" (uuid 6906f1a8-5cdf-498a-bfa6-4275c1d4e03b))
    (pin "18" (uuid 94e165c9-845f-4866-9727-b9bc6fc9bb64))
    (pin "19" (uuid 2e71e03e-ac6e-4806-8e6a-41de419b7f54))
    (pin "2" (uuid a24e325d-8cfa-4261-a52d-8691d3249a15))
    (pin "20" (uuid 4f92bc44-7bf1-432d-892d-8247e7b0fa36))
    (pin "21" (uuid f3c68c6f-ffae-4f95-8166-23da4672383f))
    (pin "22" (uuid fb0196ac-4d5f-4730-83dc-c31452f11210))
    (pin "23" (uuid 3a7d5ffe-ee3d-4981-819d-b1c61786ee0d))
    (pin "24" (uuid b66ecb4f-d2d1-4e4a-b1fa-c9411c6a5528))
    (pin "3" (uuid ca3ae3ee-a2a0-48d9-8349-b993f61017fc))
    (pin "4" (uuid baa49b15-b392-4222-9def-1aeb9e7cd2db))
    (pin "5" (uuid 833eacaa-a6d3-4911-8432-b9760f2891c7))
    (pin "6" (uuid d9e61282-8687-4b7d-afff-b0cd69e1634b))
    (pin "7" (uuid 3fa79ab7-2934-40dd-bc31-aca1b173e14b))
    (pin "8" (uuid 19eb01e0-4869-4999-99db-07a3ce357b18))
    (pin "9" (uuid d10fed4b-9a5f-462f-82e5-322cb681a193))
    (instances
      (project "AnwaarPendant"
        (path "/5740c959-93d8-47fd-8f68-62f0109e753d"
          (reference "J1") (unit 1)
        )
      )
    )
  )

  (symbol (lib_id "power:GND") (at 229.87 28.575 0) (unit 1)
    (in_bom yes) (on_board yes) (dnp no) (fields_autoplaced)
    (uuid 5b5ade9e-4817-4f09-af31-ac04e7df6e5b)
    (property "Reference" "#PWR0101" (at 229.87 34.925 0)
      (effects (font (size 1.27 1.27)) hide)
    )
    (property "Value" "GND" (at 229.87 33.0184 0)
      (effects (font (size 1.27 1.27)))
    )
    (property "Footprint" "" (at 229.87 28.575 0)
      (effects (font (size 1.27 1.27)) hide)
    )
    (property "Datasheet" "" (at 229.87 28.575 0)
      (effects (font (size 1.27 1.27)) hide)
    )
    (pin "1" (uuid 22c65a2f-bd23-459b-8ef2-a97c8890dad4))
    (instances
      (project "AnwaarPendant"
        (path "/5740c959-93d8-47fd-8f68-62f0109e753d"
          (reference "#PWR0101") (unit 1)
        )
      )
    )
  )

  (symbol (lib_id "power:+3V0") (at 227.33 50.165 0) (unit 1)
    (in_bom yes) (on_board yes) (dnp no) (fields_autoplaced)
    (uuid 984beced-8f31-40c8-a624-75d7a4e9848d)
    (property "Reference" "#PWR0102" (at 227.33 53.975 0)
      (effects (font (size 1.27 1.27)) hide)
    )
    (property "Value" "+3V0" (at 227.33 46.5892 0)
      (effects (font (size 1.27 1.27)))
    )
    (property "Footprint" "" (at 227.33 50.165 0)
      (effects (font (size 1.27 1.27)) hide)
    )
    (property "Datasheet" "" (at 227.33 50.165 0)
      (effects (font (size 1.27 1.27)) hide)
    )
    (pin "1" (uuid fc0c50de-881e-4502-b1cf-02690576580c))
    (instances
      (project "AnwaarPendant"
        (path "/5740c959-93d8-47fd-8f68-62f0109e753d"
          (reference "#PWR0102") (unit 1)
        )
      )
    )
  )

  (sheet_instances
    (path "/" (page "1"))
  )
)
