Designator,Val,Package,Mid X,Mid Y,Rotation,Layer
C1,10uF,C_0603_1608Metric,9.681001,9.090599,90,top
C2,2.8v 15F HVC ENYCAP,Vishay_15F_2.8V,0.029,-1.487,0,top
C4,1uF,C_0402_1005Metric,-3.9624,2.286,0,top
C5,1uF,C_0402_1005Metric,-5.6124,4.99,180,top
C6,22uF,C_0603_1608Metric,4.855002,9.090599,90,top
C7,4.7uF,C_0603_1608Metric,8.0264,-5.207,0,top
C8,10uF,C_0603_1608Metric,8.8392,-2.286,-90,top
C11,1uF,C_0402_1005Metric,-2.1336,1.8034,-90,top
D1,RED,LED_0603_1608Metric,-13.3314,-6.3892,-60,top
D2,BAT54,D_SOD-523,-5.969,-4.572,180,top
FID1,Fiducial,Fiducial_1mm_Mask2mm,-12.671,-10.758,0,top
FID2,Fiducial,Fiducial_1mm_Mask2mm,13.491,9.689,0,top
H1,SMD_Standoff,SMD_M2_SPACER,0,15,0,top
H2,SMD_Standoff,SMD_M2_SPACER,-14,6,0,top
H3,SMD_Standoff,SMD_M2_SPACER,14,6,0,top
H4,SMD_Standoff,SMD_M2_SPACER,-9,-12,0,top
H5,SMD_Standoff,SMD_M2_SPACER,9,-12,0,top
J1,CLP-105-02-F-D ODD EVEN,SAMTEC-CLP-105-02-X-D,-0.000009,7.890801,0,top
J3,USB_C_Receptacle_USB2.0,USB_C_Receptacle_GCT_USB4105-xx-A_16P_TopMnt_Horizontal,-0.0254,-13.4504,0,top
L1,2.2uH,L_1008_2520Metric,7.268,6.042599,0,top
R1,470e,R_0603_1608Metric,-10.414,1.27,90,top
R2,5.1K,R_0603_1608Metric,-4.064,-7.62,0,top
R3,5.1K,R_0603_1608Metric,4.064,-7.62,0,top
R4,3.3K,R_0603_1608Metric,-7.972,-6.7194,180,top
R5,10K,R_0603_1608Metric,4.1148,-2.3368,90,top
R6,24.9K,R_0603_1608Metric,2.4384,-2.3368,90,top
R7,499K,R_0603_1608Metric,8.382,0.762,180,top
R8,133K,R_0603_1608Metric,5.334,0.762,180,top
R9,499K,R_0603_1608Metric,8.382,2.286,180,top
R10,143K,R_0603_1608Metric,5.334,2.286,180,top
R11,1.15K,R_0603_1608Metric,5.363002,12.138599,180,top
S1,Right Angle SPDT,NIDEC CUS-12B,-8.6324,12.5592,-142,top
U1,CH342F,QFN-24-1EP_4x4mm_P0.5mm_EP2.6x2.6mm,-5.461,-1.016,180,top
U2,BD71631QWZ,UMMP10LZ1824,6.477,-2.286,180,top
U3,ATtiny1616-M,VQFN-20-1EP_3x3mm_P0.4mm_EP1.7x1.7mm,-6.2738,7.6454,90,top
U5,TPS63900,WSON-10-1EP_2.5x2.5mm_P0.5mm_EP1.2x2mm_ThermalVias,7.268,9.440601,-90,top
