,,,,,,,,,,,
Qty,Reference(s),Value,Description,Mouser Part Number,Digikey Part Number,LCSC Part Number,MPN,Manufacturer,Notes,Package,Type
2,"C1, C8",10uF,CAP CER 10UF 6.3V X5R 0603,187-CL10A106MQ8NNNC,1276-1119-1-ND,C1691,CL10A106MQ8NNNC,Samsung Electro-Mechanics,,603,SMD
1,C2,2.8v 15F HVC ENYCAP,CAP 15F 2.8V SMD,594-MAL219691252E3,4699PHBK-ND,N/A,MAL219691252E3,Vishay Beyschlag/Draloric/BC ,"DNP, DNS",,SMD
1,C7,4.7uF,CAP CER 4.7UF 6.3V X5R 0603,187-CL10A475KQ8NNNC,1276-1045-1-ND,C8032,CL10A475KQ8NNNC,Samsung Electro-Mechanics,,603,SMD
2,"C4, C5",1uF,1 µF ±10% 6.3V Ceramic Capacitor X7R 0402,81-GRM155R70J105KA2J,490-13339-1-ND,C2167130 ,GRM155R70J105KA12J,Murata Electronics,,402,SMD
1,C6,22uF,CAP CER 22UF 10V X5R 0603,187-CL10A226MP8NUNE,1276-1274-1-ND,C86295,CL10A226MP8NUNE,Samsung Electro-Mechanics,,603,SMD
1,C11,1uF,1 µF ±10% 6.3V Ceramic Capacitor X7R 0402,81-GRM155R70J105KA2J,490-13339-1-ND,C2167130 ,GRM155R70J105KA12J,Murata Electronics,,603,SMD
1,D1,RED,LED RED CLEAR 0603 SMD,710-150060RS75000,732-4978-1-ND,C3030991,150060RS75000,Würth Elektronik,,603,SMD
1,D2,BAT54,DIODE SCHOTTKY 30V 200MA SOD523,863-BAT54XV2T1G,BAT54XV2T1GOSCT-ND, C81572,BAT54XV2T1G,onsemi,,SOD-523,SMD
5,"H1, H2, H3, H4, H5",SMD_Standoff,ROUND STANDOFF M2X0.4 STEEL 4MM,710-9774040243R,732-7090-1-ND,N/A,9774040243R,Würth Elektronik,,,SMD
1,J1,CLP-105-02-F-D ODD EVEN,CONN RCPT 10POS 0.05 GOLD SMD,200-CLP10502FD,SAM1153-05-ND,C3322365,CLP-105-02-F-D,Samtec Inc.,,,SMD
1,J3,USB_C_Receptacle_USB2.0,CONN RCP USB2.0 TYP C 24P SMD RA,640-USB4105-GF-A,2073-USB4105-GF-ACT-ND,N/A,USB4105-GF-A,GCT,,,SMD
1,L1,2.2uH,FIXED IND 2.2UH 2.3A 0.097OHM SM,81-DFE252010F-2R2MP2,490-13042-1-ND,C488330,DFE252010F-2R2M=P2,Murata Electronics,,1008,SMD
1,R1,470e,RES 470 OHM 1% 1/10W 0603,708-RMCF0603FT470R,RMCF0603FT470RDKR-ND, C2479441,RMCF0603FT470R,Stackpole Electronics Inc,,603,SMD
2,"R2, R3",5.1K,RES 5.1K OHM 1% 1/10W 0603,708-RMCF0603FT5K10,RMCF0603FT5K10CT-ND,C2484686,RMCF0603FT5K10,Stackpole Electronics Inc,,603,SMD
1,R4,3.3K,RES 3.3K OHM 1% 1/10W 0603,708-RMCF0603FT3K30,RMCF0603FT3K30DKR-ND,C2482554,RMCF0603FT3K30,Stackpole Electronics Inc,,603,SMD
1,R5,10K,RES 10K OHM 1% 1/10W 0603,708-RMCF0603FT10K0,RMCF0603FT10K0CT-ND,C2479067,RMCF0603FT10K0,Stackpole Electronics Inc,,603,SMD
1,R6,24.9K,RES 24.9K OHM 1% 1/10W 0603,708-RMCF0603FT24K9,RMCF0603FT24K9CT-ND, C2479552,RMCF0603FT24K9,Stackpole Electronics Inc,,603,SMD
2,"R7, R9",499K,RES 499K OHM 1% 1/10W 0603,708-RMCF0603FT499K,RMCF0603FT499KCT-ND,C3937912,RMCF0603FT499K,Stackpole Electronics Inc,,603,SMD
1,R8,133K,RES 133K OHM 1% 1/10W 0603,708-RMCF0603FT133K,RMCF0603FT133KCT-ND,C2484234,RMCF0603FT133K,Stackpole Electronics Inc,,603,SMD
1,R10,143K,RES 143K OHM 1% 1/10W 0603,708-RMCF0603FT143K,RMCF0603FT143KCT-ND,C2482528,RMCF0603FT143K,Stackpole Electronics Inc,,603,SMD
1,R11,1.15K,RES 1.15K OHM 1% 1/10W 0603,708-RMCF0603FT1K15,RMCF0603FT1K15CT-ND, C2479494,RMCF0603FT1K15,Stackpole Electronics Inc,,603,SMD
1,S1,Right Angle SPDT,SWITCH SLIDE SPDT 300MA 4V,229-CUS-12TB,563-1102-1-ND,C2921739,CUS-12TB,Nidec Copal Electronics,,,SMD
1,U1,WCH342F,USB-UART 2 Channel,N/A,N/A, C2841530,CH342F,WCH, ,QFN24,SMD
1,U2,BD71631QWZ,Linear Charger,755-BD71631QWZ-TR,846-BD71631QWZ-TRCT-ND,N/A,BD71631QWZ-TR,Rohm Semiconductor,,XFDFN-10EP,SMD
1,U3,ATtiny1616-M,8-BIT AVR MCU,556-ATTINY1616MNR,ATTINY1616-MNRCT-ND,C507118,ATTINY1616-MNR,Microchip Technology,,VQFN24,SMD
1,U5,TPS63900,"1.8-V TO 5.5-V,  BUCK-BOOST",595-TPS63900DSKR,296-TPS63900DSKRDKR-ND,C1518762,TPS63900DSKR,Texas Instruments,,WSON-10,SMD
