fishery_id,fishery_name,region,management,fishery_type_1,exported,country,gear_type,water_type
1,AK W/S T,SEAK,AABM,P,Y,US,T,M
2,AK JNO T,SEAK,AABM,P,Y,US,T,M
3,AK JNI T,SEAK,AABM,P,Y,US,T,M
4,AK JLO T,SEAK,AABM,P,Y,US,T,M
5,AK JLI T,SEAK,AABM,P,Y,US,T,M
6,AK FALL T,SEAK,AABM,P,Y,US,T,M
7,TAK TERM T,SEAK,AABM,T,Y,CA,T,M
8,NORTH T,NBC,AABM,P,Y,CA,T,M
9,CENTRL T,NBC,ISBM,P,Y,CA,T,M
10,WCVI F/W T,WCVI,AABM,P,Y,CA,T,M
11,WCVI SPR T,WCVI,AABM,P,Y,CA,T,M
12,WCVI SUM T,WCVI,AABM,P,Y,CA,T,M
13,N FALCON T,SUS,ISBM,P,Y,US,T,M
14,S FALCON T,SUS,ISBM,P,Y,US,T,M
15,TOR TERM T,SUS,ISBM,T,Y,US,T,M
16,GEO ST T,SBC,ISBM,P,Y,CA,T,M
17,ALASKA N,SEAK,AABM,P,Y,US,N,M
18,NORTH N,NBC,ISBM,P,Y,CA,N,M
19,TNBC TERM N,NBC,ISBM,T,Y,CA,N,M
20,CENTRL N,NBC,ISBM,P,Y,CA,N,M
21,TCBC TERM N,NBC,ISBM,T,Y,CA,N,M
22,TWCVI TERM N,WCVI,ISBM,T,Y,CA,N,M
23,WCVI N,WCVI,ISBM,P,Y,CA,N,M
24,GEO ST N,SBC,ISBM,P,Y,CA,N,M
25,PGSDN N,SUS,ISBM,P,Y,US,N,M
26,TPGSDN TERM N,SUS,ISBM,T,Y,US,N,M
27,US JF N,SUS,ISBM,P,Y,US,N,M
28,PGSDO N,SUS,ISBM,P,Y,US,N,M
29,TPGSDO TERM N,SUS,ISBM,T,Y,US,N,M
30,WA CST N,SUS,ISBM,P,Y,US,N,M
31,TCOL R N,SUS,ISBM,T,Y,US,N,M
32,TAK TERM N,SEAK,AABM,T,Y,US,N,M
33,TBR TERM N,SEAK,AABM,T,Y,US,N,M
34,TNORTH FN,FW-CA,ISBM,T,Y,CA,N,F
35,TCENTRAL FN,FW-CA,ISBM,T,Y,CA,N,F
36,TGEO ST FN,FW-CA,ISBM,T,Y,CA,N,F
37,TFRAS FN,FW-CA,ISBM,T,Y,CA,N,F
38,TPS FN,FW-US,ISBM,T,Y,US,N,F
39,TWAC FN,FW-US,ISBM,T,Y,US,N,F
40,JNST N,SBC,ISBM,P,Y,CA,N,M
41,BC JF N,SBC,ISBM,P,Y,CA,N,M
42,FRASER N,SBC,ISBM,P,Y,CA,N,M
43,TFRASER TERM N,FW-CA,ISBM,T,Y,CA,N,F
44,ALASKA S,SEAK,AABM,P,Y,US,S,M
45,CBC S,NBC,ISBM,P,Y,CA,S,M
46,TCBC TERM S,NBC,ISBM,T,Y,CA,S,M
47,NBC AABM S,NBC,AABM,P,Y,CA,S,M
48,NBC ISBM S,NBC,ISBM,P,Y,CA,S,M
49,TNBC TERM S,NBC,ISBM,T,Y,CA,S,M
50,WCVI AABM S,WCVI,AABM,P,Y,CA,S,M
51,WCVI ISBM S,WCVI,ISBM,P,Y,CA,S,M
52,TWCVI TERM S,WCVI,ISBM,T,Y,CA,S,M
53,N FALCON S,SUS,ISBM,P,Y,US,S,M
54,TNF TERM S,SUS,ISBM,T,Y,US,S,M
55,S FALCON S,SUS,ISBM,P,Y,US,S,M
56,TSF TERM S,SUS,ISBM,T,Y,US,S,M
57,PGSDN S,SUS,ISBM,P,Y,US,S,M
58,TPGSDN TERM S,SUS,ISBM,T,Y,US,S,M
59,PGSDO S,SUS,ISBM,P,Y,US,S,M
60,TPGSDO TERM S,SUS,ISBM,T,Y,US,S,M
61,JNST S,SBC,ISBM,P,Y,CA,S,M
62,TJNST TERM S,SBC,ISBM,T,Y,CA,S,M
63,GEO ST S,SBC,ISBM,P,Y,CA,S,M
64,TGEO ST TERM S,SBC,ISBM,T,Y,CA,S,M
65,BC JF S,SBC,ISBM,P,Y,CA,S,M
66,TBC JF TERM S,SBC,ISBM,T,Y,CA,S,M
67,TCOL R S,SUS,ISBM,T,Y,US,S,M
68,TAK TERM S,SEAK,AABM,T,Y,US,S,M
69,TBR TERM S,SEAK,AABM,T,Y,US,S,M
70,TNORTH FS,FW-CA,ISBM,T,Y,CA,S,F
71,TCENTRAL FS,FW-CA,ISBM,T,Y,CA,S,F
72,TWCVI FS,FW-CA,ISBM,T,Y,CA,S,F
73,TFRASER FS,FW-CA,ISBM,T,Y,CA,S,F
74,TGS FS,FW-CA,ISBM,T,Y,CA,S,F
75,TPS FS,FW-US,ISBM,T,Y,US,S,F
76,TSF TERM FS,FW-US,ISBM,T,Y,US,S,F
77,TCAN TBR N,FW-CA,,T,Y,CA,N,F
78,XCA ESC STRAY,FW-CA,,T,N,CA,X,F
79,XUS ESC STRAY,FW-US,,T,N,US,X,F
