fisherymodel56,fisherymodel56name,fisherymodel49,fisherymodel49name
1,AK W/S T,1,ALASKA T
2,AK JNO T,1,ALASKA T
3,AK JNI T,1,ALASKA T
4,AK JLO T,1,ALASKA T
5,AK JLI T,1,ALASKA T
6,AK FALL T,1,ALASKA T
7,TAK TERM T,2,TAK TERM T
8,NORTH T,3,NORTH T
9,CENTRL T,4,CENTRL T
10,WCVI F/W T,5,WCVI T
11,WCVI SPR T,5,WCVI T
12,WCVI SUM T,5,WCVI T
13,N FALCON T,6,N FALCON T
14,S FALCON T,7,S FALCON T
15,GEO ST T,8,GEO ST T
16,ALASKA N,9,ALASKA N
17,NORTH N,10,NORTH N
18,CENTRL N,11,CENTRL N
19,WCVI N,12,WCVI N
20,J DE F N,13,J DE F N
21,PGSDN N,14,PGSDN N
22,PGSDO N,15,PGSDO N
23,WASH CST N,16,WASH CST N
24,TCOL R N,17,TCOL R N
25,TAK TERM N,18,TAK TERM N
26,TNORTH FN,19,TNORTH FN
27,TCENTRAL FN,20,TCENTRAL FN
28,TGEO ST FN,21,TGEO ST FN
29,TFRAS FN,22,TFRAS FN
30,TPS FN,23,TPS FN
31,TWAC FN,24,TWAC FN
32,JNST N,25,JNST N
33,FRASER N,26,FRASER N
34,ALASKA S,27,ALASKA S
35,CBC S,28,CBC S
36,NBC AABM S,29,NBC AABM S
37,NBC ISBM S,30,NBC ISBM S
38,WCVI AABM S,31,WCVI AABM S
39,WCVI ISBM S,32,WCVI ISBM S
40,N FALCON S,33,N FALCON S
41,S FALCON S,34,S FALCON S
42,PGSDN S,35,PGSDN S
43,PGSDO S,36,PGSDO S
44,TCAN TBR TERM FN,37,TCAN TBR TERM FN
45,GEO ST S,38,GEO ST S
46,BC JF S,39,BC JF S
47,TCOL R S,40,TCOL R S
48,TAK TERM S,41,TAK TERM S
49,TNORTH FS,42,TNORTH FS
50,TCENTRAL FS,43,TCENTRAL FS
51,TWCVI FS,44,TWCVI FS
52,TFRASER FS,45,TFRASER FS
53,TGS FS,46,TGS FS
54,TPS FS,47,TPS FS
55,TSF FS,48,TSF FS
56,ESCAPEMENT,49,ESCAPEMENT
