fisherycoarse,fisherycoarsename,fisherycoarsedesc,fisheryera80,fisheryera80name
1,AK WIN1 S/O T,ALASKA EARLY WINTER SOUTH OUTSIDE TROLL,1,AK W/S T
2,AK WIN1 N/O T,ALASKA EARLY WINTER NORTH OUTSIDE TROLL,1,AK W/S T
3,AK WIN1 S/I T,ALASKA EARLY WINTER SOUTH INSIDE TROLL,1,AK W/S T
4,AK WIN1 N/I T,ALASKA EARLY WINTER NORTH INSIDE TROLL,1,AK W/S T
5,AK WIN2 S/O T,ALASKA LATE WINTER SOUTH OUTSIDE TROLL,1,AK W/S T
6,AK WIN2 N/O T,ALASKA LATE WINTER NORTH OUTSIDE TROLL,1,AK W/S T
7,AK WIN2 S/I T,ALASKA LATE WINTER SOUTH INSIDE TROLL,1,AK W/S T
8,AK WIN2 N/I T,ALASKA LATE WINTER NORTH INSIDE TROLL,1,AK W/S T
9,AK SPR S/O T,ALASKA SPRING SOUTH OUTSIDE TROLL,1,AK W/S T
10,AK SPR N/O T,ALASKA SPRING NORTH OUTSIDE TROLL,1,AK W/S T
11,AK SPR S/I T,ALASKA SPRING SOUTH INSIDE TROLL,1,AK W/S T
12,AK SPR N/I T,ALASKA SPRING NORTH INSIDE TROLL,1,AK W/S T
13,AK JUNE S/O T,ALASKA JUNE SOUTH OUTSIDE TROLL,2,AK JNO T
14,AK JUNE N/O T,ALASKA JUNE NORTH OUTSIDE TROLL,2,AK JNO T
15,AK JUNE S/I T,ALASKA JUNE SOUTH INSIDE TROLL,3,AK JNI T
16,AK JUNE N/I T,ALASKA JUNE NORTH INSIDE TROLL,3,AK JNI T
17,AK JULY S/O T,ALASKA JULY SOUTH OUTSIDE TROLL,4,AK JLO T
18,AK JULY N/O T,ALASKA JULY NORTH OUTSIDE TROLL,4,AK JLO T
19,AK JULY S/I T,ALASKA JULY SOUTH INSIDE TROLL,5,AK JLI T
20,AK JULY N/I T,ALASKA JULY NORTH INSIDE TROLL,5,AK JLI T
21,AK FALL S/O T,ALASKA FALL SOUTH OUTSIDE TROLL,6,AK FALL T
22,AK FALL N/O T,ALASKA FALL NORTH OUTSIDE TROLL,6,AK FALL T
23,AK FALL S/I T,ALASKA FALL SOUTH INSIDE TROLL,6,AK FALL T
24,AK FALL N/I T,ALASKA FALL NORTH INSIDE TROLL,6,AK FALL T
25,AK NEAR TER T,ALASKA NEAR TERMINAL TROLL,7,TAK TERM T
26,AK TERMIN T,ALASKA TERMINAL TROLL,7,TAK TERM T
27,NBC FALL T,NORTH FALL TROLL,8,NORTH T
28,NBC WIN T,NORTH WINTER TROLL,8,NORTH T
29,NBC SPR T,NORTH SPRING TROLL,8,NORTH T
30,NBC SUM T,NORTH SUMMER TROLL,8,NORTH T
31,CENTR T,CENTRAL TROLL,9,CENTRL T
32,NWVI FALL T,NORTHWEST VANCOUVER ISLAND FALL TROLL,10,WCVI F/W T
33,NWVI WIN T,NORTHWEST VANCOUVER ISLAND WINTER TROLL,10,WCVI F/W T
34,NWVI SPR T,NORTHWEST VANCOUVER ISLAND SPRING TROLL,11,WCVI SPR T
35,NWVI SUM T,NORTHWEST VANCOUVER ISLAND SUMMER TROLL,12,WCVI SUM T
36,SWVI FALL T,SOUTHWEST VANCOUVER ISLAND FALL TROLL,10,WCVI F/W T
37,SWVI WIN T,SOUTHWEST VANCOUVER ISLAND WINTER TROLL,10,WCVI F/W T
38,SWVI SPR T,SOUTHWEST VANCOUVER ISLAND SPRING TROLL,11,WCVI SPR T
39,SWVI SUM T,SOUTHWEST VANCOUVER ISLAND SUMMER TROLL,12,WCVI SUM T
40,GEO ST T,GEORGIA STRAIGHT TROLL,16,GEO ST T
41,WA JDF T,WASHINGTON JUAN DE FUCA TROLL,13,N FALCON T
42,WA 4 T,WASHINGTON AREA 4 (NEAH BAY) NON-TRIBAL TROLL,13,N FALCON T
43,WA 4 T T,WASHINGTON AREA 4 (NEAH BAY) TRIBAL TROLL,13,N FALCON T
44,WA 3 T,WASHINGTON AREA 3 (LA PUSH) NON-TRIBAL TROLL,13,N FALCON T
45,WA 3 T T,WASHINGTON AREA 3 (LA PUSH) TRIBAL TROLL,13,N FALCON T
46,WA 2 T,WASHINGTON AREA 2 (WESTPORT) NON-TRIBAL TROLL,13,N FALCON T
47,WA 2 T T,WASHINGTON AREA 2 (WESTPORT) TRIBAL TROLL,13,N FALCON T
48,WA 1 T,WASHINGTON AREA 1 TROLL,13,N FALCON T
49,OR3 T,OREGON AREA 3 TROLL,14,S FALCON T
50,OR4 T,OREGON AREA 4 TROLL,14,S FALCON T
51,OR5 T,OREGON AREA 5 TROLL,14,S FALCON T
52,OR6 T,OREGON AREA 6 TROLL,14,S FALCON T
53,TORC T,OREGON COAST TERMINAL TROLL,15,TOR TERM T
54,CAL T,CALIFORNIA TROLL,14,S FALCON T
55,AK 101&102 GN,ALASKA DISTRICT 101 AND 102 GILLNET,17,ALASKA N
56,AK 106&108 GN,ALASKA DISTRICT 106 AND 108 GILLNET,17,ALASKA N
57,AK 111 GN,ALASKA DISTRICT 111 GILLNET,17,ALASKA N
58,AK 115 GN,ALASKA DISTRICT 115 GILLNET,17,ALASKA N
59,AK SEOT GN,ALASKA SOUTHEAST OTHER GILLNET,17,ALASKA N
60,TTAKU GN,TAKU RIVER TERMINAL GILLNET,33,TBR TERM N
61,TSTIKINE GN,STIKINE RIVER TERMINAL GILLNET,33,TBR TERM N
62,TSEAK GN,SE ALASKA TERMINAL GILLNET,32,TAK TERM N
63,AK SE SN,ALASKA SOUTHEAST SET GILLNET,17,ALASKA N
64,AK SASI SN,ALASKA DISTRICT 101 & 102 SEINE,17,ALASKA N
65,AK SASO SN,ALASKA DISTRICT 103 & 104 SEINE,17,ALASKA N
66,AK SACI SN,ALASKA DISTRICT 105 106 & 107 SEINE,17,ALASKA N
67,AK SACO SN,ALASKA DISTRICT 109 & 110 SEINE,17,ALASKA N
68,AK 111 SN,ALASKA DISTRICT 111 SEINE,17,ALASKA N
69,AK 112 SN,ALASKA DISTRICT 112 SEINE,17,ALASKA N
70,AK 113 SN,ALASKA DISTRICT 113 SEINE,17,ALASKA N
71,AK 114 SN,ALASKA DISTRICT 114 SEINE,17,ALASKA N
72,TSEAK SN,SE ALASKA TERMINAL SEINE,32,TAK TERM N
73,AK TRAP,ALASKA TRAP,17,ALASKA N
74,NORTH N,NORTH NET,18,NORTH N
75,TNORTH N,NORTH TERMINAL NET,19,TNBC TERM N
76,TNORTH FN,NORTH FRESHWATER NET,34,TNORTH FN
77,CENTR N,CENTRAL NET,20,CENTRL N
78,TCENTRAL N,CENTRAL TERMINAL NET,21,TCBC TERM N
79,TCENTRAL FN,CENTRAL FRESHWATER NET,35,TCENTRAL FN
80,JOHN ST N,JOHNSTONE STRAIT NET,40,JNST N
81,GEO ST N,GEORGIA STRAIT NET,24,GEO ST N
82,TGEO ST FN,GEORGIA STRAIT FRESHWATER NET,36,TGEO ST FN
83,NWVI N,NORTHWEST WCVI NET,23,WCVI N
84,TNWVI N,NORTHWEST WCVI TERMINAL NET,22,TWCVI TERM N
85,SWVI N,SOUTHWEST WCVI NET,23,WCVI N
86,TSWVI N,SOUTHWEST WCVI TERMINAL NET,22,TWCVI TERM N
87,FRASER N,FRASER NET,42,FRASER N
88,TFRASER N,FRASER TERMINAL NET,43,TFRASER TERM N
89,TLFRASER FN,LOWER FRASER FRESHWATER NET,37,TFRAS FN
90,TUFRASER FN,UPPER FRASER FRESHWATER NET,37,TFRAS FN
91,BC JDF N,CANADIAN JUAN DE FUCA NET,41,BC JF N
92,WCVI ISBM S,WCVI ISBM SPORT,51,WCVI ISBM S
93,WA JDF N,WASHINGTON JUAN DE FUCA NET,27,US JF N
94,TWA JDF FN,WASHINGTON JUAN DE FUCA FRESHWATER NET,38,TPS FN
95,PS SJ N,SAN JUANS NET,25,PGSDN N
96,TPS SJ N,SAN JUANS TERMINAL NET,26,TPGSDN TERM N
97,PG SD 7 N,PUGET SOUND AREA 7 NET,25,PGSDN N
98,PG SD 7A N,PUGET SOUND AREA 7A NET,25,PGSDN N
99,PS NK/SM N,NOOKSACK/SAMISH NET,25,PGSDN N
100,TPS NK/SM N,NOOKSACK/SAMISH TERMINAL NET,26,TPGSDN TERM N
101,TNPS FN,NORTH PUGET SOUND FRESHWATER NET,38,TPS FN
102,PS SKG N,SKAGIT NET,28,PGSDO N
103,TPS SKG N,SKAGIT TERMINAL NET,29,TPGSDO TERM N
104,TPS SKG FN,SKAGIT FRESHWATER NET,38,TPS FN
105,PS 6B-9 N,PUGET SOUND AREA 6B-9 NET,28,PGSDO N
106,TPS 6B-9 N,PUGET SOUND AREA 6B-9 TERMINAL NET,29,TPGSDO TERM N
107,PS ST/SN N,STILLAGUAMISH/SNOHOMISH NET,28,PGSDO N
108,TPS ST/SN N,STILLAGUAMISH/SNOHOMISH TERMINAL NET,29,TPGSDO TERM N
109,PS 10-11-13 N,PUGET SOUND AREA 10-11-13 NET,28,PGSDO N
110,TPS 10-11-13 N,PUGET SOUND AREA 10-11-13 TERMINAL NET,29,TPGSDO TERM N
111,TPS 10-11-13 FN,PUGET SOUND AREA 10-11-13 FRESHWATER NET,38,TPS FN
112,PS HC N,HOOD CANAL (AREA 12) NET,28,PGSDO N
113,TPS HC N,HOOD CANAL (AREA 12) TERMINAL NET,29,TPGSDO TERM N
114,TPS HC FN,HOOD CANAL (AREA 12) FRESHWATER NET,38,TPS FN
115,WAC N,WASHINGTON COAST NET,30,WA CST N
116,TWA NCST FN,WASHINGTON NORTH COAST FRESHWATER NET,39,TWAC FN
117,WA GH N,GRAYS HARBOR BAY NET,30,WA CST N
118,TWA GH FN,GRAYS HARBOR FRESHWATER NET,39,TWAC FN
119,WA WB N,WILLAPA BAY NET,30,WA CST N
120,TCOL R1-5 GN,COLUMBIA RIVER Z1-5 GILLNET,31,TCOL R N
121,TCOL R1-5 SN,COLUMBIA RIVER Z1-5 SEINE,31,TCOL R N
122,TCOL SA N,COLUMBIA SELECT AREA NET,31,TCOL R N
123,TCOL R6 N,COLUMBIA RIVER AREA 6 TERMINAL NET,31,TCOL R N
124,AK SE S,ALASKA SOUTHEAST SPORT,44,ALASKA S
125,TTAKU S,TAKU RIVER TERMINAL SPORT,69,TBR TERM S
126,TSTIKINE S,STIKINE RIVER TERMINAL SPORT,69,TBR TERM S
127,TAK SE S,ALASKA SOUTHEAST TERMINAL SPORT,68,TAK TERM S
128,NORTH AABM S,NORTH AABM SPORT (QCI),47,NBC AABM S
129,NORTH ISBM S,NORTH ISBM SPORT,48,NBC ISBM S
130,TNORTH S,NORTH TERMINAL SPORT,49,TNBC TERM S
131,TNORTH FS,NORTH FRESHWATER SPORT,70,TNORTH FS
132,CENTRAL S,CENTRAL SPORT,45,CBC S
133,TCENTRAL S,CENTRAL TERMINAL SPORT,46,TCBC TERM S
134,TCENTRAL FS,CENTRAL FRESHWATER SPORT,71,TCENTRAL FS
135,JOHN ST S,JOHNSTONE STRAIT SPORT,61,JNST S
136,NGS S,NORTH GEORGIA STRAIT SPORT,63,GEO ST S
137,TNGS S,NORTH GEORGIA STRAIT TERMINAL SPORT,64,TGEO ST TERM S
138,TNGS FS,NORTH GEORGIA STRAIT FRESHWATER SPORT,74,TGS FS
139,SGS S,SOUTH GEORGIA STRAIT SPORT,63,GEO ST S
140,TSGS S,SOUTH GEORGIA STRAIT TERMINAL SPORT,64,TGEO ST TERM S
141,TSGS FS,SOUTH GEORGIA STRAIT FRESHWATER SPORT,74,TGS FS
142,WCVI AABM S,WCVI AABM SPORT,50,WCVI AABM S
143,TWCVI S,WCVI TERMINAL SPORT,52,TWCVI TERM S
144,TWCVI FS,WCVI FRESHWATER SPORT,72,TWCVI FS
145,TFRASER FS,FRASER FRESHWATER SPORT,73,TFRASER FS
146,BC JDF S,CANADIAN JUAN DE FUCA SPORT,65,BC JF S
147,TBC JDF S,CANADIAN JUAN DE FUCA TERMINAL SPORT,66,TBC JF TERM S
148,TJOHN ST S,JOHNSTONE STRAIT TERMINAL SPORT,62,TJNST TERM S
149,TWA JDF FS,WASHINGTON JUAN DE FUCA FRESHWATER SPORT,75,TPS FS
150,PS 5 S,PUGET SOUND AREA 5 SPORT,57,PGSDN S
151,PS 6 S,PUGET SOUND AREA 6 SPORT,57,PGSDN S
152,PS 7 S,PUGET SOUND AREA 7 SPORT,57,PGSDN S
153,TNPS S,NORTH PUGET SOUND (AREA 5-7) TERMINAL SPORT,58,TPGSDN TERM S
154,TNPS FS,NORTH PUGET SOUND (AREA 5-7) FRESHWATER SPORT,75,TPS FS
155,PS 8-1 S,PUGET SOUND AREA 8-1 SPORT,59,PGSDO S
156,PS 8-2 S,PUGET SOUND AREA 8-2 SPORT,59,PGSDO S
157,PS 9 S,PUGET SOUND AREA 9 SPORT,59,PGSDO S
158,TPS 8-9 FS,PUGET SOUND AREA 8-9 TERMINAL SPORT,75,TPS FS
159,PS 10 S,PUGET SOUND AREA 10 SPORT,59,PGSDO S
160,PS 11 S,PUGET SOUND AREA 11 SPORT,59,PGSDO S
161,PS 12 S,PUGET SOUND AREA 12 SPORT,59,PGSDO S
162,TPS 12 S,PUGET SOUND AREA 12 TERMINAL SPORT,60,TPGSDO TERM S
163,TPS 12 FS,PUGET SOUND AREA 12 FRESHWATER SPORT,75,TPS FS
164,PS 13 S,PUGET SOUND AREA 13 SPORT,59,PGSDO S
165,TSPS S,SOUTH PUGET SOUND (10-11-13) TERMINAL SPORT,60,TPGSDO TERM S
166,TSPS FS,SOUTH PUGET SOUND (10-11-13) FRESHWATER SPORT,75,TPS FS
167,WAOCN4 S,WASHINGTON AREA 4 OCEAN SPORT,53,N FALCON S
168,WAOCN3 S,WASHINGTON AREA 3 OCEAN SPORT,53,N FALCON S
169,WAOCN2 S,WASHINGTON AREA 2 OCEAN SPORT,53,N FALCON S
170,WAOCN1 S,WASHINGTON AREA 1 OCEAN SPORT,53,N FALCON S
171,TWAC S,WASHINGTON COAST TERMINAL SPORT,54,TNF TERM S
172,BUOY 10 S,BUOY 10 SPORT,53,N FALCON S
173,TBUOY 10 S,TERMINAL BUOY 10 SPORT,67,TCOL R S
174,TCOL R S,TERMINAL ABOVE BUOY 10 SPORT,67,TCOL R S
175,OROCN3 S,OREGON AREA 3 OCEAN SPORT,55,S FALCON S
176,OROCN4 S,OREGON AREA 4 OCEAN SPORT,55,S FALCON S
177,OROCN5 S,OREGON AREA 5 OCEAN SPORT,55,S FALCON S
178,OROCN6 S,OREGON AREA 6 OCEAN SPORT,55,S FALCON S
179,TORC S,OREGON COAST TERMINAL SPORT,56,TSF TERM S
180,TORC FS,OREGON COAST FRESHWATER SPORT,76,TSF TERM FS
181,CAL OCN S,CALIFORNIA OCEAN SPORT,55,S FALCON S
182,COST REC,COST RECOVERY,80,ESCAPEMENT
183,PERS USE,PERSONAL USE,80,ESCAPEMENT
184,SUB,SUBSISTENCE,80,ESCAPEMENT
185,TBC TAK FN,BC TAKU FRESHWATER NET,77,TCAN TBR N
186,TBC TAK FS,BC TAKU FRESHWATER SPORT,77,TCAN TBR N
187,TBC STI FN,BC STIKINE FRESHWATER NET
,77,TCAN TBR N
188,TBC STI FS,BC STIKINE FRESHWATER SPORT
,77,TCAN TBR N
189,AK SUMMER CNR MSF S/O T,ALASKA SUMMER CNR MSF NORTH INSIDE TROLL,6,AK FALL T
190,AK SUMMER CNR MSF N/O T,ALASKA SUMMER CNR MSF NORTH OUTSIDE TROLL,6,AK FALL T
191,AK SUMMER CNR MSF S/I T,ALASKA SUMMER CNR MSF SOUTH INSIDE TROLL,6,AK FALL T
192,AK SUMMER CNR MSF N/I T,ALASKA SUMMER CNR MSF NORTH OUTSIDE TROLL,6,AK FALL T
193,CA ESC STRAY,CANADIAN ESCAPEMENT STRAY,78,XCA ESC STRAY
194,US ESC STRAY,US ESCAPEMENT STRAY,79,XUS ESC STRAY
195,ESCAPEMENT,ESCAPEMENT,80,ESCAPEMENT
