Año,Mes,Total de Conexiones,Crecimiento Anual (%),Penetración cada 100 hab.,Crecimiento Anual P.B.
2000,Dic,585489,,3.78,
2001,Dic,698127,19.24,4.46,0.68
2002,Dic,757760,8.54,4.79,0.33
2003,Dic,836007,10.33,5.22,0.44
2004,Dic,805315,-3.67,4.98,-0.25
2005,Dic,906079,12.51,5.54,0.56
2006,Dic,1087738,20.05,6.59,1.04
2007,Dic,1331919,22.45,7.98,1.40
2008,Dic,1439009,8.04,8.54,0.56
2009,Dic,1695034,17.79,9.96,1.42
2010,Dic,1819564,7.35,10.60,0.63
2011,Dic,2025042,11.29,11.69,1.09
2012,Dic,2186173,7.96,12.51,0.82
2013,Dic,2309572,5.64,13.10,0.59
2014,Dic,2501356,8.30,13.96,0.87
2015,Dic,2729251,9.11,15.08,1.12
2016,Dic,2912133,6.70,15.93,0.85
2017,Dic,3068528,5.37,16.51,0.58
2018,Dic,3255887,6.11,17.20,0.69
2019,Dic,3434402,5.48,17.81,0.61
