Año,Mes,Total de Conexiones,Crecimiento Mensual (%),Penetración cada 100 hab.,Crecimiento Anual P.B.
2010,Ene,1698908,0.2,9.98,0.01
2010,Feb,1697983,-0.1,9.97,-0.01
2010,Mar,1708303,0.6,10.02,0.05
2010,Abr,1731518,1.4,10.15,0.13
2010,May,1752810,1.2,10.26,0.12
2010,Jun,1749458,-0.2,10.23,-0.03
2010,Jul,1770485,1.2,10.35,0.12
2010,Ago,1793594,1.3,10.48,0.13
2010,Sep,1808189,0.8,10.55,0.08
2010,Oct,1803662,-0.3,10.52,-0.03
2010,Nov,1816980,0.7,10.59,0.07
2010,Dic,1819564,0.1,10.60,0.01
2011,Ene,1819146,0.0,10.59,-0.01
2011,Feb,1823656,0.2,10.60,0.02
2011,Mar,1855054,1.7,10.78,0.17
2011,Abr,1879451,1.3,10.91,0.13
2011,May,1910017,1.6,11.08,0.17
2011,Jun,1932809,1.2,11.21,0.12 
2011,Jul,1953417,1.1,11.32,0.11
2011,Ago,1977708,1.2,11.45,0.13
2011,Sep,1992753,0.8,11.53,0.08
2011,Oct,2005472,0.6,11.60,0.07
2011,Nov,2021209,0.8,11.67,0.08
2011,Dic,2025042,0.2,11.69,0.01
2012,Ene,2022882,-0.1,11.67,-0.02
2012,Feb,2029256,0.3,11.70,0.03
2012,Mar,2031572,0.1,11.70,0.00
2012,Abr,2070145,1.9,11.91,0.21
2012,May,2095838,1.2,12.06,0.14
2012,Jun,2097445,0.1,12.05,0.00
2012,Jul,2123653,1.2,12.19,0.14
2012,Ago,2152841,1.4,12.35,0.16
2012,Sep,2158206,0.2,12.37,0.02
2012,Oct,2177284,0.9,12.47,0.10
2012,Nov,2187644,0.5,12.52,0.05
2012,Dic,2186173,-0.1,12.51,-0.02
2013,Ene,2189991,0.2,12.52,0.01
2013,Feb,2194942,0.2,12.54,0.02
2013,Mar,2235805,1.9,12.76,0.22
2013,Abr,2225137,-0.5,12.69,-0.07
2013,May,2244527,0.9,12.79,0.10
2013,Jun,2260443,0.7,12.88,0.08
2013,Jul,2283719,1.0,13.00,0.12
2013,Ago,2285037,0.1,13.00,0.00
2013,Sep,2288676,0.2,13.01,0.01
2013,Oct,2314409,1.1,13.14,0.14
2013,Nov,2313618,0.0,13.13,-0.01
2013,Dic,2309572,-0.2,13.10,-0.03
2014,Ene,2308352,-0.1,13.08,-0.02
2014,Feb,2287815,-0.9,12.96,-0.13
2014,Mar,2352875,2.8,13.31,0.36
2014,Abr,2375672,1.0,13.43,0.12
2014,May,2391033,0.6,13.51,0.08
2014,Jun,2428592,1.6,13.71,0.20
2014,Jul,2447933,0.8,13.73,0.01
2014,Ago,2469314,0.9,13.83,0.11
2014,Sep,2482996,0.6,13.90,0.06
2014,Oct,2496297,0.5,13.96,0.06
2014,Nov,2503762,0.3,13.99,0.03
2014,Dic,2501356,-0.1,13.96,-0.03
2015,Ene,2509751,0.3,14.00,0.03
2015,Feb,2509990,0.0,13.99,-0.01
2015,Mar,2556914,1.9,14.24,0.25
2015,Abr,2589176,1.3,14.40,0.17
2015,May,2612968,0.9,14.52,0.12
2015,Jun,2614855,0.1,14.52,0.00
2015,Jul,2657179,1.6,14.74,0.22
2015,Ago,2679495,0.8,14.86,0.11
2015,Sep,2698253,0.7,14.95,0.09
2015,Oct,2717125,0.7,15.04,0.09
2015,Nov,2727811,0.4,15.08,0.05
2015,Dic,2729251,0.1,15.08,0.00
2016,Ene,2733597,0.2,15.09,0.01
2016,Feb,2736564,0.1,15.09,0.00
2016,Mar,2742987,0.2,15.12,0.02
2016,Abr,2771112,1.0,15.26,0.14
2016,May,2817799,1.7,15.50,0.24
2016,Jun,2830543,0.5,15.56,0.06
2016,Jul,2860355,1.1,15.71,0.15
2016,Ago,2860850,0.0,15.70,-0.01
2016,Sep,2889096,1.0,15.84,0.14
2016,Oct,2903487,0.5,15.91,0.07
2016,Nov,2913091,0.3,15.95,0.04
2016,Dic,2912133,0.0,15.93,-0.02
2017,Ene,2911642,0.0,15.90,-0.03
2017,Feb,2929146,0.6,15.98,0.08
2017,Mar,2950873,0.7,16.08,0.10
2017,Abr,2974123,0.8,16.18,0.11
2017,May,3005028,1.0,16.33,0.15
2017,Jun,3014054,0.3,16.36,0.03
2017,Jul,3029340,0.5,16.42,0.06
2017,Ago,3049046,0.7,16.50,0.08
2017,Sep,3064994,0.5,16.57,0.06
2017,Oct,3070402,0.2,16.57,0.00
2017,Nov,3067472,-0.1,16.53,-0.04
2017,Dic,3068528,0.0,16.51,-0.02
2018,Ene,3072250,0.1,16.51,0.00
2018,Feb,3065382,-0.2,16.44,-0.06
2018,Mar,3098143,1.1,16.60,0.15
2018,Abr,3120296,0.7,16.69,0.09
2018,May,3136157,0.5,16.75,0.06
2018,Jun,3155641,0.6,16.83,0.08
2018,Jul,3170207,0.5,16.88,0.05
2018,Ago,3197218,0.9,17.00,0.12
2018,Sep,3203646,0.2,17.00,0.01
2018,Oct,3226686,0.7,17.10,0.10
2018,Nov,3233736,0.2,17.11,0.01
2018,Dic,3255887,0.7,17.20,0.09
2019,Ene,3325466,2.1,17.54,0.34
2019,Feb,3331219,0.2,17.54,0.00
2019,Mar,3361981,0.9,17.68,0.13
2019,Abr,3369332,0.2,17.69,0.01
2019,May,3375904,0.2,17.70,0.01
2019,Jun,3399946,0.7,17.79,0.10
2019,Jul,3415503,0.5,17.85,0.05
2019,Ago,3430649,0.4,17.90,0.05
2019,Sep,3431672,0.0,17.88,-0.02
2019,Oct,3433857,0.1,17.86,-0.02
2019,Nov,3436120,0.1,17.85,-0.02
2019,Dic,3434402,0.0,17.81,-0.04
2020,Ene,3432721,0.0,17.78,-0.04
2020,Feb,3441647,0.3,17.79,0.02
2020,Mar,3488706,1.4,18.01,0.22
