id,e7sub
3,"Competencias Personales y Desarrollo"
11,"Educación"
20,"Artes y Humanidades sin mayor definición"
21,"Artes"
22,"Humanidades"
23,"Lenguajes"
31,"Ciencias Sociales y del Comportamiento"
32,"Periodismo e Información"
41,"Educación Comercial y Administración"
42,"Derecho"
48,"Programas Inter-disciplinarios que involucran Negocios, Admi"
50,"Ciencias Naturales, Matemáticas y Estadísticas sin mayor def"
51,"Ciencias Biológicas y Afines"
52,"Medio Ambiente"
53,"Ciencias Físicas"
54,"Matemáticas y Estadísticas"
61,"Tecnologías de la Información y la Comunicación (TIC)"
68,"Programas interdisciplinarios que involucran las Tecnologías"
71,"Ingeniería y Profesiones Afines"
72,"Industria y Producción"
73,"Arquitectura y Construcción"
80,"Agricultura, Silvicultura, Pesca y Veterinaria sin mayor def"
81,"Agricultura"
82,"Silvicultura"
83,"Pesca"
84,"Veterinaria"
91,"Salud"
92,"Bienestar"
101,"Servicios personales"
102,"Servicios de Higiene y Salud Ocupacional"
103,"Servicios de Seguridad"
104,"Servicios de Transportes"
999,"No responde"
