id,o7
1,"Consiguió trabajo que empezará pronto o iniciará pronto una"
2,"Está esperando resultado de gestiones ya emprendidas"
3,"No tiene con quien dejar a los niños"
4,"No tiene con quien dejar a adultos mayores"
5,"No tiene con quien dejar a adultos mayores"
6,"Está enfermo o tiene una discapacidad"
7,"Piensa que nadie le dará trabajo (porque no cuenta con la ca)"
8,"Las reglas, horarios y distancias de los trabajos no le acom"
9,"Ofrecen sueldos muy bajos"
10,"Quehaceres del hogar"
11,"Estudiante"
12,"Jubilado(a), pensionado(a) o montepiado(a)"
13,"Tiene otra fuente de ingreso (seguro de cesantía, mesadas, r"
14,"Se cansó de buscar o cree que no hay trabajo disponible"
15,"Busca cuando realmente lo necesita o tiene trabajo esporádico"
16,"No tiene interés en trabajar"
17,"Otra razón"
99,"No sabe/no responde"
