id,ecivil
1,Casado(a)
2,Conviviente o pareja sin acuerdo de unión civil
3,Conviviente civil (con acuerdo de unión civil)
4,Anulado(a)
5,Separado(a)
6,Divorciado(a)
7,Viudo(a)
8,Soltero(a)
9,No responde
