id,e6a
1,"Nunca asistió"
2,"Sala cuna"
3,"Jardín Infantil (Medio menor y Medio mayor)"
4,"Prekinder/Kinder (Transición menor y Transición Mayor)"
5,"Educación Especial (Diferencial)"
6,"Primaria o Preparatoria (Sistema Antiguo)"
7,"Educación Básica"
8,"Humanidaded (Sistema Antiguo)"
9,"Educación Media Científico-Humanista"
10,"Técnica, Comercial, Industrial o Normalista (Sistema Antiguo)"
11,"Educación Media Técnica Profesional"
12,"Técnico Nivel Superior Incompleto (Carreras 1 a 3 años)"
13,"Técnico Nivel Superior Completo (Carreras 1 a 3 años)"
14,"Profesional Incompleto (Carreras 4 o más años)"
15,"Profesional Completo (Carreras 4 o más años)"
16,"Postgrado Incompleto"
17,"Postgrado Completo"
99,"No sabe/no responde"
